Organisation Name,NACS Code,Organisation Type,Address1,Address2,Address3,Address4,Address5,PostCode,Telephone Number,Opening time,Value  (Opening time),Banding Classification  (Opening time),NHS.UK users rating,Value  (NHS.UK users rating),Banding Classification  (NHS.UK users rating),Car parking (Is there car parking at this organisation?)
Boots-Truro - River St,OP_5KT_11965__000001_TR12SJ,OPT,36 River Street,,,Truro,Cornwall,TR1 2SJ,Tel: 01872 223459, - ,,,No ratings yet Rate it yourself - /Services/opticians/LeaveReview/DefaultView.aspx?id=OP_5KT_11965__000001_TR12SJ,0,0,
Specsavers Opticians,OP_5KT_7567__000002_TR12SJ,OPT,33a River Street,Truro,Cornwall,,,TR1 2SJ,Tel: 01872 223818, - ,,,No ratings yet Rate it yourself - /Services/opticians/LeaveReview/DefaultView.aspx?id=OP_5KT_7567__000002_TR12SJ,0,0,
Vision Express UK Ltd,01-23183__000001_TR12RL,OPT,10 St Nicholas Street,10 St Nicholas Street,Truro,"Truro, Cornwall",,TR1 2RL,Tel: 01872 277747, - ,,,No ratings yet Rate it yourself - /Services/opticians/LeaveReview/DefaultView.aspx?id=01-23183__000001_TR12RL,0,0,
Ibuntu ,TP917_21_01_2019,OPT,,66 Lemon Street,,Truro,Cornwall,TR1 2PN,Tel: 01872 261 569, - ,,,No ratings yet Rate it yourself - /Services/opticians/LeaveReview/DefaultView.aspx?id=TP917_21_01_2019,0,0,
Standen Opticians,OP_5KT_11877__000001_TR12AA,OPT,2 Highshore House,New Bridge Street,Truro,Cornwall,,TR1 2AA,Tel: 01872 276644, - ,,,No ratings yet Rate it yourself - /Services/opticians/LeaveReview/DefaultView.aspx?id=OP_5KT_11877__000001_TR12AA,0,0,
Specsavers (Redruth),TP714,OPT,,70 Fore Street,,Redruth,,TR15 2AF,, - ,,,No ratings yet Rate it yourself - /Services/opticians/LeaveReview/DefaultView.aspx?id=TP714,0,0,
The Bond Street Optician,OP_5FM_4846__000001_TR152QB,OPT,6 Bond Street,Redruth,Cornwall,,,TR15 2QB,Tel: 01209 216900, - ,,,No ratings yet Rate it yourself - /Services/opticians/LeaveReview/DefaultView.aspx?id=OP_5FM_4846__000001_TR152QB,0,0,
Histed & Roberts Ltd,CO-3437__000003_TR108BH,OPT,96 Lower Market Street,,Penryn,Cornwall,,TR10 8BH,Tel: 01326 373837, - ,,,No ratings yet Rate it yourself - /Services/opticians/LeaveReview/DefaultView.aspx?id=CO-3437__000003_TR108BH,0,0,
Specsavers Opticians,5KT 2798__000001_TR71DJ,OPT,37 Bank Street,,,Newquay,,TR7 1DJ,Tel: 01637 854400, - ,,,No ratings yet Rate it yourself - /Services/opticians/LeaveReview/DefaultView.aspx?id=5KT 2798__000001_TR71DJ,0,0,
Varnals Opticians Ltd,OP_5KT_3947__000001_TR71DN,OPT,25 East Street,Newquay,Cornwall,,,TR7 1DN,Tel: 01637 872000, - ,,,No ratings yet Rate it yourself - /Services/opticians/LeaveReview/DefaultView.aspx?id=OP_5KT_3947__000001_TR71DN,0,0,
Specsavers Opticians,OP_5FM_13796__000002_TR148AA,OPT,4 Trelowarren Street,Camborne,Cornwall,,,TR14 8AA,Tel: 01209 710022, - ,,,No ratings yet Rate it yourself - /Services/opticians/LeaveReview/DefaultView.aspx?id=OP_5FM_13796__000002_TR148AA,0,0,
Alexander Miller Opticians,01-10188__000002_TR112AF,OPT,42 High Street,,Falmouth,Cornwall,,TR11 2AF,Tel: 01326 313092, - ,,,No ratings yet Rate it yourself - /Services/opticians/LeaveReview/DefaultView.aspx?id=01-10188__000002_TR112AF,0,0,
Specsavers Opticians,OP_5KT_7235__000002_TR113AT,OPT,28a Market Street,Falmouth,Cornwall,,,TR11 3AT,Tel: 01326 212733, - ,,,No ratings yet Rate it yourself - /Services/opticians/LeaveReview/DefaultView.aspx?id=OP_5KT_7235__000002_TR113AT,0,0,
Reynolds & Slater Opticians,TP9DN,OPT,,23-27 Berkeley Vale,,Falmouth,,TR11 3PJ,, - ,,,No ratings yet Rate it yourself - /Services/opticians/LeaveReview/DefaultView.aspx?id=TP9DN,0,0,
Vision Express (UK) Ltd,OP_5KT_13787__000001_TR113EF,OPT,46 Church Street,Falmouth,Cornwall,,,TR11 3EF,Tel: 01326 312448, - ,,,No ratings yet Rate it yourself - /Services/opticians/LeaveReview/DefaultView.aspx?id=OP_5KT_13787__000001_TR113EF,0,0,
Raison Opticians,C/0342/M,OPT,,26 Meneage Street,,Heston,,TR13 8AB,, - ,,,No ratings yet Rate it yourself - /Services/opticians/LeaveReview/DefaultView.aspx?id=C/0342/M,0,0,
FL & I Keast,OP_5FM_4588__000001_TR274DG,OPT,18 Commercial Road,Hayle,Cornwall,,,TR27 4DG,Tel: 01736 753145, - ,,,No ratings yet Rate it yourself - /Services/opticians/LeaveReview/DefaultView.aspx?id=OP_5FM_4588__000001_TR274DG,0,0,
Matthews Opticians,OP_5FM_10440__000001_TR138ER,OPT,39 Coinagehall Street,39 Coinagehall Street,Cornwall,Helston,,TR13 8ER,Tel: 01326 572172, - ,,,No ratings yet Rate it yourself - /Services/opticians/LeaveReview/DefaultView.aspx?id=OP_5FM_10440__000001_TR138ER,0,0,
Specsavers Opticians,OP_5KT_6991__000002_PL255PY,OPT,39 Fore Street,St. Austell,,Cornwall,,PL25 5PY,Tel: 01726 69633, - ,,,No ratings yet Rate it yourself - /Services/opticians/LeaveReview/DefaultView.aspx?id=OP_5KT_6991__000002_PL255PY,0,0,
Grant Reid Optometrist Ltd,OP_5KT_3763__000001_PL255AA,OPT,9 Grants Walk,St. Austell,Cornwall,,,PL25 5AA,Tel: 01726 73614, - ,,,No ratings yet Rate it yourself - /Services/opticians/LeaveReview/DefaultView.aspx?id=OP_5KT_3763__000001_PL255AA,0,0,
Boots-St Austell - Fore St,OP_5KT_11626__000001_PL255PY,OPT,29 Fore Street,,,St Austell,Cornwall,PL25 5EP,Tel: 01726 75615, - ,,,No ratings yet Rate it yourself - /Services/opticians/LeaveReview/DefaultView.aspx?id=OP_5KT_11626__000001_PL255PY,0,0,
Boots Opticians Professional Services Ltd,OP_5KT_85__000001_PL255LJ,OPT,55 Aylmer Square,St. Austell,Cornwall,,,PL25 5LJ,Tel: 01726 73302, - ,,,No ratings yet Rate it yourself - /Services/opticians/LeaveReview/DefaultView.aspx?id=OP_5KT_85__000001_PL255LJ,0,0,
Asda Stores Ltd,OP_5KT_14200__000001_PL254PR,OPT,Cromwell Road,,St Austell,Cornwall,,PL25 4PR,Tel: 01726 223812, - ,,,No ratings yet Rate it yourself - /Services/opticians/LeaveReview/DefaultView.aspx?id=OP_5KT_14200__000001_PL254PR,0,0,
Noakes Habermehl & Kerr Opticians,,OPT,,Chy-An-Gweal St Ives Road,,Carbis Bay,Cornwall,TR26 2RS,Tel: 01736 798495, - ,,,N/A - Data not available,,,
Sanders Opticians,OP_5KR_9297__000001_PL277DR,OPT,53a Molesworth Street,Wadebridge,Cornwall,,,PL27 7DR,Tel: 01208 812854, - ,,,No ratings yet Rate it yourself - /Services/opticians/LeaveReview/DefaultView.aspx?id=OP_5KR_9297__000001_PL277DR,0,0,
Reynolds & Slater Opticians,OP_5FM_9962__000001_TR182HZ,OPT,48 Market Jew Street,Penzance,Cornwall,Cornwall,,TR18 2HZ,Tel: 01736 366239, - ,,,No ratings yet Rate it yourself - /Services/opticians/LeaveReview/DefaultView.aspx?id=OP_5FM_9962__000001_TR182HZ,0,0,
Luke Pascoe Mobile Optician,01-17801__000001_PL231EN,OPT,10 Hill Hay Close,Fowey,St Austell,Cornwall,,PL23 1EN,Tel: 01726 833223, - ,,,No ratings yet Rate it yourself - /Services/opticians/LeaveReview/DefaultView.aspx?id=01-17801__000001_PL231EN,0,0,
Bradley Opticians Ltd,OP_5FM_13786__000001_TR182QT,OPT,16 The Terrace,Market Jew Street,Penzance,Cornwall,,TR18 2HR,Tel: 01736 363339, - ,,,No ratings yet Rate it yourself - /Services/opticians/LeaveReview/DefaultView.aspx?id=OP_5FM_13786__000001_TR182QT,0,0,
Boots-Penzance,OP_5FM_1884__000001_TR182HR,OPT,16A Market Jew Street,,,Penzance,Cornwall,TR18 2HR,Tel: 01736 363 068, - ,,,No ratings yet Rate it yourself - /Services/opticians/LeaveReview/DefaultView.aspx?id=OP_5FM_1884__000001_TR182HR,0,0,
Specsavers Opticians,OP_5FM_6390__000001_TR182HN,OPT,111 Market Jew Street,Penzance,Cornwall,,,TR18 2LE,Tel: 01736 369968, - ,,,No ratings yet Rate it yourself - /Services/opticians/LeaveReview/DefaultView.aspx?id=OP_5FM_6390__000001_TR182HN,0,0,
Specsavers Opticians,OP_5KR_2712__000001_PL312JB,OPT,51 Fore Street,Bodmin,Cornwall,,,PL31 2JB,Tel: 01208 72959, - ,,,No ratings yet Rate it yourself - /Services/opticians/LeaveReview/DefaultView.aspx?id=OP_5KR_2712__000001_PL312JB,0,0,
Boots-Bodmin,OP_5KR_205__000001_PL312HQ,OPT,12 Fore Street,,,Bodmin,Cornwall,PL31 2HQ,Tel: 01208 72815, - ,,,No ratings yet Rate it yourself - /Services/opticians/LeaveReview/DefaultView.aspx?id=OP_5KR_205__000001_PL312HQ,0,0,
P Storey Home Visiting Opticians,OP_5FM_13794__000001_TR208PN,OPT,Trannack Barn,Newbridge,Penzance,Cornwall,,TR20 8PN,Tel: 01736 331625, - ,,,No ratings yet Rate it yourself - /Services/opticians/LeaveReview/DefaultView.aspx?id=OP_5FM_13794__000001_TR208PN,0,0,
