Organisation Name,NACS Code,Organisation Type,Address1,Address2,Address3,Address4,Address5,PostCode,Telephone Number,Opening time,Value  (Opening time),Banding Classification  (Opening time),NHS.UK users rating,Value  (NHS.UK users rating),Banding Classification  (NHS.UK users rating),Car parking (Is there car parking at this organisation?)
P Storey Home Visiting Opticians,OP_5FM_13794__000001_TR208PN,OPT,Trannack Barn,Newbridge,Penzance,Cornwall,,TR20 8PN,Tel: 01736 331625, - ,,,No ratings yet Rate it yourself - /Services/opticians/LeaveReview/DefaultView.aspx?id=OP_5FM_13794__000001_TR208PN,0,0,
The Isles of Scilly Health Centre,TR21 0HE -1113,OPT,,King Edward Lane,,St Marys,,TR21 0HE,, - ,,,No ratings yet Rate it yourself - /Services/opticians/LeaveReview/DefaultView.aspx?id=TR21 0HE -1113,0,0,
Specsavers Opticians,OP_5FM_6390__000001_TR182HN,OPT,111 Market Jew Street,Penzance,Cornwall,,,TR18 2LE,Tel: 01736 369968, - ,,,No ratings yet Rate it yourself - /Services/opticians/LeaveReview/DefaultView.aspx?id=OP_5FM_6390__000001_TR182HN,0,0,
Bradley Opticians Ltd,OP_5FM_13786__000001_TR182QT,OPT,16 The Terrace,Market Jew Street,Penzance,Cornwall,,TR18 2HR,Tel: 01736 363339, - ,,,No ratings yet Rate it yourself - /Services/opticians/LeaveReview/DefaultView.aspx?id=OP_5FM_13786__000001_TR182QT,0,0,
Boots-Penzance,OP_5FM_1884__000001_TR182HR,OPT,16A Market Jew Street,,,Penzance,Cornwall,TR18 2HR,Tel: 01736 363 068, - ,,,1 rating Rate it yourself - /Services/opticians/LeaveReview/DefaultView.aspx?id=OP_5FM_1884__000001_TR182HR,,,
Reynolds & Slater Opticians,OP_5FM_9962__000001_TR182HZ,OPT,48 Market Jew Street,Penzance,Cornwall,Cornwall,,TR18 2HZ,Tel: 01736 366239, - ,,,2 ratings Rate it yourself - /Services/opticians/LeaveReview/DefaultView.aspx?id=OP_5FM_9962__000001_TR182HZ,,,
Noakes Habermehl & Kerr Opticians,,OPT,,Chy-An-Gweal St Ives Road,,Carbis Bay,Cornwall,TR26 2RS,Tel: 01736 798495, - ,,,N/A - Data not available,,,
FL & I Keast,OP_5FM_4588__000001_TR274DG,OPT,18 Commercial Road,Hayle,Cornwall,,,TR27 4DG,Tel: 01736 753145, - ,,,No ratings yet Rate it yourself - /Services/opticians/LeaveReview/DefaultView.aspx?id=OP_5FM_4588__000001_TR274DG,0,0,
