Organisation Name,NACS Code,Organisation Type,Address1,Address2,Address3,Address4,Address5,PostCode,Telephone Number,Opening time,Value  (Opening time),Banding Classification  (Opening time),NHS.UK users rating,Value  (NHS.UK users rating),Banding Classification  (NHS.UK users rating),Car parking (Is there car parking at this organisation?)
Jackson & Co Eye Care,K6W2G,OPT,,69 High Street,,New Romney,Kent,TN28 8AZ,Tel: 01797 364050, - ,,,No ratings yet Rate it yourself - /Services/opticians/LeaveReview/DefaultView.aspx?id=K6W2G,0,0,
Robert Jardine Opticians,OP_5LP_2760__000001_TN288AZ,OPT,,69 High Street,,New Romney,Kent,TN28 8AZ,Tel: 07973 64050, - ,,,7 ratings Rate it yourself - /Services/opticians/LeaveReview/DefaultView.aspx?id=OP_5LP_2760__000001_TN288AZ,,,
Archaeoptix,D2I3A,OPT,,"50 High Street, Hythe",,Kent,,CT21 5AT,, - ,,,No ratings yet Rate it yourself - /Services/opticians/LeaveReview/DefaultView.aspx?id=D2I3A,0,0,
David Snow Opticians,OP_5LP_13636__000001_CT215AT,OPT,,12 High Street,Hythe,Kent,,CT21 5AT,Tel: 01303 263770, - ,,,No ratings yet Rate it yourself - /Services/opticians/LeaveReview/DefaultView.aspx?id=OP_5LP_13636__000001_CT215AT,0,0,
Cargills (Hythe),OP_5LP_10148__000001_CT215JL,OPT,,139 High Street,,Hythe,Kent,CT21 5JL,Tel: 01303 266458, - ,,,4 ratings Rate it yourself - /Services/opticians/LeaveReview/DefaultView.aspx?id=OP_5LP_10148__000001_CT215JL,,,
"Wilson, Wilson & Hancock",OP_5FH_2561__000001_TN317AN,OPT,Wall Cottage,63 Cinque Ports Street,,Rye,,TN31 7AN,Tel: 01797 223700, - ,,,1 rating Rate it yourself - /Services/opticians/LeaveReview/DefaultView.aspx?id=OP_5FH_2561__000001_TN317AN,,,
Tesco Opticians (Ashford),TN24 0YE,OPT,,"Hythe Road, Wilesborough",,Ashford,Kent,TN24 0YE,Tel: 0345 677 9008, - ,,,No ratings yet Rate it yourself - /Services/opticians/LeaveReview/DefaultView.aspx?id=TN24 0YE,0,0,
Cargills (Folkestone),OP_5LP_8591__000002_CT202BW,OPT,,122 Sandgate Road,,Folkestone,,CT20 2BW,Tel: 01303 254471, - ,,,No ratings yet Rate it yourself - /Services/opticians/LeaveReview/DefaultView.aspx?id=OP_5LP_8591__000002_CT202BW,0,0,
Chris Adams Opticians,OP_5LP_9658__000001_CT202AY,OPT,,17 Cheriton Place,,Folkestone,,CT20 2AY,Tel: 01303 246105, - ,,,No ratings yet Rate it yourself - /Services/opticians/LeaveReview/DefaultView.aspx?id=OP_5LP_9658__000001_CT202AY,0,0,
 LansEyecare Limited,01-19975,OPT,,56 Swaffer way,,Ashford,,TN23 5JE,Tel: 02081338524, - ,,,No ratings yet Rate it yourself - /Services/opticians/LeaveReview/DefaultView.aspx?id=01-19975,0,0,
Brownbills,OP_5LL_13616__000001_TN231DQ,OPT,Cecil House,Norwood Street,Ashford,Kent,,TN23 1QT,Tel: 01233 625360, - ,,,3 ratings Rate it yourself - /Services/opticians/LeaveReview/DefaultView.aspx?id=OP_5LL_13616__000001_TN231DQ,,,
I-Zone  Eyewear,OP_5LL_13622__000001_TN231YA,OPT,,18a Bank Street,,Ashford,Kent,TN23 1BZ,Tel: 01233 633030, - ,,,No ratings yet Rate it yourself - /Services/opticians/LeaveReview/DefaultView.aspx?id=OP_5LL_13622__000001_TN231YA,0,0,
Specsavers (Folkestone) ,5QA:OO1856,OPT,,Bouverie Place,,Folkestone,Kent,CT20 1AU,Tel: 01303 212010, - ,,,5 ratings Rate it yourself - /Services/opticians/LeaveReview/DefaultView.aspx?id=5QA:OO1856,,,
Specsavers (Ashford),OP_5LL_11659__000001_TN231YD,OPT,,36 County Square,,Ashford,,TN23 1YD,Tel: 01233 629999, - ,,,3 ratings Rate it yourself - /Services/opticians/LeaveReview/DefaultView.aspx?id=OP_5LL_11659__000001_TN231YD,,,
Vision Express,Q6M7L,OPT,,58 High Street,,Ashford,Kent,TN24 8TB,Tel: 01233 636030, - ,,,No ratings yet Rate it yourself - /Services/opticians/LeaveReview/DefaultView.aspx?id=Q6M7L,0,0,
Vision Express (Ashford),OP_5LL_13091__000001_TN248TD,OPT,,58 High Street,,Ashford,,TN24 8TB,Tel: 01233 636030, - ,,,No ratings yet Rate it yourself - /Services/opticians/LeaveReview/DefaultView.aspx?id=OP_5LL_13091__000001_TN248TD,0,0,
Boots-Ashford - High St,OP_5LL_12206__000002_TN248TB,OPT,,56 High Street,,Ashford,Kent,TN24 8TB,Tel: 01233 620414, - ,,,No ratings yet Rate it yourself - /Services/opticians/LeaveReview/DefaultView.aspx?id=OP_5LL_12206__000002_TN248TB,0,0,
Boots-Folkestone - Sandgate Rd (in Boots UK),OP_5LP_7308__000002_CT201DP,OPT,24-26 Sandgate Road,,,Folkestone,Kent,CT20 1DP,Tel: 01303 241 474, - ,,,No ratings yet Rate it yourself - /Services/opticians/LeaveReview/DefaultView.aspx?id=OP_5LP_7308__000002_CT201DP,0,0,
Cargills (Ashford),OP_5LL_4536__000001_TN248LF,OPT,,7 North Street,,Ashford,,TN24 8LF,Tel: 01233 620597, - ,,,No ratings yet Rate it yourself - /Services/opticians/LeaveReview/DefaultView.aspx?id=OP_5LL_4536__000001_TN248LF,0,0,
Eye Folk,TP9D8,OPT,,20 Guidhall Street,,Folkestone,Kent,CT20 1DZ,Tel: 01303 252345, - ,,,No ratings yet Rate it yourself - /Services/opticians/LeaveReview/DefaultView.aspx?id=TP9D8,0,0,
Specsavers Opticians (West Park Farm),TP992,OPT,,Sainsbury's West Park Farm,Park Farm Road,Folkestone,Kent,CT19 5GA,Tel: 01303 256195, - ,,,No ratings yet Rate it yourself - /Services/opticians/LeaveReview/DefaultView.aspx?id=TP992,0,0,
"Wilson, Wilson & Hancock",OP_5LL_1325__000001_TN306BN,OPT,,7 High Street,,Tenterden,,TN30 6BN,Tel: 01580 762069, - ,,,No ratings yet Rate it yourself - /Services/opticians/LeaveReview/DefaultView.aspx?id=OP_5LL_1325__000001_TN306BN,0,0,
Specsavers (Tenterden),T9E3O,OPT,,59 High Street,,Tenterden,,TN30 6BD,Tel: 01589 392393, - ,,,No ratings yet Rate it yourself - /Services/opticians/LeaveReview/DefaultView.aspx?id=T9E3O,0,0,
Vision Express (Tenterden),OP_5LL_10430__000002_TN306AU,OPT,,72 High Street,,Tenterden,Kent,TN30 6AU,Tel: 01580 763 267, - ,,,No ratings yet Rate it yourself - /Services/opticians/LeaveReview/DefaultView.aspx?id=OP_5LL_10430__000002_TN306AU,0,0,
Specsavers Opticians (Bybrook),OPT_TN248YN_1,OPT,,Sainsbury's Supermarket,,Ashford,,TN24 8YN,, - ,,,No ratings yet Rate it yourself - /Services/opticians/LeaveReview/DefaultView.aspx?id=OPT_TN248YN_1,0,0,
Specsavers Opticians (Bybrook),OPT_TN248YN_2,OPT,,Sainsbury's Supermarket,Simone Weil Avenue,Ashford,Kent,TN24 8YN,Tel: 01233 622055, - ,,,No ratings yet Rate it yourself - /Services/opticians/LeaveReview/DefaultView.aspx?id=OPT_TN248YN_2,0,0,
Claire Reed Optician,OP_5FH_9565__000001_TN316LB,OPT,Dixter Road,Northiam,Rye,East Sussex,,TN31 6LB,Tel: 01797 252411, - ,,,No ratings yet Rate it yourself - /Services/opticians/LeaveReview/DefaultView.aspx?id=OP_5FH_9565__000001_TN316LB,0,0,
Boots-Hastings - Kings Walk,OP_5FJ_6818__000003_TN341PH,OPT,"Kings Walk, Priory Meadows",,,Hastings,East Sussex,TN34 1PH,Tel: 01424 718365, - ,,,1 rating Rate it yourself - /Services/opticians/LeaveReview/DefaultView.aspx?id=OP_5FJ_6818__000003_TN341PH,,,
Specsavers Opticians,OP_5FJ_4361__000002_TN341PH,OPT,Unit Qr40 Priory Meadow Shopping Centre,Queens Road,Hastings,East Sussex,,TN34 1PH,Tel: 01424 717900, - ,,,No ratings yet Rate it yourself - /Services/opticians/LeaveReview/DefaultView.aspx?id=OP_5FJ_4361__000002_TN341PH,0,0,
Vision Express,OP_5P8_1881__000001_TN341QR,OPT,3 Priory Meadow Shopping Centre,Queens Road,Hastings,East Sussex,,TN34 1PH,Tel: 01424 720957, - ,,,No ratings yet Rate it yourself - /Services/opticians/LeaveReview/DefaultView.aspx?id=OP_5P8_1881__000001_TN341QR,0,0,
"Wilson, Wilson & Hancock",OP_5FJ_6655__000001_TN341DJ,OPT,12-14 Cambridge Road,,Hastings,East Sussex,,TN34 1DJ,Tel: 01424 421717, - ,,,2 ratings Rate it yourself - /Services/opticians/LeaveReview/DefaultView.aspx?id=OP_5FJ_6655__000001_TN341DJ,,,
Hastings Sedlescombe Road Specsavers Limited,Y1M6U,OPT,,"Sainsburys Sedlescombe Road, John Macadam Way",,St. Leonards-on-Sea,East Sussex,TN37 7SQ,Tel: 01424 619730, - ,,,No ratings yet Rate it yourself - /Services/opticians/LeaveReview/DefaultView.aspx?id=Y1M6U,0,0,
Barracloughs the Opticians,9003,OPT,,23 Sedlescombe Road North,,"Silver Hill, St Leonards on Sea",,TN37 7DA,, - ,,,No ratings yet Rate it yourself - /Services/opticians/LeaveReview/DefaultView.aspx?id=9003,0,0,
Biggs Optometrists (Dover),OP_5LN_13645__000001_CT161DP,OPT,,7 High Street,,Dover,Kent,CT16 1DP,Tel: 01304 201000, - ,,,No ratings yet Rate it yourself - /Services/opticians/LeaveReview/DefaultView.aspx?id=OP_5LN_13645__000001_CT161DP,0,0,
N J Bailey Opticians,OP_5LN_2935__000002_CT161DR,OPT,20 High Street,20 High Street,Dover,Dover,,CT16 1DR,Tel: 01304 206665, - ,,,3 ratings Rate it yourself - /Services/opticians/LeaveReview/DefaultView.aspx?id=OP_5LN_2935__000002_CT161DR,,,
Specsavers (Dover),OP_5LN_3851__000001_CT161BD,OPT,Unit 2,11-16 Biggin Street,,Dover,,CT16 1BD,Tel: 01304 242020, - ,,,2 ratings Rate it yourself - /Services/opticians/LeaveReview/DefaultView.aspx?id=OP_5LN_3851__000001_CT161BD,,,
Tesco Opticians,10006__000002_TN389RB,OPT,Church Wood Drive,,St Leonards-on-Sea,East Sussex,,TN38 9RB,Tel: 01424 789438, - ,,,No ratings yet Rate it yourself - /Services/opticians/LeaveReview/DefaultView.aspx?id=10006__000002_TN389RB,0,0,
Headcorn Eye Centre,OPT_TN279NH_1,OPT,,25 High Street,,Headcorn,Kent,TN27 9NH,Tel: 01622 890044, - ,,,1 rating Rate it yourself - /Services/opticians/LeaveReview/DefaultView.aspx?id=OPT_TN279NH_1,,,
Tesco Opticians (Dover),CT16 3EH,OPT,,Tesco White Cliff Park,Whitfield,Dover,Kent,CT16 3PS,Tel: 0345 601 3479, - ,,,1 rating Rate it yourself - /Services/opticians/LeaveReview/DefaultView.aspx?id=CT16 3EH,,,
Linda Pope Optician,OPT_TN184EY_1,OPT,,"Venture House, Rye Road",,Hawkhurst,Kent,TN18 4EY,Tel: 01580 753744, - ,,,No ratings yet Rate it yourself - /Services/opticians/LeaveReview/DefaultView.aspx?id=OPT_TN184EY_1,0,0,
Peter Jones Opticians,OP_5L2_1737__000001_TN173HE,OPT,25 Stone Street,Cranbrook,Kent,,,TN17 3HE,Tel: 01580 712254, - ,,,1 rating Rate it yourself - /Services/opticians/LeaveReview/DefaultView.aspx?id=OP_5L2_1737__000001_TN173HE,,,
The Hammond Optical Practice,OP_5L2_6686__000001_TN173RB,OPT,,High Street,,Cranbrook,Kent,TN17 3RB,Tel: 01580 715008, - ,,,No ratings yet Rate it yourself - /Services/opticians/LeaveReview/DefaultView.aspx?id=OP_5L2_6686__000001_TN173RB,0,0,
Green & Elliott Optometrists,OP_5FH_1292__000001_TN330EG,OPT,,28 Mount Street,,Battle,,TN33 0EG,Tel: 01424 773487, - ,,,No ratings yet Rate it yourself - /Services/opticians/LeaveReview/DefaultView.aspx?id=OP_5FH_1292__000001_TN330EG,0,0,
Barracloughs the Opticians,OP_5FH_3721__000001_TN330AG,OPT,,64A High Street,,Battle,,TN33 0AG,Tel: 01424 772725, - ,,,No ratings yet Rate it yourself - /Services/opticians/LeaveReview/DefaultView.aspx?id=OP_5FH_3721__000001_TN330AG,0,0,
Peter Jones Opticians,OP_5L2_2643__000001_TN120AY,OPT,5 Church Hill,Staplehurst,Tonbridge,,,TN12 0AX,Tel: 01580 892269, - ,,,No ratings yet Rate it yourself - /Services/opticians/LeaveReview/DefaultView.aspx?id=OP_5L2_2643__000001_TN120AY,0,0,
Boots-Canterbury,OP_5LM_6036__000001_CT12TJ,OPT,12 Gravel Walk,,Whitefriars,Canterbury,Kent,CT1 2TF,Tel: 01227 462106, - ,,,1 rating Rate it yourself - /Services/opticians/LeaveReview/DefaultView.aspx?id=OP_5LM_6036__000001_CT12TJ,,,
Specsavers (Canterbury),OP_5LM_14069__000001_CT12SP,OPT,7 Rose Lane,Whitefriars,,Canterbury,Kent,CT1 2SJ,Tel: 01227 811580, - ,,,3 ratings Rate it yourself - /Services/opticians/LeaveReview/DefaultView.aspx?id=OP_5LM_14069__000001_CT12SP,,,
Vision Express (Canterbury),TP74K,OPT,,"Unit 39, Whitefriars (Unit 2, 6/8 Rose Lane",,Canterbury,,CT1 2SJ,Tel: 01227 763930, - ,,,No ratings yet Rate it yourself - /Services/opticians/LeaveReview/DefaultView.aspx?id=TP74K,0,0,
M&S Opticians,X2J5U,OPT,,4 St George's Street,,Canterbury,Kent,CT1 2SR,Tel: 01227936464, - ,,,23 ratings Rate it yourself - /Services/opticians/LeaveReview/DefaultView.aspx?id=X2J5U,,,
Cargills (Canterbury),OP_5LM_4537__000001_CT12BE,OPT,,59 St. Peters Street,,Canterbury,,CT1 2BE,Tel: 01227 766670, - ,,,No ratings yet Rate it yourself - /Services/opticians/LeaveReview/DefaultView.aspx?id=OP_5LM_4537__000001_CT12BE,0,0,
David Grimes Opticians,OP_5LM_1373__000001_CT12BG,OPT,,44 St. Peters Street,,Canterbury,,CT1 2BG,Tel: 01227 463341, - ,,,No ratings yet Rate it yourself - /Services/opticians/LeaveReview/DefaultView.aspx?id=OP_5LM_1373__000001_CT12BG,0,0,
Pybus Optometrists,OP_5LM_4443__000001_CT12DY,OPT,,5 Palace Street,,Canterbury,,CT1 2DY,Tel: 01227 760501, - ,,,2 ratings Rate it yourself - /Services/opticians/LeaveReview/DefaultView.aspx?id=OP_5LM_4443__000001_CT12DY,,,
Asda Opticians (Canterbury),00291__000001_CT11BU,OPT,Asda Stores,Sturry Road,Canterbury,Kent,,CT1 1DG,Tel: 01227 378995, - ,,,1 rating Rate it yourself - /Services/opticians/LeaveReview/DefaultView.aspx?id=00291__000001_CT11BU,,,
Vision Express,OP_5FH_9524__000001_TN401BD,OPT,43 Devonshire Road,,Bexhill-on-Sea,,,TN40 1BD,Tel: 01424 219306, - ,,,No ratings yet Rate it yourself - /Services/opticians/LeaveReview/DefaultView.aspx?id=OP_5FH_9524__000001_TN401BD,0,0,
Specsavers,OP_5P8_2552__000001_TN401DX,OPT,6 Western Road,,Bexhill On Sea,East Sussex,,TN40 1DX,Tel: 01424 739110, - ,,,No ratings yet Rate it yourself - /Services/opticians/LeaveReview/DefaultView.aspx?id=OP_5P8_2552__000001_TN401DX,0,0,
Barracloughs the Opticians,OP_5FH_12491__000001_TN401DT,OPT,,41 Western Road,,Bexhill-on-Sea,,TN40 1DT,Tel: 01424 219543, - ,,,No ratings yet Rate it yourself - /Services/opticians/LeaveReview/DefaultView.aspx?id=OP_5FH_12491__000001_TN401DT,0,0,
Green & Elliott Optometrists,OP_5FH_2952__000001_TN393JE,OPT,,36 Sackville Road,,Bexhill-on-Sea,,TN39 3JE,Tel: 01424 212544, - ,,,No ratings yet Rate it yourself - /Services/opticians/LeaveReview/DefaultView.aspx?id=OP_5FH_2952__000001_TN393JE,0,0,
Optima Opticians,O6Y0N,OPT,,4 Jacob Yard,Preston Street,Faversham,Kent,ME13 8NY,Tel: 01795 531885, - ,,,No ratings yet Rate it yourself - /Services/opticians/LeaveReview/DefaultView.aspx?id=O6Y0N,0,0,
Specsavers (Faversham),OPT_ME138NS_1,OPT,,1 Preston Street,,Faversham,Kent,ME13 8NS,Tel: 01795 538319, - ,,,2 ratings Rate it yourself - /Services/opticians/LeaveReview/DefaultView.aspx?id=OPT_ME138NS_1,,,
John High Opticians (Faversham),OP_5LN_3423__000001_ME137AA,OPT,,8 Market Street,,Faversham,,ME13 7AA,Tel: 01795 532803, - ,,,4 ratings Rate it yourself - /Services/opticians/LeaveReview/DefaultView.aspx?id=OP_5LN_3423__000001_ME137AA,,,
Simply Vision Opticians,X5N3G,OPT,,26 Cooden Sea Road,,Bexhill-on-Sea,,TN39 4SJ,, - ,,,No ratings yet Rate it yourself - /Services/opticians/LeaveReview/DefaultView.aspx?id=X5N3G,0,0,
Specsavers (Deal),00319__000003_CT147AA,OPT,,13 High Street,,Deal,Kent,CT14 7AA,Tel: 01304 382420, - ,,,No ratings yet Rate it yourself - /Services/opticians/LeaveReview/DefaultView.aspx?id=00319__000003_CT147AA,0,0,
Boots-Deal,5QA:OO163I,OPT,26-28 High Street,,,Deal,Kent,CT14 7AE,Tel: 01304 375 794, - ,,,No ratings yet Rate it yourself - /Services/opticians/LeaveReview/DefaultView.aspx?id=5QA:OO163I,0,0,
Biggs Optometrists (Deal),OP_5LN_7840__000001_CT146HE,OPT,,68 High Street,,Deal,,CT14 6HE,Tel: 01304 381330, - ,,,1 rating Rate it yourself - /Services/opticians/LeaveReview/DefaultView.aspx?id=OP_5LN_7840__000001_CT146HE,,,
W & K Pope ,OP_5L4_9234__000001_ME104DW,OPT,The Oast Business Centre,Office 4C,62 Bell Road,Sittingbourne,Kent,ME10 4HE,Tel: 01795 470507, - ,,,No ratings yet Rate it yourself - /Services/opticians/LeaveReview/DefaultView.aspx?id=OP_5L4_9234__000001_ME104DW,0,0,
R & J Moore (Sandwich),OP_5LN_8813__000001_CT139BJ,OPT,,16a King Street,,Sandwich,,CT13 9BJ,Tel: 01304 614322, - ,,,No ratings yet Rate it yourself - /Services/opticians/LeaveReview/DefaultView.aspx?id=OP_5LN_8813__000001_CT139BJ,0,0,
Vision Express (Maidstone),OP_5L2_6952__000001_ME156AS,OPT,346-348 Dukes Walk,Chequers Centre,Maidstone,Kent,,ME15 6AS,Tel: 01622 678123, - ,,,No ratings yet Rate it yourself - /Services/opticians/LeaveReview/DefaultView.aspx?id=OP_5L2_6952__000001_ME156AS,0,0,
Boots-Maidstone - King St,OP_5L2_195__000002_ME141BW,OPT,56-62 King Street,,Kent,Maidstone,,ME14 1BW,Tel: 01622 762337, - ,,,No ratings yet Rate it yourself - /Services/opticians/LeaveReview/DefaultView.aspx?id=OP_5L2_195__000002_ME141BW,0,0,
William J Wilkinson (Maidstone),OP_5L2_2043__000001_ME156JJ,OPT,50 Gabriels Hill,,Kent,Maidstone,,ME15 6JJ,Tel: 01622 677424, - ,,,No ratings yet Rate it yourself - /Services/opticians/LeaveReview/DefaultView.aspx?id=OP_5L2_2043__000001_ME156JJ,0,0,
Tinsons ,OP_5L2_760__000001_ME141TG,OPT,9 Middle Row,,Kent,Maidstone,,ME14 1TG,Tel: 01622 686051, - ,,,No ratings yet Rate it yourself - /Services/opticians/LeaveReview/DefaultView.aspx?id=OP_5L2_760__000001_ME141TG,0,0,
Bayfields Opticians and Audiologists (Maidstone),I9V4Y,OPT,,6 Pudding Lane,,Maidstone,,ME14 1LN,Tel: 01622 758566, - ,,,No ratings yet Rate it yourself - /Services/opticians/LeaveReview/DefaultView.aspx?id=I9V4Y,0,0,
Specsavers (Maidstone),OPT_ME141QS_1,OPT,,21-25 Week Street,,Maidstone,Kent,ME14 1QS,Tel: 01622 663111, - ,,,No ratings yet Rate it yourself - /Services/opticians/LeaveReview/DefaultView.aspx?id=OPT_ME141QS_1,0,0,
Patrick Duff,OP_5L2_12575__000001_TN126EN,OPT,3 Commercial Road,Paddock Wood,Tonbridge,,,TN12 6EN,Tel: 01892 838608, - ,,,No ratings yet Rate it yourself - /Services/opticians/LeaveReview/DefaultView.aspx?id=OP_5L2_12575__000001_TN126EN,0,0,
Elaine M Yorwarth,00156__000001_TN126DP,OPT,70 Commercial Road,,Paddock Wood,Kent,,TN12 6DP,Tel: 01892 833017, - ,,,No ratings yet Rate it yourself - /Services/opticians/LeaveReview/DefaultView.aspx?id=00156__000001_TN126DP,0,0,
Eye 2 Eye,OP_5L2_11435__000002_ME160PU,OPT,Mid Kent Shopping Centre,Castle Road,Allington,Maidstone,Kent,ME16 0PU,Tel: 01622 672563, - ,,,4 ratings Rate it yourself - /Services/opticians/LeaveReview/DefaultView.aspx?id=OP_5L2_11435__000002_ME160PU,,,yes
Specsavers Opticians,OPT_ME207NA_2,OPT,,Sainsburys Supermarket,"Quarry Wood, Mills road",Aylesford,Kent,ME20 7NA,Tel: 01622 797200, - ,,,No ratings yet Rate it yourself - /Services/opticians/LeaveReview/DefaultView.aspx?id=OPT_ME207NA_2,0,0,
Kent Eye Care Ltd,NKCCKNCK,OPT,Kent Eye Care Independent Specialist Optometrists & Opticians,786 London Road,,"Larkfield, Aylesford",Kent,ME20 6BE,Tel: 01732 873378, - ,,,1 rating Rate it yourself - /Services/opticians/LeaveReview/DefaultView.aspx?id=NKCCKNCK,,,no
Kings Hill Opticians,00325__000001_ME194AU,OPT,Liberty Square,,West Malling,Kent,,ME19 4AU,Tel: 01732 875544, - ,,,17 ratings Rate it yourself - /Services/opticians/LeaveReview/DefaultView.aspx?id=00325__000001_ME194AU,,,
Specsavers (Ramsgate),OPT_CT110QW_1,OPT,,37 High Street,,Ramsgate,,CT11 0QW,Tel: 01843 853856, - ,,,1 rating Rate it yourself - /Services/opticians/LeaveReview/DefaultView.aspx?id=OPT_CT110QW_1,,,
Tesco Optician (Lunsford Park),ME206RJ060716,OPT,,Lunsford Park,,Larkfield,,ME20 6RJ,Tel: 0345 601 3479, - ,,,No ratings yet Rate it yourself - /Services/opticians/LeaveReview/DefaultView.aspx?id=ME206RJ060716,0,0,
R & J Moore (Ramsgate),OP_5LN_3027__000001_CT119DZ,OPT,,35 Queens Street,,Ramsgate,,CT11 9DZ,Tel: 01843 593027, - ,,,1 rating Rate it yourself - /Services/opticians/LeaveReview/DefaultView.aspx?id=OP_5LN_3027__000001_CT119DZ,,,
West Malling Opticians ,OP_5L2_7653__000001_ME196QR,OPT,32 High Street,,Kent,West Malling,,ME19 6QR,Tel: 01732 841403, - ,,,No ratings yet Rate it yourself - /Services/opticians/LeaveReview/DefaultView.aspx?id=OP_5L2_7653__000001_ME196QR,0,0,
Buchanan Optometrists,OP_5L2_663__000001_ME65AG,OPT,Buchanan House,56 Malling Road,,Snodland,Kent,ME6 5NB,Tel: 01634 757227, - ,,,20 ratings Rate it yourself - /Services/opticians/LeaveReview/DefaultView.aspx?id=OP_5L2_663__000001_ME65AG,,,yes
The Village Optician,OPT_ME65NJ_1,OPT,,4 Holborough Road,,Snodland,,ME6 5NJ,Tel: 01634 240090, - ,,,No ratings yet Rate it yourself - /Services/opticians/LeaveReview/DefaultView.aspx?id=OPT_ME65NJ_1,0,0,
