Organisation Name,NACS Code,Organisation Type,Address1,Address2,Address3,Address4,Address5,PostCode,Telephone Number,Opening time,Value  (Opening time),Banding Classification  (Opening time),NHS.UK users rating,Value  (NHS.UK users rating),Banding Classification  (NHS.UK users rating),Car parking (Is there car parking at this organisation?)
Borough Green Opticians,OP_5FF_10481__000002_TN158BT,OPT,25 High Street,Borough Green,Sevenoaks,Kent,,TN15 8BT,Tel: 01732 884558, - ,,,No ratings yet Rate it yourself - /Services/opticians/LeaveReview/DefaultView.aspx?id=OP_5FF_10481__000002_TN158BT,0,0,
Portobello Eyecare Ltd,K8A7B,OPT,,"3 Portobello Parade, Fawkham Road",,"West Kingsdown, Kent",,TN15 6JP,, - ,,,No ratings yet Rate it yourself - /Services/opticians/LeaveReview/DefaultView.aspx?id=K8A7B,0,0,
William J Wilkinson (Sevenoaks),OP_5FF_3280__000001_TN131UX,OPT,143 High Street,,Kent,Sevenoaks,,TN13 1UX,Tel: 01732 453137, - ,,,No ratings yet Rate it yourself - /Services/opticians/LeaveReview/DefaultView.aspx?id=OP_5FF_3280__000001_TN131UX,0,0,
Boots-Sevenoaks,OP_5FF_223__000001_TN131LU,OPT,110 High Street,,,Sevenoaks,Kent,TN13 1LU,Tel: 01732 465989, - ,,,No ratings yet Rate it yourself - /Services/opticians/LeaveReview/DefaultView.aspx?id=OP_5FF_223__000001_TN131LU,0,0,
Eyelines,OPT_TN131LP_1,OPT,,88 High Street,,Sevenoaks,,TN13 1LP,Tel: 01732 460317, - ,,,No ratings yet Rate it yourself - /Services/opticians/LeaveReview/DefaultView.aspx?id=OPT_TN131LP_1,0,0,
Leslie Warren Optician,OP_5FF_4538__000002_TN131LP,OPT,Leslie Warren Opticians,82 High Street,,Sevenoaks,Kent,TN13 1LP,Tel: 01732 452135, - ,,,No ratings yet Rate it yourself - /Services/opticians/LeaveReview/DefaultView.aspx?id=OP_5FF_4538__000002_TN131LP,0,0,
Specsavers (Sevenoaks),OPT_TN131LE_1,OPT,,93 High Street,,Sevenoaks,,TN13 1LE,Tel: 01732 459588, - ,,,No ratings yet Rate it yourself - /Services/opticians/LeaveReview/DefaultView.aspx?id=OPT_TN131LE_1,0,0,
Scrivens Opticians (Sevenoaks),OP_5FF_11111__000001_TN131JF,OPT,73a/73b High Street,,Kent,Sevenoaks,,TN13 1LD,Tel: 01732 454558, - ,,,No ratings yet Rate it yourself - /Services/opticians/LeaveReview/DefaultView.aspx?id=OP_5FF_11111__000001_TN131JF,0,0,
Day Lewis Opticians (Riverhead),OP_5FF_8001__000001_TN132BH,OPT,1 London Road,,Sevenoaks,Riverhead,,TN13 2BH,Tel: 01732 451039, - ,,,No ratings yet Rate it yourself - /Services/opticians/LeaveReview/DefaultView.aspx?id=OP_5FF_8001__000001_TN132BH,0,0,
Kings Hill Opticians,00325__000001_ME194AU,OPT,Liberty Square,,West Malling,Kent,,ME19 4AU,Tel: 01732 875544, - ,,,No ratings yet Rate it yourself - /Services/opticians/LeaveReview/DefaultView.aspx?id=00325__000001_ME194AU,0,0,
West Malling Opticians ,OP_5L2_7653__000001_ME196QR,OPT,32 High Street,,Kent,West Malling,,ME19 6QR,Tel: 01732 841403, - ,,,No ratings yet Rate it yourself - /Services/opticians/LeaveReview/DefaultView.aspx?id=OP_5L2_7653__000001_ME196QR,0,0,
Osborne Harle,OP_5FF_397__000003_TN104AE,OPT,1-3 Martin Hardie Way,Tonbridge,,Kent,,TN10 4AE,Tel: 01732 368678, - ,,,No ratings yet Rate it yourself - /Services/opticians/LeaveReview/DefaultView.aspx?id=OP_5FF_397__000003_TN104AE,0,0,yes
Rowland Opticians,OP_5CM_2066__000002_DA37QA,OPT,,79 Station Road,Kent,Longfield,,DA3 7QA,Tel: 01474 702125, - ,,,No ratings yet Rate it yourself - /Services/opticians/LeaveReview/DefaultView.aspx?id=OP_5CM_2066__000002_DA37QA,0,0,
William J Wilkinson (Tonbridge),OP_5FF_2040__000001_TN91AP,OPT,90 High Street,,Kent,Tonbridge,,TN9 1AP,Tel: 01732 353803, - ,,,No ratings yet Rate it yourself - /Services/opticians/LeaveReview/DefaultView.aspx?id=OP_5FF_2040__000001_TN91AP,0,0,
Bansal Opticians ,OPT_TN91RE_1,OPT,,Home Visits,,Kent and Medway,Kent,TN9 1RE,Tel: 020 8470 1133, - ,,,No ratings yet Rate it yourself - /Services/opticians/LeaveReview/DefaultView.aspx?id=OPT_TN91RE_1,0,0,
Complete Community Care Kent Ltd,OPT_TN91RE_2,OPT,,Home Visits,,Kent,,TN9 1RE,Tel: 01732 458 424, - ,,,No ratings yet Rate it yourself - /Services/opticians/LeaveReview/DefaultView.aspx?id=OPT_TN91RE_2,0,0,
Crayford Optical Centre,OPT_TN91RE_3,OPT,,Home Visits,,Kent,,TN9 1RE,Tel: 01322 557 700, - ,,,No ratings yet Rate it yourself - /Services/opticians/LeaveReview/DefaultView.aspx?id=OPT_TN91RE_3,0,0,
Kent Eye Care Ltd,NKCCKNCK,OPT,Kent Eye Care Independent Specialist Optometrists & Opticians,786 London Road,,"Larkfield, Aylesford",Kent,ME20 6BE,Tel: 01732 873378, - ,,,No ratings yet Rate it yourself - /Services/opticians/LeaveReview/DefaultView.aspx?id=NKCCKNCK,0,0,no
Boots-Tonbridge,OP_5FF_3325__000002_TN91SD,OPT,59 High Street,,,Tonbridge,Kent,TN9 1SD,Tel: 01732 357565, - ,,,No ratings yet Rate it yourself - /Services/opticians/LeaveReview/DefaultView.aspx?id=OP_5FF_3325__000002_TN91SD,0,0,
Specsavers (Tonbridge),00289__000001_TN91SQ,OPT,15 High Street,,Tonbridge,Kent,,TN9 1SQ,Tel: 01732 370480, - ,,,No ratings yet Rate it yourself - /Services/opticians/LeaveReview/DefaultView.aspx?id=00289__000001_TN91SQ,0,0,
Tesco Optician (Lunsford Park),ME206RJ060716,OPT,,Lunsford Park,,Larkfield,,ME20 6RJ,Tel: 0345 601 3479, - ,,,No ratings yet Rate it yourself - /Services/opticians/LeaveReview/DefaultView.aspx?id=ME206RJ060716,0,0,
Scrivens Opticians (Tonbridge),OP_5FF_13081__000001_TN91TE,OPT,8 The Pavilion,High Street,Tonbridge,Kent,,TN9 1TE,Tel: 01732 352565, - ,,,No ratings yet Rate it yourself - /Services/opticians/LeaveReview/DefaultView.aspx?id=OP_5FF_13081__000001_TN91TE,0,0,
Buchanan Optometrists,OP_5L2_663__000001_ME65AG,OPT,Buchanan House,56 Malling Road,,Snodland,Kent,ME6 5NB,Tel: 01634 757227, - ,,,No ratings yet Rate it yourself - /Services/opticians/LeaveReview/DefaultView.aspx?id=OP_5L2_663__000001_ME65AG,0,0,yes
The Village Optician,OPT_ME65NJ_1,OPT,,4 Holborough Road,,Snodland,,ME6 5NJ,Tel: 01634 240090, - ,,,No ratings yet Rate it yourself - /Services/opticians/LeaveReview/DefaultView.aspx?id=OPT_ME65NJ_1,0,0,
Robert Murrell incorporating Armstrong and North,W4X1M,OPT,,17 Swanley Centre,,Swanley,Kent,BR8 7TG,Tel: 01322 663231, - ,,,No ratings yet Rate it yourself - /Services/opticians/LeaveReview/DefaultView.aspx?id=W4X1M,0,0,
Asda Opticians (Swanley),OPT_BR8 7UN,OPT,,London Road,,Swanley,,BR8 7UN,Tel: 01322 661963, - ,,,No ratings yet Rate it yourself - /Services/opticians/LeaveReview/DefaultView.aspx?id=OPT_BR8 7UN,0,0,
Specsavers Opticians Swanley,OPT_BR87TQ_1,OPT,,Unit 39 The Shopping Centre,,Swanley,Kent,BR8 7TQ,Tel: 01322 614827, - ,,,No ratings yet Rate it yourself - /Services/opticians/LeaveReview/DefaultView.aspx?id=OPT_BR87TQ_1,0,0,
Specsavers Opticians,OPT_ME207NA_2,OPT,,Sainsburys Supermarket,"Quarry Wood, Mills road",Aylesford,Kent,ME20 7NA,Tel: 01622 797200, - ,,,No ratings yet Rate it yourself - /Services/opticians/LeaveReview/DefaultView.aspx?id=OPT_ME207NA_2,0,0,
William J Wilkinson Limited,OP_5A7_470__000001_BR60PD,OPT,277 High Street,,Orpington,,,BR6 0NW,Tel: 01689 820866, - ,,,No ratings yet Rate it yourself - /Services/opticians/LeaveReview/DefaultView.aspx?id=OP_5A7_470__000001_BR60PD,0,0,
Specsavers Opticians,BR6 0TW__000001_BR60TW,OPT,,175 High Street,,Orpington,Kent,BR6 0LW,Tel: 01689 890 168, - ,,,No ratings yet Rate it yourself - /Services/opticians/LeaveReview/DefaultView.aspx?id=BR6 0TW__000001_BR60TW,0,0,
Tesco Opticians,5A7:15__000002_BR60NH,OPT,9 Augustus Lane,Orpington,Orpington,Kent,,BR6 0NH,, - ,,,No ratings yet Rate it yourself - /Services/opticians/LeaveReview/DefaultView.aspx?id=5A7:15__000002_BR60NH,0,0,
Boots-Orpington - High St,OP_5A7_10401__000002_BR60LS,OPT,232 High Street,,,Orpington,Kent,BR6 0LS,Tel: 01689 820 848, - ,,,No ratings yet Rate it yourself - /Services/opticians/LeaveReview/DefaultView.aspx?id=OP_5A7_10401__000002_BR60LS,0,0,
Westerham Eye Care,TN16 1RF,OPT,,18 High Street,,Westerham,,TN16 1RF,Tel: 01959447611, - ,,,No ratings yet Rate it yourself - /Services/opticians/LeaveReview/DefaultView.aspx?id=TN16 1RF,0,0,
Boots Opticians ,OP_5A7_6080__000002_BR60JN,OPT,194 High Street,,Orpington,,,BR6 0JN,Tel: 01689 891303, - ,,,No ratings yet Rate it yourself - /Services/opticians/LeaveReview/DefaultView.aspx?id=OP_5A7_6080__000002_BR60JN,0,0,
Vision Express (UK) Limited,BR5 3RP__000001_BR53RP,OPT,"Unit 9,",Nugent Shopping Park,Orpington,Kent,,BR5 3RP,Tel: 01689 875737, - ,,,No ratings yet Rate it yourself - /Services/opticians/LeaveReview/DefaultView.aspx?id=BR5 3RP__000001_BR53RP,0,0,
Boots-Bluewater Dartford,DA9 9SJ_98372,OPT,,"Unit MSU02, Lower Thames Walk",Bluewater Shopping Centre,Greenhithe,,DA9 9SJ,Tel: 01322624780, - ,,,No ratings yet Rate it yourself - /Services/opticians/LeaveReview/DefaultView.aspx?id=DA9 9SJ_98372,0,0,
Vision Express (Bluewater),OP_5CM_1771__000001_DA99SP,OPT,Unit 14 Upper Rose Gallery,Bluewater,Greenhithe,Kent,,DA9 9SP,Tel: 01322 624814, - ,,,No ratings yet Rate it yourself - /Services/opticians/LeaveReview/DefaultView.aspx?id=OP_5CM_1771__000001_DA99SP,0,0,
David Clulow (Bluewater),OP_5CM_10603__000001_DA99SS,OPT,Unit 110 Upper Guild Hall,Bluewater,Greenhithe,Kent,,DA9 9SS,Tel: 01322 624915, - ,,,No ratings yet Rate it yourself - /Services/opticians/LeaveReview/DefaultView.aspx?id=OP_5CM_10603__000001_DA99SS,0,0,
Patrick Duff,OP_5L2_12575__000001_TN126EN,OPT,3 Commercial Road,Paddock Wood,Tonbridge,,,TN12 6EN,Tel: 01892 838608, - ,,,No ratings yet Rate it yourself - /Services/opticians/LeaveReview/DefaultView.aspx?id=OP_5L2_12575__000001_TN126EN,0,0,
Elaine M Yorwarth,00156__000001_TN126DP,OPT,70 Commercial Road,,Paddock Wood,Kent,,TN12 6DP,Tel: 01892 833017, - ,,,No ratings yet Rate it yourself - /Services/opticians/LeaveReview/DefaultView.aspx?id=00156__000001_TN126DP,0,0,
John Lewis Opticians,OPT_DA99SA_1,OPT,,Bluewater,,Greenhithe,,DA9 9SA,, - ,,,No ratings yet Rate it yourself - /Services/opticians/LeaveReview/DefaultView.aspx?id=OPT_DA99SA_1,0,0,
Eye 2 Eye,OP_5L2_11435__000002_ME160PU,OPT,Mid Kent Shopping Centre,Castle Road,Allington,Maidstone,Kent,ME16 0PU,Tel: 01622 672563, - ,,,No ratings yet Rate it yourself - /Services/opticians/LeaveReview/DefaultView.aspx?id=OP_5L2_11435__000002_ME160PU,0,0,yes
Ewoma Aibangbee,OPT_DA118BZ_1,OPT,,"Gateway Medical Practice, Fleet Health Campus, Vale Road",Northfleet,Gravesend,Kent,DA11 8BZ,Tel: 07591 246595, - ,,,No ratings yet Rate it yourself - /Services/opticians/LeaveReview/DefaultView.aspx?id=OPT_DA118BZ_1,0,0,
Boots Opticians (Bluewater),OP_5CM_972__000002_DA99BA,OPT,South Mall,Bluewater Shopping Centre,Greenhithe,Kent,,DA9 9BA,Tel: 01322 623854, - ,,,No ratings yet Rate it yourself - /Services/opticians/LeaveReview/DefaultView.aspx?id=OP_5CM_972__000002_DA99BA,0,0,
Day Lewis Opticians (Southborough),OPT_TN40PN_1,OPT,,100 London Road,,Southborough,,TN4 0PN,Tel: 01892 529626, - ,,,No ratings yet Rate it yourself - /Services/opticians/LeaveReview/DefaultView.aspx?id=OPT_TN40PN_1,0,0,
Eye Concern,DOMICILIARYEYECARE1,OPT,,"134 London Road, Southborough",,Tunbridge Wells,,TN4 0PL,Tel: 01892 517312, - ,,,No ratings yet Rate it yourself - /Services/opticians/LeaveReview/DefaultView.aspx?id=DOMICILIARYEYECARE1,0,0,
Linklater Opticians ,OP_5CM_3977__000001_DA11HD,OPT,22 Lowfield Street,,Dartford,Dartford,,DA1 1HD,Tel: 01322 223113, - ,,,No ratings yet Rate it yourself - /Services/opticians/LeaveReview/DefaultView.aspx?id=OP_5CM_3977__000001_DA11HD,0,0,
Specsavers (Dartford),OP_5CM_11606__000002_DA11DE,OPT,54 High Street,,Dartford,Kent,,DA1 1DE,Tel: 01322 294040, - ,,,No ratings yet Rate it yourself - /Services/opticians/LeaveReview/DefaultView.aspx?id=OP_5CM_11606__000002_DA11DE,0,0,
Boots-Dartford - High St (in Boots UK),OP_5P9_3123__000003_DA11DE,OPT,48-52 High Street,,,Dartford,Kent,DA1 1DE,Tel: 01322 223935, - ,,,No ratings yet Rate it yourself - /Services/opticians/LeaveReview/DefaultView.aspx?id=OP_5P9_3123__000003_DA11DE,0,0,
Specology Limited,OP_TN163BA_29288,OPT,,"Unit 9, 160-166 Main Road",,"Biggin Hill, Kent",,TN16 3BA,Tel: 01959 928001, - ,,,No ratings yet Rate it yourself - /Services/opticians/LeaveReview/DefaultView.aspx?id=OP_TN163BA_29288,0,0,
Boots-Dartford - High St,OP_5CM_1268__000002_DA11BY,OPT,20 High Street,,,Dartford,Kent,DA1 1BY,Tel: 01322 223 007, - ,,,No ratings yet Rate it yourself - /Services/opticians/LeaveReview/DefaultView.aspx?id=OP_5CM_1268__000002_DA11BY,0,0,
Day Lewis Opticians,OP_5A7_1378__000001_TN163AY,OPT,116 Main Road,Biggin Hill,Westerham,,,TN16 3AY,Tel: 01959 572535, - ,,,No ratings yet Rate it yourself - /Services/opticians/LeaveReview/DefaultView.aspx?id=OP_5A7_1378__000001_TN163AY,0,0,
Asda Opticians (Greenhithe),00276__000002_DA99RE,OPT,Station Road,,Greenhithe,Kent,,DA9 9RE,Tel: 01322 374162, - ,,,No ratings yet Rate it yourself - /Services/opticians/LeaveReview/DefaultView.aspx?id=00276__000002_DA99RE,0,0,
Lambrou Eye Studio,OP_5A7_5488__000002_BR68NN,OPT,350 Crofton Road,,Orpington,Bromley,,BR6 8NN,Tel: 01689 850 593, - ,,,No ratings yet Rate it yourself - /Services/opticians/LeaveReview/DefaultView.aspx?id=OP_5A7_5488__000002_BR68NN,0,0,
Steven Harris Opticians,OP_5A7_831__000002_BR51NA,OPT,16 Station Square,Petts Wood,Orpington,Kent,,BR5 1NA,Tel: 01689 831726, - ,,,No ratings yet Rate it yourself - /Services/opticians/LeaveReview/DefaultView.aspx?id=OP_5A7_831__000002_BR51NA,0,0,
Boots-Petts Wood,BR5 1DE__000001_BR51DE,OPT,12 Chatsworth Parade,,,Petts Wood,Kent,BR5 1DF,Tel: 01689 823 250, - ,,,No ratings yet Rate it yourself - /Services/opticians/LeaveReview/DefaultView.aspx?id=BR5 1DE__000001_BR51DE,0,0,
Specsavers (Gravesend),OP_5CM_2356__000001_DA110AU,OPT,19-20 Thamesgate Shopping Centre,,Kent,Gravesend,,DA11 0AU,Tel: 01474 537 878, - ,,,No ratings yet Rate it yourself - /Services/opticians/LeaveReview/DefaultView.aspx?id=OP_5CM_2356__000001_DA110AU,0,0,
Asda Opticans (Gravesend),00306__000001_DA110DQ,OPT,Thames Way,,Gravesend,Kent,,DA11 0DQ,Tel: 01474 543 412, - ,,,No ratings yet Rate it yourself - /Services/opticians/LeaveReview/DefaultView.aspx?id=00306__000001_DA110DQ,0,0,
Boots-Gravesend - Kempthorne St,OP_5CM_416__000002_DA110TA,OPT,9 Kempthorne Street,St Georges Shopping Centre,,Gravsend,Kent,DA11 0TA,Tel: 01474 352911, - ,,,No ratings yet Rate it yourself - /Services/opticians/LeaveReview/DefaultView.aspx?id=OP_5CM_416__000002_DA110TA,0,0,
Medical Eye Centre,00314__000001_DA122EB,OPT,14 King Street,,Gravesend,Kent,,DA12 2EB,Tel: 01474 321553, - ,,,No ratings yet Rate it yourself - /Services/opticians/LeaveReview/DefaultView.aspx?id=00314__000001_DA122EB,0,0,
Optical Express,K5B4X,OPT,40 Lower Level,"Riverbridge House, Anchor Boulevard",,Dartford,Kent,DA2 6SL,Tel: 0800 023 2020, - ,,,No ratings yet Rate it yourself - /Services/opticians/LeaveReview/DefaultView.aspx?id=K5B4X,0,0,
Bayfields Opticians and Audiologists (Maidstone),I9V4Y,OPT,,6 Pudding Lane,,Maidstone,,ME14 1LN,Tel: 01622 758566, - ,,,No ratings yet Rate it yourself - /Services/opticians/LeaveReview/DefaultView.aspx?id=I9V4Y,0,0,
Tinsons ,OP_5L2_760__000001_ME141TG,OPT,9 Middle Row,,Kent,Maidstone,,ME14 1TG,Tel: 01622 686051, - ,,,No ratings yet Rate it yourself - /Services/opticians/LeaveReview/DefaultView.aspx?id=OP_5L2_760__000001_ME141TG,0,0,
Specsavers (Maidstone),OPT_ME141QS_1,OPT,,21-25 Week Street,,Maidstone,Kent,ME14 1QS,Tel: 01622 663111, - ,,,No ratings yet Rate it yourself - /Services/opticians/LeaveReview/DefaultView.aspx?id=OPT_ME141QS_1,0,0,
William J Wilkinson (Maidstone),OP_5L2_2043__000001_ME156JJ,OPT,50 Gabriels Hill,,Kent,Maidstone,,ME15 6JJ,Tel: 01622 677424, - ,,,No ratings yet Rate it yourself - /Services/opticians/LeaveReview/DefaultView.aspx?id=OP_5L2_2043__000001_ME156JJ,0,0,
Specsavers Crayford,G1O1G,OPT,Sainsbury's,Stadium Way,,Dartford,Kent,DA1 4HW,Tel: 01322 470662, - ,,,No ratings yet Rate it yourself - /Services/opticians/LeaveReview/DefaultView.aspx?id=G1O1G,0,0,
Vision Express (Maidstone),OP_5L2_6952__000001_ME156AS,OPT,346-348 Dukes Walk,Chequers Centre,Maidstone,Kent,,ME15 6AS,Tel: 01622 678123, - ,,,No ratings yet Rate it yourself - /Services/opticians/LeaveReview/DefaultView.aspx?id=OP_5L2_6952__000001_ME156AS,0,0,
Boots-Maidstone - King St,OP_5L2_195__000002_ME141BW,OPT,56-62 King Street,,Kent,Maidstone,,ME14 1BW,Tel: 01622 762337, - ,,,No ratings yet Rate it yourself - /Services/opticians/LeaveReview/DefaultView.aspx?id=OP_5L2_195__000002_ME141BW,0,0,
Crayford Opticial Centre,OP_5AX_1701__000001_DA14ES,OPT,11a Crayford High Street,,Crayford,Kent,,DA1 4HH,Tel: 01322557700, - ,,,No ratings yet Rate it yourself - /Services/opticians/LeaveReview/DefaultView.aspx?id=OP_5AX_1701__000001_DA14ES,0,0,
Vraitch Vision (Walderslade),OPT_ME59LR_1,OPT,,3-4 Thetford House,,Walderslade,,ME5 9LR,Tel: 01634 682595, - ,,,No ratings yet Rate it yourself - /Services/opticians/LeaveReview/DefaultView.aspx?id=OPT_ME59LR_1,0,0,
Specsavers Opticians,OP_5AX_14708__000001_DA146ED,OPT,53 High Street,Sidcup,Kent,,,DA14 6ED,Tel: 0208 308 3500, - ,,,No ratings yet Rate it yourself - /Services/opticians/LeaveReview/DefaultView.aspx?id=OP_5AX_14708__000001_DA146ED,0,0,
Leightons Opticians and Hearing Care,TP4N9,OPT,,2 Goods Station Road,,Tunbridge Wells,Kent,TN1 2BJ,Tel: 01892 539808, - ,,,No ratings yet Rate it yourself - /Services/opticians/LeaveReview/DefaultView.aspx?id=TP4N9,0,0,
Boots-Tunbridge Wells - Calverley Rd (in Boots UK),OP_5FF_11550__000002_TN12TE,OPT,7-11 Calverley Road,,,Tunbridge Wells,Kent,TN1 2TE,Tel: 01892 546063, - ,,,No ratings yet Rate it yourself - /Services/opticians/LeaveReview/DefaultView.aspx?id=OP_5FF_11550__000002_TN12TE,0,0,
Vision Express (Tunbridge Wells),OP_5FF_1__000001_TN12TH,OPT,23 Calverley Road,,Kent,Tunbridge Wells,,TN1 2TH,Tel: 01892 537585, - ,,,No ratings yet Rate it yourself - /Services/opticians/LeaveReview/DefaultView.aspx?id=OP_5FF_1__000001_TN12TH,0,0,
Specsavers (Tunbridge Wells),OP_5FF_2826__000001_TN11QR,OPT,119 Mount Pleasant Road,,Kent,Tunbridge Wells,,TN1 1QR,Tel: 01892 533550, - ,,,No ratings yet Rate it yourself - /Services/opticians/LeaveReview/DefaultView.aspx?id=OP_5FF_2826__000001_TN11QR,0,0,
Boots-Tunbridge Wells - Calverley Rd,OP_5FF_12824__000001_TN12UU,OPT,49 Calverley Road,,,Tunbridge Wells,Kent,TN1 2TT,Tel: 01892 525 561, - ,,,No ratings yet Rate it yourself - /Services/opticians/LeaveReview/DefaultView.aspx?id=OP_5FF_12824__000001_TN12UU,0,0,
Day Lewis Opticians (Edenbridge),OP_5FF_4744__000002_TN85AJ,OPT,56 High Street,,Kent,Edenbridge,,TN8 5AJ,Tel: 01732 862366, - ,,,No ratings yet Rate it yourself - /Services/opticians/LeaveReview/DefaultView.aspx?id=OP_5FF_4744__000002_TN85AJ,0,0,
Colletts Opticians Ltd,OP_5AX_2176__000001_DA146ND,OPT,103 Main Road,Sidcup,Kent,,,DA14 6ND,Tel: 0208 300 3222, - ,,,No ratings yet Rate it yourself - /Services/opticians/LeaveReview/DefaultView.aspx?id=OP_5AX_2176__000001_DA146ND,0,0,
Edney & Edney Ltd,CO-5383,OPT,,35 Monson Road,,"Tunbridge Wells, Kent ",,TN1 1LS,, - ,,,No ratings yet Rate it yourself - /Services/opticians/LeaveReview/DefaultView.aspx?id=CO-5383,0,0,
Edney & Edney,OPT_TN11LS_1,OPT,,35 Monson Road,,Tunbridge Wells,,TN1 1LS,Tel: 01892 517986, - ,,,No ratings yet Rate it yourself - /Services/opticians/LeaveReview/DefaultView.aspx?id=OPT_TN11LS_1,0,0,
Scrivens Opticians (Tunbridge Wells),OP_5FF_11300__000001_TN11PN,OPT,29 Mount Pleasant,,Kent,Tunbridge Wells,,TN1 1PN,Tel: 01892 527999, - ,,,No ratings yet Rate it yourself - /Services/opticians/LeaveReview/DefaultView.aspx?id=OP_5FF_11300__000001_TN11PN,0,0,
Boots-Strood,OP_5L3_1926__000001_ME24TJ,OPT,117 High Street,,,Strood,Kent,ME2 4TJ,Tel: 01634 718676, - ,,,No ratings yet Rate it yourself - /Services/opticians/LeaveReview/DefaultView.aspx?id=OP_5L3_1926__000001_ME24TJ,0,0,
David Clulow,OPT_TN11NX_1,OPT,,32-34 High Street,,Tunbridge Wells,Kent,TN1 1NX,Tel: 01892 512385, - ,,,No ratings yet Rate it yourself - /Services/opticians/LeaveReview/DefaultView.aspx?id=OPT_TN11NX_1,0,0,
Specsavers Opticians,OPT_ME24AR_1,OPT,,58 High Street,,"Strood, Rochester",Kent,ME2 4AR,Tel: 01634 540399, - ,,,No ratings yet Rate it yourself - /Services/opticians/LeaveReview/DefaultView.aspx?id=OPT_ME24AR_1,0,0,
Niall O'Kane Optometrists,OP_5L3_10355__000001_ME24AR,OPT,78 - 80 High Street,Strood,Rochester,Kent,,ME2 4AR,Tel: 01634 290178, - ,,,No ratings yet Rate it yourself - /Services/opticians/LeaveReview/DefaultView.aspx?id=OP_5L3_10355__000001_ME24AR,0,0,
K Lewis & Partners,OP_5GQ_9847__000001_RM187QT,OPT,39 - 41 Calcutta Road,,Tilbury,Essex,,RM18 7QT,Tel: 01375 843074, - ,,,No ratings yet Rate it yourself - /Services/opticians/LeaveReview/DefaultView.aspx?id=OP_5GQ_9847__000001_RM187QT,0,0,
Oakmead Opticians,02991__000002_BR75LX,OPT,Sunnyways,Prince Imperial Way,Chislehurst,Kent,,BR7 5LX,, - ,,,No ratings yet Rate it yourself - /Services/opticians/LeaveReview/DefaultView.aspx?id=02991__000002_BR75LX,0,0,
Peepers,OP_5FF_9945__000001_TN11XU,OPT,49 High Street,Tunbridge Wells,Kent,,,TN1 1XU,Tel: 01892 534481, - ,,,No ratings yet Rate it yourself - /Services/opticians/LeaveReview/DefaultView.aspx?id=OP_5FF_9945__000001_TN11XU,0,0,
Linklater & Warren Opticians,RL_04122014_CO-4763,OPT,,30a High Street,,Chislehurst,Kent,BR7 5AN,Tel: 020 8295 5131, - ,,,No ratings yet Rate it yourself - /Services/opticians/LeaveReview/DefaultView.aspx?id=RL_04122014_CO-4763,0,0,no
Boots-Bexleyheath,OP_5AX_10393__000002_DA67JJ,OPT,25 The Mall,Broadway Shopping Centre,Bexleyheath,Kent,,DA6 7JJ,Tel: 020 8301 5656, - ,,,No ratings yet Rate it yourself - /Services/opticians/LeaveReview/DefaultView.aspx?id=OP_5AX_10393__000002_DA67JJ,0,0,
Vision Express Ltd,OP_5AX_5408__000003_DA67JJ,OPT,5 The Mall,Broadway Shopping Centre,Bexleyheath,Kent,,DA6 7JJ,Tel: 0208 298 9629, - ,,,No ratings yet Rate it yourself - /Services/opticians/LeaveReview/DefaultView.aspx?id=OP_5AX_5408__000003_DA67JJ,0,0,
Specsavers Opticians,OP_5AX_227__000001_DA67DQ,OPT,116a Broadway,Bexleyheath,Kent,,,DA6 7DQ,Tel: 0208 298 9920, - ,,,No ratings yet Rate it yourself - /Services/opticians/LeaveReview/DefaultView.aspx?id=OP_5AX_227__000001_DA67DQ,0,0,
Linklater Optometrists,OP_5AX_10048__000002_DA67DQ,OPT,Linklaters Optometrists,120 Broadway,Bexleyheath,Kent,,DA6 7DQ,Tel: 0208 303 4014, - ,,,No ratings yet Rate it yourself - /Services/opticians/LeaveReview/DefaultView.aspx?id=OP_5AX_10048__000002_DA67DQ,0,0,no
Specsavers Opticians (Oxted),OPT_RH80BD_1,OPT,,25 Station Road East,,Oxted,Surrey,RH8 0BD,Tel: 01883 772288, - ,,,No ratings yet Rate it yourself - /Services/opticians/LeaveReview/DefaultView.aspx?id=OPT_RH80BD_1,0,0,
Jonathan Kerr Optometrists,TP454,OPT,80 Station Road East,80 Station Road East,Oxted,Surrey,,RH8 0PG,Tel: 01883 722 808, - ,,,No ratings yet Rate it yourself - /Services/opticians/LeaveReview/DefaultView.aspx?id=TP454,0,0,
Thakar Opticians,OP_5KQ_14541__000001_RH80AX,OPT,,81 Station Road East,,Oxted,Surrey,RH8 0AX,Tel: 01883 714 696, - ,,,No ratings yet Rate it yourself - /Services/opticians/LeaveReview/DefaultView.aspx?id=OP_5KQ_14541__000001_RH80AX,0,0,
Batemans (Opticians) Ltd,OP_5KQ_10850__000001_RH80QE,OPT,,149 Station Road East,,Oxted,Surrey,RH8 0QE,Tel: 01883 715 510, - ,,,No ratings yet Rate it yourself - /Services/opticians/LeaveReview/DefaultView.aspx?id=OP_5KQ_10850__000001_RH80QE,0,0,
Specsavers (Chatham),OP_5L3_7948__000001_ME44BG,OPT,215 High Street,,Chatham,Kent,,ME4 4BG,Tel: 01634 818555, - ,,,No ratings yet Rate it yourself - /Services/opticians/LeaveReview/DefaultView.aspx?id=OP_5L3_7948__000001_ME44BG,0,0,
Vision Express (Chatham),OP_5L3_6149__000002_ME44BG,OPT,199 - 201 High Street,,Chatham,Kent,,ME4 4BG,Tel: 01634 404808, - ,,,No ratings yet Rate it yourself - /Services/opticians/LeaveReview/DefaultView.aspx?id=OP_5L3_6149__000002_ME44BG,0,0,
Boots-Chatham - Wilmot Sq,OP_5L3_1784__000002_ME44BB,OPT,30-34 Wilmot Square,Pentagon Centre,,Kent,Kent,ME4 4BB,Tel: 01634 828672, - ,,,No ratings yet Rate it yourself - /Services/opticians/LeaveReview/DefaultView.aspx?id=OP_5L3_1784__000002_ME44BB,0,0,