Organisation Name,NACS Code,Organisation Type,Address1,Address2,Address3,Address4,Address5,PostCode,Telephone Number,Opening time,Value  (Opening time),Banding Classification  (Opening time),NHS.UK users rating,Value  (NHS.UK users rating),Banding Classification  (NHS.UK users rating),Car parking (Is there car parking at this organisation?)
Kirton in Lindsey Opticians,OP_5EF_3529__000002_DN214LU,OPT,6 High Street,Kirton Lindsey,Gainsborough,Lincolnshire,,DN21 4LU,Tel: 01652 649024, - ,,,No ratings yet Rate it yourself - /Services/opticians/LeaveReview/DefaultView.aspx?id=OP_5EF_3529__000002_DN214LU,0,0,
I S Merry,OP_5EF_2727__000001_DN162SF,OPT,Alexandra Road,Ashby,Scunthorpe,North Lincolnshire,,DN16 2SF,Tel: 01724 852987, - ,,,No ratings yet Rate it yourself - /Services/opticians/LeaveReview/DefaultView.aspx?id=OP_5EF_2727__000001_DN162SF,0,0,
Asda Vision Centre,OP_5EF_13988__000001_DN172XE,OPT,Burringham Road,,,Scunthorpe,,DN17 2XF,Tel: 01724 407220, - ,,,No ratings yet Rate it yourself - /Services/opticians/LeaveReview/DefaultView.aspx?id=OP_5EF_13988__000001_DN172XE,0,0,
Norfolk Optics Limited,OPT_5EF_018__000001_DN162SD,OPT,259 Ashby High Street,,Scunthorpe,North Lincolnshire,,DN16 2SD,Tel: 01724 867117, - ,,,1 rating Rate it yourself - /Services/opticians/LeaveReview/DefaultView.aspx?id=OPT_5EF_018__000001_DN162SD,,,
Charles Irvine,OPT-5EF-022__000002_DN162RY,OPT,295 Ashby High Street,Ashby,Scunthorpe,,,DN16 2RY,, - ,,,6 ratings Rate it yourself - /Services/opticians/LeaveReview/DefaultView.aspx?id=OPT-5EF-022__000002_DN162RY,,,
Edwards & Mahal,OP_5EF_9090__000002_DN91ER,OPT,12 Church Street,Epworth,Doncaster,,,DN9 1ER,Tel: 01427 873578, - ,,,No ratings yet Rate it yourself - /Services/opticians/LeaveReview/DefaultView.aspx?id=OP_5EF_9090__000002_DN91ER,0,0,
Bingham and Young ,180420171310,OPT,,33 Market Street,,Gainsborough,Lincolnshire,DN21 2BE,Tel: 01427678333, - ,,,No ratings yet Rate it yourself - /Services/opticians/LeaveReview/DefaultView.aspx?id=180420171310,0,0,yes
Davies-Todd Opticians Ltd,OP_5D2_6710__000002_DN212BE,OPT,12 Market Street,,Gainsborough,,,DN21 2BE,Tel: 01427 612853, - ,,,No ratings yet Rate it yourself - /Services/opticians/LeaveReview/DefaultView.aspx?id=OP_5D2_6710__000002_DN212BE,0,0,
Gainsborough VisionPlus Ltd,OPT082__000001_DN212NA,OPT,"Unit 22, Marshalls Yard",Beaumont Street,Gainsborough,Lincolnshire,,DN21 2NA,Tel: 01472 619870, - ,,,No ratings yet Rate it yourself - /Services/opticians/LeaveReview/DefaultView.aspx?id=OPT082__000001_DN212NA,0,0,
Walters Opticians,OP_5D2_692__000002_DN212BY,OPT,34 Market Place,,Gainsborough,,,DN21 2BY,Tel: 01427 616505, - ,,,No ratings yet Rate it yourself - /Services/opticians/LeaveReview/DefaultView.aspx?id=OP_5D2_692__000002_DN212BY,0,0,no
Boots-Scunthorpe - Oswald Rd,OP_5EF_6059__000001_DN157PQ,OPT,40 Oswald Road,,,Scunthorpe,Lincolnshire,DN15 7PQ,Tel: 01724 843152, - ,,,No ratings yet Rate it yourself - /Services/opticians/LeaveReview/DefaultView.aspx?id=OP_5EF_6059__000001_DN157PQ,0,0,
Sutherland Optical Associates,OP_5EF_11493__000001_DN156LA,OPT,123 Mary Street,,Scunthorpe,North Lincolnshire,,DN15 6LA,Tel: 01724 865248, - ,,,No ratings yet Rate it yourself - /Services/opticians/LeaveReview/DefaultView.aspx?id=OP_5EF_11493__000001_DN156LA,0,0,
Peebles & Wayte,OP_5EF_8936__000001_DN156NG,OPT,2 Robert Street,,Scunthorpe,North Lincolnshire,,DN15 6NG,Tel: 01724 843528, - ,,,No ratings yet Rate it yourself - /Services/opticians/LeaveReview/DefaultView.aspx?id=OP_5EF_8936__000001_DN156NG,0,0,
Boots-Scunthorpe - High St,OP_5EF_2181__000001_DN156LY,OPT,103 High Street,,,Scunthorpe,Lincolnshire,DN15 6LY,Tel: 01724 847 710, - ,,,No ratings yet Rate it yourself - /Services/opticians/LeaveReview/DefaultView.aspx?id=OP_5EF_2181__000001_DN156LY,0,0,
Tesco Opticians,OPT-5EF-019__000001_DN158GR,OPT,Gallagher Park,Doncaster Road,Scunthorpe,North Lincolnshire,,DN15 8GR,Tel: 0345 677 9664, - ,,,No ratings yet Rate it yourself - /Services/opticians/LeaveReview/DefaultView.aspx?id=OPT-5EF-019__000001_DN158GR,0,0,
Vision Express (UK) Ltd,OP_5EF_13991__000001_DN156SD,OPT,78 High Street,,Scunthorpe,North Lincolnshire,,DN15 6SD,Tel: 01724 276220, - ,,,No ratings yet Rate it yourself - /Services/opticians/LeaveReview/DefaultView.aspx?id=OP_5EF_13991__000001_DN156SD,0,0,
Vision Value,OPT-5EF021__000002_DN156SD,OPT,70 High Street,The Foundry,Scunthorpe,,,DN15 6SD,, - ,,,No ratings yet Rate it yourself - /Services/opticians/LeaveReview/DefaultView.aspx?id=OPT-5EF021__000002_DN156SD,0,0,
Specsavers Opticians,OP_5EF_6742__000001_DN156TG,OPT,54 High Street,,Scunthorpe,North Lincolnshire,,DN15 6SX,Tel: 01724 271451, - ,,,4 ratings Rate it yourself - /Services/opticians/LeaveReview/DefaultView.aspx?id=OP_5EF_6742__000001_DN156TG,,,
Brigg Optical,OPT_5EF_017__000001_DN208JZ,OPT,5 Chapel Court,,Brigg,North Lincolnshire,,DN20 8JZ,Tel: 01652 650400, - ,,,1 rating Rate it yourself - /Services/opticians/LeaveReview/DefaultView.aspx?id=OPT_5EF_017__000001_DN208JZ,,,
O'Brien's Opticians,OP_5EF_3276__000001_DN208JB,OPT,43-44 Wrawby Street,Brigg,Scunthorpe,North Lincolnshire,,DN20 8BS,Tel: 01652 653595, - ,,,No ratings yet Rate it yourself - /Services/opticians/LeaveReview/DefaultView.aspx?id=OP_5EF_3276__000001_DN208JB,0,0,
Smith & Walker (Optometrists) Ltd,OP_5EF_8151__000001_DN159PU,OPT,1 High Street,,Winterton,North Lincolnshire,,DN15 9PU,Tel: 01724 733754, - ,,,No ratings yet Rate it yourself - /Services/opticians/LeaveReview/DefaultView.aspx?id=OP_5EF_8151__000001_DN159PU,0,0,
Michael Vickers,MVDN228RX,OPT,,89 Town Street,,"Lound, Retford",,DN22 8RX,Tel: 01777 818291, - ,,,No ratings yet Rate it yourself - /Services/opticians/LeaveReview/DefaultView.aspx?id=MVDN228RX,0,0,
Greenwood Opticians,OP_5D2_3341__000001_LN83HL,OPT,25 Market Place,,,Market Rasen,Lincolnshire,LN8 3HL,Tel: 01673 842265, - ,,,8 ratings Rate it yourself - /Services/opticians/LeaveReview/DefaultView.aspx?id=OP_5D2_3341__000001_LN83HL,,,
Bawtry Eye Academy,OPT_DN106LS_1,OPT,,2 Swan Street,Bawtry,Doncaster,South Yorkshire,DN10 6QJ,Tel: 01302 711282, - ,,,1 rating Rate it yourself - /Services/opticians/LeaveReview/DefaultView.aspx?id=OPT_DN106LS_1,,,yes
Jenny Hudson Opticians,OP_5EK_12972__000002_DN106JE,OPT,22 High Street,Bawtry,Doncaster,,,DN10 6JE,Tel: 01302 711655, - ,,,No ratings yet Rate it yourself - /Services/opticians/LeaveReview/DefaultView.aspx?id=OP_5EK_12972__000002_DN106JE,0,0,
Parkhurst Opticians Ltd,OP_5EK_7517__000001_DN85DG,OPT,8 Finkle Street,Thorne,Doncaster,,,DN8 5DE,Tel: 01405 740095, - ,,,No ratings yet Rate it yourself - /Services/opticians/LeaveReview/DefaultView.aspx?id=OP_5EK_7517__000001_DN85DG,0,0,
Bell Brothers (Opticians) Ltd,OP_5EK_9712__000003_DN85DE,OPT,23 Finkle Street,Thorne,,Doncaster,South Yorkshire,DN8 5DE,Tel: 01405 812209, - ,,,No ratings yet Rate it yourself - /Services/opticians/LeaveReview/DefaultView.aspx?id=OP_5EK_9712__000003_DN85DE,0,0,
Retford Specsavers Ltd,OP_5ET_9436__000001_DN226DR,OPT,10a Market Place,,,Retford,,DN22 6DR,Tel: 01777 711711, - ,,,4 ratings Rate it yourself - /Services/opticians/LeaveReview/DefaultView.aspx?id=OP_5ET_9436__000001_DN226DR,,,
Bingham & Young(Young Optical Limited),OP_5ET_2900__000001_DN227SQ,OPT,2 Exchange Street,,Retford,Retford,,DN22 6BL,Tel: 01777 703328, - ,,,No ratings yet Rate it yourself - /Services/opticians/LeaveReview/DefaultView.aspx?id=OP_5ET_2900__000001_DN227SQ,0,0,
Woolcott Opticians,OP_5ET_3205__000003_DN226DY,OPT,30 Carolgate,,Retford,,,DN22 6DY,Tel: 01777 703340, - ,,,1 rating Rate it yourself - /Services/opticians/LeaveReview/DefaultView.aspx?id=OP_5ET_3205__000003_DN226DY,,,
Dudley & Severn,OP_5ET_A469__000001_DN226ES,OPT,9 West Street,,Retford,Nottinghamshire,,DN22 6ES,Tel: 01777 703030, - ,,,No ratings yet Rate it yourself - /Services/opticians/LeaveReview/DefaultView.aspx?id=OP_5ET_A469__000001_DN226ES,0,0,
David Burghardt Vision Care (David Burghardt),OP_5D2_1569__000002_LN22PD,OPT,1 Church Street,Nettleham,Lincoln,",",,LN2 2PD,Tel: 01522 754821, - ,,,No ratings yet Rate it yourself - /Services/opticians/LeaveReview/DefaultView.aspx?id=OP_5D2_1569__000002_LN22PD,0,0,
Arthur Leach Opticians,OP_5EK_967__000001_DN33AE,OPT,8 The Parade,Church Street,Armthorpe,Doncaster,,DN3 3AE,Tel: 01302 830168, - ,,,No ratings yet Rate it yourself - /Services/opticians/LeaveReview/DefaultView.aspx?id=OP_5EK_967__000001_DN33AE,0,0,
Eyesite Opticians Ltd,OP_5EF_4393__000002_DN185PD,OPT,42 High Street,,Barton-upon-Humber,North Lincolnshire,,DN18 5PD,Tel: 01652 635997, - ,,,No ratings yet Rate it yourself - /Services/opticians/LeaveReview/DefaultView.aspx?id=OP_5EF_4393__000002_DN185PD,0,0,
Smith & Walker (Optometrists) Ltd,OP_5EF_3196__000003_DN185PD,OPT,16 High Street,,Barton-upon-Humber,North Lincolnshire,,DN18 5PD,Tel: 01652 632315, - ,,,6 ratings Rate it yourself - /Services/opticians/LeaveReview/DefaultView.aspx?id=OP_5EF_3196__000003_DN185PD,,,
Woolcott Opticians,OP_5ET_9365__000002_DN118JN,OPT,85 Scrooby Road,Bircotes,Doncaster,,,DN11 8JN,Tel: 01302 744300, - ,,,No ratings yet Rate it yourself - /Services/opticians/LeaveReview/DefaultView.aspx?id=OP_5ET_9365__000002_DN118JN,0,0,
Clear View Vision Ltd (Mrs Annabelle Magee),LN1_3LW_1,OPT,Clear View Opticians,169 Burton Road,,Lincoln,Lincolnshire,LN1 3LW,Tel: 01522 542121, - ,,,No ratings yet Rate it yourself - /Services/opticians/LeaveReview/DefaultView.aspx?id=LN1_3LW_1,0,0,yes
Bell Brothers (Opticians) Ltd,OP_5EK_10465__000001_DN110PJ,OPT,9 Nelson Road,Rossington,,Doncaster,,DN11 0PE,Tel: 01302 868638, - ,,,No ratings yet Rate it yourself - /Services/opticians/LeaveReview/DefaultView.aspx?id=OP_5EK_10465__000001_DN110PJ,0,0,
Sightcare UK Ltd,BROUGH1__000001_HU151AF,OPT,Welton Road,,Brough,E Yorkshire,,HU15 1AF,Tel: 01482 665999, - ,,,No ratings yet Rate it yourself - /Services/opticians/LeaveReview/DefaultView.aspx?id=BROUGH1__000001_HU151AF,0,0,
Harold Barnaby Optical Services,OP_5D2_13817__000001_LN24BL,OPT,,31 Mainwaring Road,,Lincoln,,LN2 4BL,Tel: 01522 524732, - ,,,No ratings yet Rate it yourself - /Services/opticians/LeaveReview/DefaultView.aspx?id=OP_5D2_13817__000001_LN24BL,0,0,yes
Craig Leaver Eyecare,OP_5D2_13820__000001_LN24QP,OPT,2 Bunkers Hill,Lincoln,,",",,LN2 4QP,Tel: 01522 522088, - ,,,No ratings yet Rate it yourself - /Services/opticians/LeaveReview/DefaultView.aspx?id=OP_5D2_13820__000001_LN24QP,0,0,
Tesco Opticians,TP6NY,OPT,,Wragby Road,,Lincoln,,LN2 4QQ,, - ,,,No ratings yet Rate it yourself - /Services/opticians/LeaveReview/DefaultView.aspx?id=TP6NY,0,0,
Vision Care @ No 8 (Julian Gunn & Jason Rickaby),OP_5D2_14304__000001_LN13AJ,OPT,3 Gordon Road,8 Gordon Road,,Lincoln,,LN1 3AJ,Tel: 01522 530088, - ,,,No ratings yet Rate it yourself - /Services/opticians/LeaveReview/DefaultView.aspx?id=OP_5D2_14304__000001_LN13AJ,0,0,
Michael James,OP_5E3_3140__000001_DN145DE,OPT,28 Boothferry Road,,Goole,,,DN14 5DA,Tel: 01405 761387, - ,,,No ratings yet Rate it yourself - /Services/opticians/LeaveReview/DefaultView.aspx?id=OP_5E3_3140__000001_DN145DE,0,0,
Mucklow & Hardy,OP_5D2_13819__000001_LN21QA,OPT,Clear View Opticians,6a Eastgate,,Lincoln,Lincolnshire,LN2 1QA,Tel: 01522 538889, - ,,,No ratings yet Rate it yourself - /Services/opticians/LeaveReview/DefaultView.aspx?id=OP_5D2_13819__000001_LN21QA,0,0,no
Eye Deal,OP_5E3_13039__000002_DN145DL,OPT,17 Paradise Place,,Goole,E Yorkshire,,DN14 5DL,Tel: 01405 767705, - ,,,No ratings yet Rate it yourself - /Services/opticians/LeaveReview/DefaultView.aspx?id=OP_5E3_13039__000002_DN145DL,0,0,
Specsavers Opticians,OP_5E3_13041__000001_DN145BT,OPT,68 Boothferry Road,,Goole,E Yorkshire,,DN14 5BT,Tel: 01405 760699, - ,,,No ratings yet Rate it yourself - /Services/opticians/LeaveReview/DefaultView.aspx?id=OP_5E3_13041__000001_DN145BT,0,0,
Blenkinsop Opticians,OP_5E3_12767__000001_DN146BP,OPT,71-73 Pasture Road,,Goole,,,DN14 6BP,Tel: 01405 763439, - ,,,No ratings yet Rate it yourself - /Services/opticians/LeaveReview/DefaultView.aspx?id=OP_5E3_12767__000001_DN146BP,0,0,
Opticial Express,OP_12345_LN1 1XP,OPT,"2nd Floor, Lincoln House",37 Newland,,Lincoln,Lincolnshire,LN1 1XP,Tel: 0800 023 2020, - ,,,No ratings yet Rate it yourself - /Services/opticians/LeaveReview/DefaultView.aspx?id=OP_12345_LN1 1XP,0,0,
Water Lane Opticians,OP_5D2_13818__000001_LN11TY,OPT,5 Water Lane,Lincoln,,,,LN1 1TY,Tel: 01522 525395, - ,,,No ratings yet Rate it yourself - /Services/opticians/LeaveReview/DefaultView.aspx?id=OP_5D2_13818__000001_LN11TY,0,0,
Vision Care at Home,CO-5051-1,OPT,,Unit 14 Heather Court,Shawood Business Park,Doncaster,Yorkshire,DN2 5YL,Tel: 01302 859 308, - ,,,No ratings yet Rate it yourself - /Services/opticians/LeaveReview/DefaultView.aspx?id=CO-5051-1,0,0,
Optique Vision,C/0117-Q59_LN2 1DH,OPT,The Stonebow,224 High Street,,Lincoln,Lincolnshire,LN2 1AH,Tel: 01522244390, - ,,,1 rating Rate it yourself - /Services/opticians/LeaveReview/DefaultView.aspx?id=C/0117-Q59_LN2 1DH,,,yes
Martin Smith Opticians Ltd,OP_5D2_2805__000001_LN21DH,OPT,22 Saltergate,,Lincoln,,,LN2 1DH,Tel: 01522 521100, - ,,,No ratings yet Rate it yourself - /Services/opticians/LeaveReview/DefaultView.aspx?id=OP_5D2_2805__000001_LN21DH,0,0,yes
Vision Express (UK) Ltd,OP_5D2_10307__000003_LN21AP,OPT,Unit 8 Waterside Shopping Centre,High Street,Lincoln,Lincolnshire,,LN2 1AP,Tel: 01522 560111, - ,,,No ratings yet Rate it yourself - /Services/opticians/LeaveReview/DefaultView.aspx?id=OP_5D2_10307__000003_LN21AP,0,0,
Boots-Lincoln - High St (in Boots UK),OP_5D2_6992__000002_LN57DZ,OPT,311-312 High Street,,,Lincoln,Lincolnshire,LN5 7DZ,Tel: 01522 536982, - ,,,1 rating Rate it yourself - /Services/opticians/LeaveReview/DefaultView.aspx?id=OP_5D2_6992__000002_LN57DZ,,,
Boots-Lincoln - High St,OP_5D2_7188__000001_LN57AL,OPT,192 High Street,,,Lincoln,Lincolnshire,LN5 7AL,Tel: 01522 523 960, - ,,,1 rating Rate it yourself - /Services/opticians/LeaveReview/DefaultView.aspx?id=OP_5D2_7188__000001_LN57AL,,,
E R Dixon Ltd,OP_5D2_2970__000002_LN57AL,OPT,,194 High Street,,Lincoln,,LN5 7AL,Tel: 01522 523786, - ,,,No ratings yet Rate it yourself - /Services/opticians/LeaveReview/DefaultView.aspx?id=OP_5D2_2970__000002_LN57AL,0,0,no
Specsavers Opticians,OP_5D2_2444__000001_LN57DW,OPT,324 High Street,,Lincoln,,,LN5 7DW,Tel: 01522 576655, - ,,,No ratings yet Rate it yourself - /Services/opticians/LeaveReview/DefaultView.aspx?id=OP_5D2_2444__000001_LN57DW,0,0,no
Specsavers Opticians,OP_5D2_14302__000001_LN67QL,OPT,Unit 4,Morrisons Supermarket,Tritton Road,Lincoln,,LN6 7QL,Tel: 01522 572710, - ,,,No ratings yet Rate it yourself - /Services/opticians/LeaveReview/DefaultView.aspx?id=OP_5D2_14302__000001_LN67QL,0,0,yes
Edwards Opticians,OP_5E3_4047__000001_HU151HW,OPT,1 Stockbridge Road,,Elloughton,E Yorkshire,,HU15 1HW,Tel: 01482 668712, - ,,,No ratings yet Rate it yourself - /Services/opticians/LeaveReview/DefaultView.aspx?id=OP_5E3_4047__000001_HU151HW,0,0,
Yeomans Opticians Ltd,OP_5D2_13821__000003_LN60QQ,OPT,,"Unit 23, Birchwood Shopping Centre",Jasmin Road,Lincoln,Lincolnshire,LN6 0QQ,Tel: 01522 694548, - ,,,No ratings yet Rate it yourself - /Services/opticians/LeaveReview/DefaultView.aspx?id=OP_5D2_13821__000003_LN60QQ,0,0,yes
Abbey Eyewear,OP_5EK_13597__000001_DN119QP,OPT,3 Castle Gate,Tickhill,Doncaster,,,DN11 9QP,Tel: 01302 750250, - ,,,No ratings yet Rate it yourself - /Services/opticians/LeaveReview/DefaultView.aspx?id=OP_5EK_13597__000001_DN119QP,0,0,
John Tomlinson Mobile Optician,OP_5E3_13036__000001_HU152UB,OPT,Mobile Optician,Village Hall Car Park,Gilberdyke,,,HU15 2UB,Tel: 07976 567487, - ,,,No ratings yet Rate it yourself - /Services/opticians/LeaveReview/DefaultView.aspx?id=OP_5E3_13036__000001_HU152UB,0,0,
Specsavers Hessle,OP_5E3_3367__000001_HU130RD,OPT,44-46 Prestongate,,Hessle,,,HU13 0RE,Tel: 01482 640971, - ,,,3 ratings Rate it yourself - /Services/opticians/LeaveReview/DefaultView.aspx?id=OP_5E3_3367__000001_HU130RD,,,
Vision Call Yorkshire Limited,OP_5EA_14805__000003_DN13RE,OPT,Nidd House,Richmond Business Park,Sidlings Court,Doncaster,,DN4 5NL,Tel: 01302 738800, - ,,,No ratings yet Rate it yourself - /Services/opticians/LeaveReview/DefaultView.aspx?id=OP_5EA_14805__000003_DN13RE,0,0,
Vision Call Mobile Optician,OP_DN45NL_30044,OPT,Nidd House,Richmond Business Park,Sidings Court,Doncaster,,DN4 5NL,Tel: 01302 738800, - ,,,1 rating Rate it yourself - /Services/opticians/LeaveReview/DefaultView.aspx?id=OP_DN45NL_30044,,,
Bush Opticians (Hull) Ltd,OP_5E3_8458__000001_HU130RU,OPT,18 The Weir,Hessle,,East Yorkshire,,HU13 0RU,Tel: 01482 648919, - ,,,No ratings yet Rate it yourself - /Services/opticians/LeaveReview/DefaultView.aspx?id=OP_5E3_8458__000001_HU130RU,0,0,
Eye Contact Opticians,OP_5E3_4150__000002_HU130AA,OPT,8 The Orchard Centre,,Hessle,,,HU13 0AA,Tel: 01482 645369, - ,,,No ratings yet Rate it yourself - /Services/opticians/LeaveReview/DefaultView.aspx?id=OP_5E3_4150__000002_HU130AA,0,0,
The Partially Sighted Society,OPT_DN26AA_1,OPT,,1 Bennetthorpe,,Doncaster,,DN2 6AA,Tel: 01302 965195, - ,,,No ratings yet Rate it yourself - /Services/opticians/LeaveReview/DefaultView.aspx?id=OPT_DN26AA_1,0,0,
John Tomlinson Mobile Optician,OP_5E3_13031__000001_HU152PR,OPT,Mobile Unit,Recreation Club (Thur Pm Alt),,"Main Street, Newport",,HU15 2PR,Tel: 07976 567487, - ,,,No ratings yet Rate it yourself - /Services/opticians/LeaveReview/DefaultView.aspx?id=OP_5E3_13031__000001_HU152PR,0,0,
Vision Call Yorkshire (Community Eyecare Limited),MOB/231/5N7__000001_DN13PE,OPT,Kelham House,Kelham Street,Doncaster,,,DN1 3PE,, - ,,,No ratings yet Rate it yourself - /Services/opticians/LeaveReview/DefaultView.aspx?id=MOB/231/5N7__000001_DN13PE,0,0,
UH Ltd T/A A C Smith Opticians,OP_5CK_3183__000001_DN11NE,OPT,34 Market Place,,Doncaster,,,DN1 1NE,Tel: 01302 344569, - ,,,No ratings yet Rate it yourself - /Services/opticians/LeaveReview/DefaultView.aspx?id=OP_5CK_3183__000001_DN11NE,0,0,
Rayner Opticians,OP_5D2_7512__000001_LN67PX,OPT,5 Rookery Lane,,,Lincoln,Lincolnshire,LN6 7PX,Tel: 01522 527974, - ,,,No ratings yet Rate it yourself - /Services/opticians/LeaveReview/DefaultView.aspx?id=OP_5D2_7512__000001_LN67PX,0,0,yes
The Cotler Practice,CO-2482__000002_DN11DW,OPT,18 High Street,,Doncaster,South Yorkshire,,DN1 1DW,Tel: 01302 361638, - ,,,No ratings yet Rate it yourself - /Services/opticians/LeaveReview/DefaultView.aspx?id=CO-2482__000002_DN11DW,0,0,
H Dickinson & Co,OP_5CK_10070__000001_DN11ES,OPT,,,38 Scot Lane,Doncaster,,DN1 1ES,Tel: 01302 344811, - ,,,No ratings yet Rate it yourself - /Services/opticians/LeaveReview/DefaultView.aspx?id=OP_5CK_10070__000001_DN11ES,0,0,
Tesco Opticians,CO 1991__000001_DN48SN,OPT,The Tesco Store,Woodfield Way,Balby,Doncaster,,DN4 8SN,Tel: 0345 677 9207, - ,,,No ratings yet Rate it yourself - /Services/opticians/LeaveReview/DefaultView.aspx?id=CO 1991__000001_DN48SN,0,0,
Rayner Opticians ,OP_5CK_5426__000001_DN11HQ,OPT,,37a  Printing Office Street,,Doncaster,South Yorkshire,DN1 1TP,Tel: 01302 323101, - ,,,No ratings yet Rate it yourself - /Services/opticians/LeaveReview/DefaultView.aspx?id=OP_5CK_5426__000001_DN11HQ,0,0,
Scrivens Ltd,OP_5CK_1079__000001_DN13JU,OPT,23 Printing Office Street,,,Doncaster,Yorkshire,DN1 1TP,Tel: 01302 323157, - ,,,No ratings yet Rate it yourself - /Services/opticians/LeaveReview/DefaultView.aspx?id=OP_5CK_1079__000001_DN13JU,0,0,
Edwards & Walker,OP_5CK_11152__000001_DN11TR,OPT,Edwards and Walker Opticians,16 Priory Place,Doncaster,Doncaster,South Yorkshire,DN1 1BZ,Tel: 01302 349193, - ,,,1 rating Rate it yourself - /Services/opticians/LeaveReview/DefaultView.aspx?id=OP_5CK_11152__000001_DN11TR,,,
Parkhurst Opticians Ltd,OP_5CK_3413__000001_DN11SY,OPT,21 Printing Office Street,,Doncaster,,,DN1 1TZ,Tel: 01302 369744, - ,,,2 ratings Rate it yourself - /Services/opticians/LeaveReview/DefaultView.aspx?id=OP_5CK_3413__000001_DN11SY,,,
Murgatroyd Opticians,CO-2205__000002_DN121BS,OPT,"Kelham House, Kelham Street",,Doncaster,South Yorkshire,,DN1 3RE,Tel: 01302 329511, - ,,,No ratings yet Rate it yourself - /Services/opticians/LeaveReview/DefaultView.aspx?id=CO-2205__000002_DN121BS,0,0,
Vision Value Opticians,OP_5CK_5973__000001_DN11TD,OPT,33 St. Sepulchre Gate,,Doncaster,,,DN1 1TD,Tel: 01302 768691, - ,,,1 rating Rate it yourself - /Services/opticians/LeaveReview/DefaultView.aspx?id=OP_5CK_5973__000001_DN11TD,,,
Specsavers Opticians,OP_5CK_5787__000002_DN11TD,OPT,9 St. Sepulchre Gate,,Doncaster,,,DN1 1TD,Tel: 01302 326557, - ,,,No ratings yet Rate it yourself - /Services/opticians/LeaveReview/DefaultView.aspx?id=OP_5CK_5787__000002_DN11TD,0,0,
Bell Brothers (Opticians) Ltd,OP_5CK_13596__000001_DN11DB,OPT,Bell Brothers Opticians,27 St. Sepulchre Gate,,Doncaster,South Yorkshire,DN1 1TD,Tel: 01302 323619, - ,,,No ratings yet Rate it yourself - /Services/opticians/LeaveReview/DefaultView.aspx?id=OP_5CK_13596__000001_DN11DB,0,0,
Opticial Express,OP_12345_DN1 1QQ,OPT,20/22 Frenchgate,,,Doncaster,South Yorkshire,DN1 1QQ,Tel: 0800 023 2020, - ,,,No ratings yet Rate it yourself - /Services/opticians/LeaveReview/DefaultView.aspx?id=OP_12345_DN1 1QQ,0,0,
Boots-Doncaster - North Mall,OP_5CK_231__000001_DN11SR,OPT,The Frenchgate Centre,11 North Mall,,Doncaster,South Yorkshire,DN1 1SR,Tel: 01302 329873, - ,,,No ratings yet Rate it yourself - /Services/opticians/LeaveReview/DefaultView.aspx?id=OP_5CK_231__000001_DN11SR,0,0,
Vision Express (UK) Ltd,CO-3137__000001_DN11LJ,OPT,28 Frenchgate,Doncaster,,South Yorkshire,,DN1 1LJ,Tel: 01302 366555, - ,,,1 rating Rate it yourself - /Services/opticians/LeaveReview/DefaultView.aspx?id=CO-3137__000001_DN11LJ,,,
Boots-Doncaster - North Bridge Rd,5CKOO154__000001_DN59AN,OPT,18 - 24 North Bridge Road,,Doncaster,South Yorkshire,,DN5 9AN,Tel: 01302 321 515, - ,,,No ratings yet Rate it yourself - /Services/opticians/LeaveReview/DefaultView.aspx?id=5CKOO154__000001_DN59AN,0,0,
Asda Opticians,190920161532,OPT,,Newark Road,,Lincoln,,LN6 8JY,Tel: 01522 581148, - ,,,No ratings yet Rate it yourself - /Services/opticians/LeaveReview/DefaultView.aspx?id=190920161532,0,0,
Jane Gray Eyecare Ltd,OP_5E3_8347__000001_HU107AN,OPT,7 Wilson Street,,Anlaby,E Yorkshire,,HU10 7AN,Tel: 01482 651531, - ,,,2 ratings Rate it yourself - /Services/opticians/LeaveReview/DefaultView.aspx?id=OP_5E3_8347__000001_HU107AN,,,
Parkhurst Opticians Ltd,OP_5EL_5106__000001_DN50AT,OPT,110 High Street,Bentley,,Doncaster,,DN5 0AT,Tel: 01405 740095, - ,,,1 rating Rate it yourself - /Services/opticians/LeaveReview/DefaultView.aspx?id=OP_5EL_5106__000001_DN50AT,,,
Smith & Walker (Optometrists) Ltd,OP_5AN_8150__000001_DN402AE,OPT,2 Kennedy Way,,,Immingham,,DN40 2AE,Tel: 01469 572702, - ,,,No ratings yet Rate it yourself - /Services/opticians/LeaveReview/DefaultView.aspx?id=OP_5AN_8150__000001_DN402AE,0,0,
John Tomlinson Mobile Optician,OP_5E3_13034__000001_HU151QT,OPT,Mobile Unit,The Library Car Park,Church Street (Tues 9-12.15pm Alt),,,HU15 1QT,Tel: 07976 567487, - ,,,No ratings yet Rate it yourself - /Services/opticians/LeaveReview/DefaultView.aspx?id=OP_5E3_13034__000001_HU151QT,0,0,
Sight Care UK Ltd,OP_5E3_8924__000001_HU106BN,OPT,4 Kingston Road,,Willerby,,,HU10 6BN,Tel: 01482 658048, - ,,,1 rating Rate it yourself - /Services/opticians/LeaveReview/DefaultView.aspx?id=OP_5E3_8924__000001_HU106BN,,,
Michael James t/a Garner Opticians,OP_5E3_3141__000001_DN149HE,OPT,11 Market Place,SNAITH,,Goole,,DN14 9HE,Tel: 01405 862364, - ,,,No ratings yet Rate it yourself - /Services/opticians/LeaveReview/DefaultView.aspx?id=OP_5E3_3141__000001_DN149HE,0,0,
Asda Opticians,OP_5E6_14670__000001_HU34PE,OPT,Hessle Road,,,Hull,,HU3 4PE,Tel: 01482 596620, - ,,,No ratings yet Rate it yourself - /Services/opticians/LeaveReview/DefaultView.aspx?id=OP_5E6_14670__000001_HU34PE,0,0,