Organisation Name,NACS Code,Organisation Type,Address1,Address2,Address3,Address4,Address5,PostCode,Telephone Number,Opening time,Value  (Opening time),Banding Classification  (Opening time),NHS.UK users rating,Value  (NHS.UK users rating),Banding Classification  (NHS.UK users rating),Car parking (Is there car parking at this organisation?)
Lunettes Opticians Ltd,OP_NG349DT_84705,OPT,,24 High Street,,Ruskington,Lincolnshire,NG34 9DW,Tel: 01526 834466, - ,,,No ratings yet Rate it yourself - /Services/opticians/LeaveReview/DefaultView.aspx?id=OP_NG349DT_84705,0,0,
Hunts of Sleaford,OP_5D3_900__000001_NG347SR,OPT,,11 Market Place,,Sleaford,Lincolnshire,NG34 7SR,Tel: 01529 302122, - ,,,No ratings yet Rate it yourself - /Services/opticians/LeaveReview/DefaultView.aspx?id=OP_5D3_900__000001_NG347SR,0,0,yes
E R Dixon Ltd,OP_5D3_910__000001_NG347PD,OPT,6 Southgate Shopping Precinct,Southgate,Sleaford,,,NG34 7PD,Tel: 01529 414212, - ,,,No ratings yet Rate it yourself - /Services/opticians/LeaveReview/DefaultView.aspx?id=OP_5D3_910__000001_NG347PD,0,0,yes
Lunettes Opticians,OP_5D3_14934__000001_NG347RL,OPT,,70 Southgate,,Sleaford,Lincolnshire,NG34 7RL,Tel: 01529 414066, - ,,,No ratings yet Rate it yourself - /Services/opticians/LeaveReview/DefaultView.aspx?id=OP_5D3_14934__000001_NG347RL,0,0,no
Opticks Opticians,OP_5H9_2501__000001_LN106QL,OPT,,7 Station Road,Woodhall Spa,Lincolnshire,,LN10 6QL,Tel: 01526 352236, - ,,,No ratings yet Rate it yourself - /Services/opticians/LeaveReview/DefaultView.aspx?id=OP_5H9_2501__000001_LN106QL,0,0,
Rayner Opticians,OP_5D2_7512__000001_LN67PX,OPT,5 Rookery Lane,,,Lincoln,Lincolnshire,LN6 7PX,Tel: 01522 527974, - ,,,No ratings yet Rate it yourself - /Services/opticians/LeaveReview/DefaultView.aspx?id=OP_5D2_7512__000001_LN67PX,0,0,yes
Asda Opticians,190920161532,OPT,,Newark Road,,Lincoln,,LN6 8JY,Tel: 01522 581148, - ,,,No ratings yet Rate it yourself - /Services/opticians/LeaveReview/DefaultView.aspx?id=190920161532,0,0,
Peebles & Hilton,OP_5H9_2611__000002_LN44SG,OPT,,16 Silver Street,,Coningsby,Lincolnshire,LN4 4SG,Tel: 01526 344556, - ,,,No ratings yet Rate it yourself - /Services/opticians/LeaveReview/DefaultView.aspx?id=OP_5H9_2611__000002_LN44SG,0,0,no
Specsavers Opticians,OP_5D2_2444__000001_LN57DW,OPT,324 High Street,,Lincoln,,,LN5 7DW,Tel: 01522 576655, - ,,,No ratings yet Rate it yourself - /Services/opticians/LeaveReview/DefaultView.aspx?id=OP_5D2_2444__000001_LN57DW,0,0,no
E R Dixon Ltd,OP_5D2_2970__000002_LN57AL,OPT,,194 High Street,,Lincoln,,LN5 7AL,Tel: 01522 523786, - ,,,No ratings yet Rate it yourself - /Services/opticians/LeaveReview/DefaultView.aspx?id=OP_5D2_2970__000002_LN57AL,0,0,no
Boots-Lincoln - High St,OP_5D2_7188__000001_LN57AL,OPT,192 High Street,,,Lincoln,Lincolnshire,LN5 7AL,Tel: 01522 523 960, - ,,,1 rating Rate it yourself - /Services/opticians/LeaveReview/DefaultView.aspx?id=OP_5D2_7188__000001_LN57AL,,,
Boots-Lincoln - High St (in Boots UK),OP_5D2_6992__000002_LN57DZ,OPT,311-312 High Street,,,Lincoln,Lincolnshire,LN5 7DZ,Tel: 01522 536982, - ,,,1 rating Rate it yourself - /Services/opticians/LeaveReview/DefaultView.aspx?id=OP_5D2_6992__000002_LN57DZ,,,
Vision Express (UK) Ltd,OP_5D2_10307__000003_LN21AP,OPT,Unit 8 Waterside Shopping Centre,High Street,Lincoln,Lincolnshire,,LN2 1AP,Tel: 01522 560111, - ,,,No ratings yet Rate it yourself - /Services/opticians/LeaveReview/DefaultView.aspx?id=OP_5D2_10307__000003_LN21AP,0,0,
Martin Smith Opticians Ltd,OP_5D2_2805__000001_LN21DH,OPT,22 Saltergate,,Lincoln,,,LN2 1DH,Tel: 01522 521100, - ,,,No ratings yet Rate it yourself - /Services/opticians/LeaveReview/DefaultView.aspx?id=OP_5D2_2805__000001_LN21DH,0,0,yes
Optique Vision,C/0117-Q59_LN2 1DH,OPT,The Stonebow,224 High Street,,Lincoln,Lincolnshire,LN2 1AH,Tel: 01522244390, - ,,,1 rating Rate it yourself - /Services/opticians/LeaveReview/DefaultView.aspx?id=C/0117-Q59_LN2 1DH,,,yes
Water Lane Opticians,OP_5D2_13818__000001_LN11TY,OPT,5 Water Lane,Lincoln,,,,LN1 1TY,Tel: 01522 525395, - ,,,No ratings yet Rate it yourself - /Services/opticians/LeaveReview/DefaultView.aspx?id=OP_5D2_13818__000001_LN11TY,0,0,
Specsavers Opticians,OP_5D2_14302__000001_LN67QL,OPT,Unit 4,Morrisons Supermarket,Tritton Road,Lincoln,,LN6 7QL,Tel: 01522 572710, - ,,,No ratings yet Rate it yourself - /Services/opticians/LeaveReview/DefaultView.aspx?id=OP_5D2_14302__000001_LN67QL,0,0,yes
Tesco Opticians,TP6NY,OPT,,Wragby Road,,Lincoln,,LN2 4QQ,, - ,,,No ratings yet Rate it yourself - /Services/opticians/LeaveReview/DefaultView.aspx?id=TP6NY,0,0,
Opticial Express,OP_12345_LN1 1XP,OPT,"2nd Floor, Lincoln House",37 Newland,,Lincoln,Lincolnshire,LN1 1XP,Tel: 0800 023 2020, - ,,,No ratings yet Rate it yourself - /Services/opticians/LeaveReview/DefaultView.aspx?id=OP_12345_LN1 1XP,0,0,
Craig Leaver Eyecare,OP_5D2_13820__000001_LN24QP,OPT,2 Bunkers Hill,Lincoln,,",",,LN2 4QP,Tel: 01522 522088, - ,,,No ratings yet Rate it yourself - /Services/opticians/LeaveReview/DefaultView.aspx?id=OP_5D2_13820__000001_LN24QP,0,0,
Mucklow & Hardy,OP_5D2_13819__000001_LN21QA,OPT,Clear View Opticians,6a Eastgate,,Lincoln,Lincolnshire,LN2 1QA,Tel: 01522 538889, - ,,,No ratings yet Rate it yourself - /Services/opticians/LeaveReview/DefaultView.aspx?id=OP_5D2_13819__000001_LN21QA,0,0,no
Vision Care @ No 8 (Julian Gunn & Jason Rickaby),OP_5D2_14304__000001_LN13AJ,OPT,3 Gordon Road,8 Gordon Road,,Lincoln,,LN1 3AJ,Tel: 01522 530088, - ,,,No ratings yet Rate it yourself - /Services/opticians/LeaveReview/DefaultView.aspx?id=OP_5D2_14304__000001_LN13AJ,0,0,
Harold Barnaby Optical Services,OP_5D2_13817__000001_LN24BL,OPT,,31 Mainwaring Road,,Lincoln,,LN2 4BL,Tel: 01522 524732, - ,,,No ratings yet Rate it yourself - /Services/opticians/LeaveReview/DefaultView.aspx?id=OP_5D2_13817__000001_LN24BL,0,0,yes
Clear View Vision Ltd (Mrs Annabelle Magee),LN1_3LW_1,OPT,Clear View Opticians,169 Burton Road,,Lincoln,Lincolnshire,LN1 3LW,Tel: 01522 542121, - ,,,No ratings yet Rate it yourself - /Services/opticians/LeaveReview/DefaultView.aspx?id=LN1_3LW_1,0,0,yes
Yeomans Opticians Ltd,OP_5D2_13821__000003_LN60QQ,OPT,,"Unit 23, Birchwood Shopping Centre",Jasmin Road,Lincoln,Lincolnshire,LN6 0QQ,Tel: 01522 694548, - ,,,No ratings yet Rate it yourself - /Services/opticians/LeaveReview/DefaultView.aspx?id=OP_5D2_13821__000003_LN60QQ,0,0,yes
David Burghardt Vision Care (David Burghardt),OP_5D2_1569__000002_LN22PD,OPT,1 Church Street,Nettleham,Lincoln,",",,LN2 2PD,Tel: 01522 754821, - ,,,No ratings yet Rate it yourself - /Services/opticians/LeaveReview/DefaultView.aspx?id=OP_5D2_1569__000002_LN22PD,0,0,
Boots-Horncastle,OP_5H9_5286__000001_LN95HZ,OPT,,10 Bridge Street,Horncastle,Lincolnshire,,LN9 5HZ,Tel: 01507 527044, - ,,,No ratings yet Rate it yourself - /Services/opticians/LeaveReview/DefaultView.aspx?id=OP_5H9_5286__000001_LN95HZ,0,0,
Horncastle Opticians (Garry Crome),OP_5H9_8477__000002_LN95BL,OPT,,6a High Street,,Horncastle,Lincolnshire,LN9 5BL,Tel: 01507 526205, - ,,,No ratings yet Rate it yourself - /Services/opticians/LeaveReview/DefaultView.aspx?id=OP_5H9_8477__000002_LN95BL,0,0,no
Boots Opticians (Adams Eyecare Ltd),OP_5D3_5457__000001_NG319PH,OPT,,32 High Street,,Grantham,,NG31 9PH,Tel: 01476 594474, - ,,,No ratings yet Rate it yourself - /Services/opticians/LeaveReview/DefaultView.aspx?id=OP_5D3_5457__000001_NG319PH,0,0,Data not available
Clark Family Eyecare Ltd,OP_PE114ST_46350,OPT,Clark Family Eyecare,20 Market Place,Donington,Spalding,Lincolnshire,PE11 4ST,Tel: 01775 821888, - ,,,No ratings yet Rate it yourself - /Services/opticians/LeaveReview/DefaultView.aspx?id=OP_PE114ST_46350,0,0,yes
Richards Opticians,OP_5AP_3771__000001_NG241PX,OPT,Harry's Eyewear,5-7 Barnby Gate,,Newark,Nottinghamshire,NG24 1PX,Tel: 01636 704656, - ,,,No ratings yet Rate it yourself - /Services/opticians/LeaveReview/DefaultView.aspx?id=OP_5AP_3771__000001_NG241PX,0,0,
J:D Opticians,TP3XC,OPT,,17/19 Appleton Gate   ,,Newark,,NG24 1JR,Tel: 01636 611133, - ,,,No ratings yet Rate it yourself - /Services/opticians/LeaveReview/DefaultView.aspx?id=TP3XC,0,0,
Specsavers Opticians,OP_5AP_12095__000001_NG241EW,OPT,c/o Morrisons Superstore,Kings Road,Newark,,,NG24 1EW,Tel: 01636 611599, - ,,,No ratings yet Rate it yourself - /Services/opticians/LeaveReview/DefaultView.aspx?id=OP_5AP_12095__000001_NG241EW,0,0,
Asda Opticians,TP7AK,OPT,,Asda Grantham Superstore,,Grantham,,NG31 6NZ,Tel: 01476 581512, - ,,,No ratings yet Rate it yourself - /Services/opticians/LeaveReview/DefaultView.aspx?id=TP7AK,0,0,
Boots-Grantham - High St,NG31 6PH_19273,OPT,,32 High Street,,Grantham,Lincolnshire,NG31 6PH,Tel: 01476 594474, - ,,,No ratings yet Rate it yourself - /Services/opticians/LeaveReview/DefaultView.aspx?id=NG31 6PH_19273,0,0,
Scrivens Ltd,OP_NG316PH_34927,OPT,,35a High Street,,Grantham,Lincolnshire,NG31 6PH,Tel: 01476 573931, - ,,,No ratings yet Rate it yourself - /Services/opticians/LeaveReview/DefaultView.aspx?id=OP_NG316PH_34927,0,0,
Lunettes Opticians,OP_5D3_459__000001_NG316LH,OPT,,25 The George Shopping Centre,,Grantham,,NG31 6LH,Tel: 01476 591793, - ,,,No ratings yet Rate it yourself - /Services/opticians/LeaveReview/DefaultView.aspx?id=OP_5D3_459__000001_NG316LH,0,0,no
Scrivens Ltd,OP_5AP_5472__000002_NG241UD,OPT,10 The Arcade,,,Newark,Nottinghamshire,NG24 1UD,Tel: 01636 704503, - ,,,No ratings yet Rate it yourself - /Services/opticians/LeaveReview/DefaultView.aspx?id=OP_5AP_5472__000002_NG241UD,0,0,
Morris & Kon,OP_5D3_6913__000001_NG316TS,OPT,8 St. Catherines Road,,Grantham,,,NG31 6TS,Tel: 01476 564766, - ,,,No ratings yet Rate it yourself - /Services/opticians/LeaveReview/DefaultView.aspx?id=OP_5D3_6913__000001_NG316TS,0,0,
Opticare Midlands Limited,OP_5AP_9380__000001_NG241DH,OPT,3 Paxton Court,,Newark,,,NG24 1DH,Tel: 01636 679555, - ,,,No ratings yet Rate it yourself - /Services/opticians/LeaveReview/DefaultView.aspx?id=OP_5AP_9380__000001_NG241DH,0,0,
Boots-Newark,OP_5AP_11578__000001_NG241EG,OPT,31-32 Market Place,,,Newark,Nottinghamshire,NG24 1EG,Tel: 01636 702057, - ,,,No ratings yet Rate it yourself - /Services/opticians/LeaveReview/DefaultView.aspx?id=OP_5AP_11578__000001_NG241EG,0,0,
Neville Clark,OP_NG319ZQ_46952,OPT,Home Eyecare,PO Box 2826,,Grantham,Lincolnshire,NG31 9ZQ,Tel: 01476 590353, - ,,,No ratings yet Rate it yourself - /Services/opticians/LeaveReview/DefaultView.aspx?id=OP_NG319ZQ_46952,0,0,
Neville Clarke Optometrist,OP_5PA_281010_1__000002_NG319ZQ,OPT,Home Eyecare,PO Box 2826,,Grantham,Lincolnshire,NG31 9ZQ,Tel: 01476 590353, - ,,,No ratings yet Rate it yourself - /Services/opticians/LeaveReview/DefaultView.aspx?id=OP_5PA_281010_1__000002_NG319ZQ,0,0,
Neville Clark,OP_5GD_12412__000001_NG319PL,OPT,Home Eyecare,PO Box 2826,,Grantham,Lincolnshire,NG31 9ZQ,Tel: 01476 590353, - ,,,No ratings yet Rate it yourself - /Services/opticians/LeaveReview/DefaultView.aspx?id=OP_5GD_12412__000001_NG319PL,0,0,
Clark - Neville,MOB/01-12412/5N8__000001_NG319ZQ,OPT,Home Eyecare,PO Box 2826,,Grantham,Lincolnshire,NG31 9ZQ,Tel: 01476 590353, - ,,,No ratings yet Rate it yourself - /Services/opticians/LeaveReview/DefaultView.aspx?id=MOB/01-12412/5N8__000001_NG319ZQ,0,0,
London Eye Bespoke Eyewear,CO-0099,OPT,,9 Chain Lane,,Newark,,NG24 1AU,, - ,,,No ratings yet Rate it yourself - /Services/opticians/LeaveReview/DefaultView.aspx?id=CO-0099,0,0,
Specsavers Opticians,OP_5D3_1423__000001_NG316EE,OPT,Isaac Newton Centre,,Grantham,,,NG31 6EE,Tel: 01476 572111, - ,,,No ratings yet Rate it yourself - /Services/opticians/LeaveReview/DefaultView.aspx?id=OP_5D3_1423__000001_NG316EE,0,0,
Duffy Optometrists,OP_5AP_8716__000001_NG241JT,OPT,51 Stodman Street,,Newark,Nottinghamshire,,NG24 1AW,Tel: 01636 705677, - ,,,No ratings yet Rate it yourself - /Services/opticians/LeaveReview/DefaultView.aspx?id=OP_5AP_8716__000001_NG241JT,0,0,
Charlotte Saunders Ltd (Charlotte Saunders),OP_NG236QA_34422,OPT,,5 High Street,,Newark,,NG23 6QA,Tel: 07898695809, - ,,,No ratings yet Rate it yourself - /Services/opticians/LeaveReview/DefaultView.aspx?id=OP_NG236QA_34422,0,0,
Peebles & Hilton,OP_5H9_2503__000002_PE216PA,OPT,Lyndon,Tawney Street,,Boston,,PE21 6PA,Tel: 01205 365395, - ,,,No ratings yet Rate it yourself - /Services/opticians/LeaveReview/DefaultView.aspx?id=OP_5H9_2503__000002_PE216PA,0,0,yes
Dollond & Aitchison,OP_5H9_5271__000001_PE216LS,OPT,8 Market Place,Boston,Lincolnshire,,,PE21 6LS,Tel: 01205 351414, - ,,,No ratings yet Rate it yourself - /Services/opticians/LeaveReview/DefaultView.aspx?id=OP_5H9_5271__000001_PE216LS,0,0,
Boots-Boston,OP_PE216LS_17891,OPT,,8 Market Place,,Boston,Lincolnshire,PE21 6EH,Tel: 01205 351414, - ,,,No ratings yet Rate it yourself - /Services/opticians/LeaveReview/DefaultView.aspx?id=OP_PE216LS_17891,0,0,
Specsavers Opticians,OP_5H9_1081__000002_PE216EH,OPT,29a Market Place,,Boston,,,PE21 6EH,Tel: 01205 353263, - ,,,No ratings yet Rate it yourself - /Services/opticians/LeaveReview/DefaultView.aspx?id=OP_5H9_1081__000002_PE216EH,0,0,
R & T Opticians,OP_5H9_2127__000001_PE216EU,OPT,30-32 Dolphin Lane,,Boston,,,PE21 6EU,Tel: 01205 355550, - ,,,1 rating Rate it yourself - /Services/opticians/LeaveReview/DefaultView.aspx?id=OP_5H9_2127__000001_PE216EU,,,yes
David Hallgate Optometrists (I.O.E Ltd),OP_5H9_13813__000001_PE216SE,OPT,,86/88 Wide Bargate,,Boston,Lincolnshire,PE21 6SE,Tel: 01205 310 710, - ,,,1 rating Rate it yourself - /Services/opticians/LeaveReview/DefaultView.aspx?id=OP_5H9_13813__000001_PE216SE,,,yes
Enderbys of Boston,OP_5H9_13814__000002_PE216SE,OPT,,84 Wide Bargate,,Boston,,PE21 6SE,Tel: 01205 311181, - ,,,1 rating Rate it yourself - /Services/opticians/LeaveReview/DefaultView.aspx?id=OP_5H9_13814__000002_PE216SE,,,no
Greenwood Opticians,OP_5D2_3341__000001_LN83HL,OPT,25 Market Place,,,Market Rasen,Lincolnshire,LN8 3HL,Tel: 01673 842265, - ,,,8 ratings Rate it yourself - /Services/opticians/LeaveReview/DefaultView.aspx?id=OP_5D2_3341__000001_LN83HL,,,
Spilsby Opticians,OP_5H9_8478__000001_PE235EF,OPT,6 Church Street,,Spilsby,,,PE23 5EF,Tel: 01790 753948, - ,,,No ratings yet Rate it yourself - /Services/opticians/LeaveReview/DefaultView.aspx?id=OP_5H9_8478__000001_PE235EF,0,0,no
Minster Optical Limited t/a Andrew Spybey & Associates,TP80E,OPT,,Willoughby House,,Nottinghamshire,,NG25 0HQ,, - ,,,No ratings yet Rate it yourself - /Services/opticians/LeaveReview/DefaultView.aspx?id=TP80E,0,0,
Pinder's Optometrists,OP_5AP_877__000003_NG250AA,OPT,20 Queen Street,,Southwell,,,NG25 0AA,Tel: 01636 812286, - ,,,No ratings yet Rate it yourself - /Services/opticians/LeaveReview/DefaultView.aspx?id=OP_5AP_877__000003_NG250AA,0,0,
"Specsavers Bourne (I Stradling, N Stradling & K Stradlling)",OP_5D3_3252__000001_PE109NS,OPT,,Unit 11,The Burghley Centre,Bourne,Lincolnshire,PE10 9EG,Tel: 01778 422402, - ,,,1 rating Rate it yourself - /Services/opticians/LeaveReview/DefaultView.aspx?id=OP_5D3_3252__000001_PE109NS,,,
Scrivens Ltd,OP_5D3_5467__000001_PE109NE,OPT,Unit 1 Crown Walk,West Street,,Bourne,Lincolnshire,PE10 9NE,Tel: 01778 425995, - ,,,No ratings yet Rate it yourself - /Services/opticians/LeaveReview/DefaultView.aspx?id=OP_5D3_5467__000001_PE109NE,0,0,
One Stop Eye Care Centre,OP_5D3_14935__000002_PE109NE,OPT,2 West Street,Bourne,,,,PE10 9NE,Tel: 01778 421188, - ,,,No ratings yet Rate it yourself - /Services/opticians/LeaveReview/DefaultView.aspx?id=OP_5D3_14935__000002_PE109NE,0,0,
Stephen Hewitt eyecare,OP_5H9_13823__000001_LN119JG,OPT,21 Mercer Row,Louth,,.,,LN11 9JG,Tel: 01507 607276, - ,,,No ratings yet Rate it yourself - /Services/opticians/LeaveReview/DefaultView.aspx?id=OP_5H9_13823__000001_LN119JG,0,0,
Louth Vision Centre,OP_5H9_13828__000001_LN119NR,OPT,,Louth Vision Centre,4 Market Place,Louth,Lincolnshire,LN11 9NR,Tel: 01507 609499, - ,,,3 ratings Rate it yourself - /Services/opticians/LeaveReview/DefaultView.aspx?id=OP_5H9_13828__000001_LN119NR,,,
Eyecare Centre,OP_5H9_2126__000001_PE111BH,OPT,,6 Sheepmarket,,Spalding,,PE11 1BH,Tel: 01775 722141, - ,,,No ratings yet Rate it yourself - /Services/opticians/LeaveReview/DefaultView.aspx?id=OP_5H9_2126__000001_PE111BH,0,0,no
Specsavers Opticians,OP_PE111SG_34925,OPT,,31 Hall Place,,Spalding,,PE11 1SG,, - ,,,No ratings yet Rate it yourself - /Services/opticians/LeaveReview/DefaultView.aspx?id=OP_PE111SG_34925,0,0,
Vision Express Spalding,01-17534,OPT,,9 Hall Place,,Spalding,,PE11 1SR,Tel: 01775 719872, - ,,,1 rating Rate it yourself - /Services/opticians/LeaveReview/DefaultView.aspx?id=01-17534,,,
Boots-Spalding,OP_5H9_668__000002_PE111XA,OPT,16 Bridge Street,,,Spalding,Lincolnshire,PE11 1XA,Tel: 01775 723 479, - ,,,No ratings yet Rate it yourself - /Services/opticians/LeaveReview/DefaultView.aspx?id=OP_5H9_668__000002_PE111XA,0,0,
Gainsborough VisionPlus Ltd,OPT082__000001_DN212NA,OPT,"Unit 22, Marshalls Yard",Beaumont Street,Gainsborough,Lincolnshire,,DN21 2NA,Tel: 01472 619870, - ,,,No ratings yet Rate it yourself - /Services/opticians/LeaveReview/DefaultView.aspx?id=OPT082__000001_DN212NA,0,0,
Davies-Todd Opticians Ltd,OP_5D2_6710__000002_DN212BE,OPT,12 Market Street,,Gainsborough,,,DN21 2BE,Tel: 01427 612853, - ,,,No ratings yet Rate it yourself - /Services/opticians/LeaveReview/DefaultView.aspx?id=OP_5D2_6710__000002_DN212BE,0,0,
Bingham and Young ,180420171310,OPT,,33 Market Street,,Gainsborough,Lincolnshire,DN21 2BE,Tel: 01427678333, - ,,,No ratings yet Rate it yourself - /Services/opticians/LeaveReview/DefaultView.aspx?id=180420171310,0,0,yes
Walters Opticians,OP_5D2_692__000002_DN212BY,OPT,34 Market Place,,Gainsborough,,,DN21 2BY,Tel: 01427 616505, - ,,,No ratings yet Rate it yourself - /Services/opticians/LeaveReview/DefaultView.aspx?id=OP_5D2_692__000002_DN212BY,0,0,no
Thomas Bond & Partners,OP_5FC_3209__000003_NG138BD,OPT,17 Eaton Place,,,Bingham,Nottinghamshire,NG13 8BD,Tel: 01949 838242, - ,,,No ratings yet Rate it yourself - /Services/opticians/LeaveReview/DefaultView.aspx?id=OP_5FC_3209__000003_NG138BD,0,0,
Twynings Opticians,CO-0076/2/5N8__000002_NG138AD,OPT,17 Union Street,,Bingham,Nottinghamshire,,NG13 8AD,, - ,,,No ratings yet Rate it yourself - /Services/opticians/LeaveReview/DefaultView.aspx?id=CO-0076/2/5N8__000002_NG138AD,0,0,
Pinder's Optometrists,OP_5AP_8682__000002_NG229PR,OPT,33 Forest Road,New Ollerton,Newark,,,NG22 9PR,Tel: 01623 863384, - ,,,No ratings yet Rate it yourself - /Services/opticians/LeaveReview/DefaultView.aspx?id=OP_5AP_8682__000002_NG229PR,0,0,
Alford Opticians (Garry Crome),OP_5H9_6976__000001_LN139AF,OPT,,1 South Street,,Alford,Lincolnshire,LN13 9AF,Tel: 01507 462992, - ,,,3 ratings Rate it yourself - /Services/opticians/LeaveReview/DefaultView.aspx?id=OP_5H9_6976__000001_LN139AF,,,no
Woolcott Opticians,OP_5ET_3205__000003_DN226DY,OPT,30 Carolgate,,Retford,,,DN22 6DY,Tel: 01777 703340, - ,,,1 rating Rate it yourself - /Services/opticians/LeaveReview/DefaultView.aspx?id=OP_5ET_3205__000003_DN226DY,,,
Dudley & Severn,OP_5ET_A469__000001_DN226ES,OPT,9 West Street,,Retford,Nottinghamshire,,DN22 6ES,Tel: 01777 703030, - ,,,No ratings yet Rate it yourself - /Services/opticians/LeaveReview/DefaultView.aspx?id=OP_5ET_A469__000001_DN226ES,0,0,
Bingham & Young(Young Optical Limited),OP_5ET_2900__000001_DN227SQ,OPT,2 Exchange Street,,Retford,Retford,,DN22 6BL,Tel: 01777 703328, - ,,,No ratings yet Rate it yourself - /Services/opticians/LeaveReview/DefaultView.aspx?id=OP_5ET_2900__000001_DN227SQ,0,0,
Retford Specsavers Ltd,OP_5ET_9436__000001_DN226DR,OPT,10a Market Place,,,Retford,,DN22 6DR,Tel: 01777 711711, - ,,,4 ratings Rate it yourself - /Services/opticians/LeaveReview/DefaultView.aspx?id=OP_5ET_9436__000001_DN226DR,,,
Stradling Opticians,OP_5H9_8187__000001_PE127LW,OPT,12 West End,Holbeach,Spalding,,,PE12 7LW,Tel: 01406 423239, - ,,,No ratings yet Rate it yourself - /Services/opticians/LeaveReview/DefaultView.aspx?id=OP_5H9_8187__000001_PE127LW,0,0,
Holbeach Optical Ltd,0925011216,OPT,,38 High Street,,Holbeach,,PE12 7DY,, - ,,,No ratings yet Rate it yourself - /Services/opticians/LeaveReview/DefaultView.aspx?id=0925011216,0,0,
Holiday - Adam,MOB/01-17484/5N8__000001_NG123FB,OPT,5 The Mews,Hall Lane,Colston Basset,Nottinghamshire,,NG12 3FB,, - ,,,No ratings yet Rate it yourself - /Services/opticians/LeaveReview/DefaultView.aspx?id=MOB/01-17484/5N8__000001_NG123FB,0,0,
Michael Vickers,MVDN228RX,OPT,,89 Town Street,,"Lound, Retford",,DN22 8RX,Tel: 01777 818291, - ,,,No ratings yet Rate it yourself - /Services/opticians/LeaveReview/DefaultView.aspx?id=MVDN228RX,0,0,
Specsavers,OP_5EH_5897__000004_LE131XH,OPT,22-24 Sherrard Street,,Melton Mowbray,Leicestershire,,LE13 1UT,Tel: 01664 503555, - ,,,No ratings yet Rate it yourself - /Services/opticians/LeaveReview/DefaultView.aspx?id=OP_5EH_5897__000004_LE131XH,0,0,
Graham Coe Opticians,OP_5PA_12201__000001_LE131AE,OPT,11 Burton Street,,,Melton Mowbray,,LE13 1AE,Tel: 01664 569722, - ,,,No ratings yet Rate it yourself - /Services/opticians/LeaveReview/DefaultView.aspx?id=OP_5PA_12201__000001_LE131AE,0,0,
Boots-Melton Mowbray,OP_5EH_823__000002_LE130TP,OPT,6 Cheapside,,Leicester,Melton Mowbray,,LE13 0TP,Tel: 01664 562195, - ,,,No ratings yet Rate it yourself - /Services/opticians/LeaveReview/DefaultView.aspx?id=OP_5EH_823__000002_LE130TP,0,0,
Vision Express,OPL-01-22086-5PA__000002_LE130TR,OPT,3 High Street,,Melton Mowbray,Leicestershire,,LE13 0TR,Tel: 01664 566 645, - ,,,No ratings yet Rate it yourself - /Services/opticians/LeaveReview/DefaultView.aspx?id=OPL-01-22086-5PA__000002_LE130TR,0,0,
Coakley & Associates Opticians (Martin Walters and Partners),OP_5H9_3058__000001_PE129JA,OPT,11 Market Place,Long Sutton,Spalding,",",,PE12 9JA,Tel: 01406 363348, - ,,,1 rating Rate it yourself - /Services/opticians/LeaveReview/DefaultView.aspx?id=OP_5H9_3058__000001_PE129JA,,,yes
