Organisation Name,NACS Code,Organisation Type,Address1,Address2,Address3,Address4,Address5,PostCode,Telephone Number,Opening time,Value  (Opening time),Banding Classification  (Opening time),NHS.UK users rating,Value  (NHS.UK users rating),Banding Classification  (NHS.UK users rating),Car parking (Is there car parking at this organisation?)
Vision Express (UK) Ltd,OP_5KK_10368__000001_YO111LP,OPT,1 Bar House,Westborough,Scarborough,,,YO11 1LP,Tel: 01723 507667, - ,,,No ratings yet Rate it yourself - /Services/opticians/LeaveReview/DefaultView.aspx?id=OP_5KK_10368__000001_YO111LP,0,0,
Boots-Scarborough - Westborough,OP_5KK_869__000002_YO111LN,OPT,100 - 101 Westborough,,,Scarborough,North Yorkshire,YO11 1LN,Tel: 01723 500661, - ,,,4 ratings Rate it yourself - /Services/opticians/LeaveReview/DefaultView.aspx?id=OP_5KK_869__000002_YO111LN,,,
Pagan & McQuade,OP_5KK_3608__000001_YO111LD,OPT,108 Westborough,,,Scarborough,North Yorkshire,YO11 1LD,Tel: 01723 371250, - ,,,2 ratings Rate it yourself - /Services/opticians/LeaveReview/DefaultView.aspx?id=OP_5KK_3608__000001_YO111LD,,,no
 Scarborough Visionplus Ltd,OP_5KK_5660__000002_YO111LD,OPT,94 Westborough,94 Westborough,Scarborough, Scarborough,,YO11 1LD,Tel: 01723 501990, - ,,,No ratings yet Rate it yourself - /Services/opticians/LeaveReview/DefaultView.aspx?id=OP_5KK_5660__000002_YO111LD,0,0,
Local Eyes,,OPT,,4 Newborough,,Scarborough,,YO11 1NA,Tel: 01723 364045, - ,,,N/A - Data not available,,,
Brown & Humhreys Opticians,OP_5KK_5719__000001_YO112EF,OPT,42 Huntriss Row,,,Scarborough,,YO11 2EF,Tel: 01723 361957, - ,,,No ratings yet Rate it yourself - /Services/opticians/LeaveReview/DefaultView.aspx?id=OP_5KK_5719__000001_YO112EF,0,0,
David Horn & A E Pierce,OP_5KK_3952__000001_YO111JR,OPT,Bradshaw House,21 Alma Square,Scarborough,,,YO11 1JR,Tel: 01723 364045, - ,,,No ratings yet Rate it yourself - /Services/opticians/LeaveReview/DefaultView.aspx?id=OP_5KK_3952__000001_YO111JR,0,0,
Langton Opticians,OP_5KK_3231__000001_YO149AA,OPT,17b West Avenue,,Filey,,,YO14 9AA,Tel: 01723 512100, - ,,,No ratings yet Rate it yourself - /Services/opticians/LeaveReview/DefaultView.aspx?id=OP_5KK_3231__000001_YO149AA,0,0,
Hunmanby Opticians,OP_5KK_14980__000004_YO140JR,OPT,24 Bridlington Street,Hunmanby,Filey,,,YO14 0JR,Tel: 01723 890011, - ,,,No ratings yet Rate it yourself - /Services/opticians/LeaveReview/DefaultView.aspx?id=OP_5KK_14980__000004_YO140JR,0,0,
Robinson Opticians Ltd,OP_5KK_1041__000002_YO187DP,OPT,14 Eastgate Square,,Pickering,,,YO18 7DP,Tel: 01751 472737, - ,,,No ratings yet Rate it yourself - /Services/opticians/LeaveReview/DefaultView.aspx?id=OP_5KK_1041__000002_YO187DP,0,0,
Old Town Optometrists,OP_5E4_5718__000001_YO164QL,OPT,69 High Street,69 High Street,Bridlington,Bridlington,,YO16 4PR,Tel: 01262 673772, - ,,,No ratings yet Rate it yourself - /Services/opticians/LeaveReview/DefaultView.aspx?id=OP_5E4_5718__000001_YO164QL,0,0,
Langton Opticians,OP_5E4_8177__000001_YO152AE,OPT,27 Prospect Street,,Bridlington,,,YO15 2AE,Tel: 01262 673113, - ,,,1 rating Rate it yourself - /Services/opticians/LeaveReview/DefaultView.aspx?id=OP_5E4_8177__000001_YO152AE,,,
Rayner Opticians,OP_5KK_10738__000001_YO211DY,OPT,,3-4 Wellington Road,,Whitby,North Yorkshire,YO21 1DY,Tel: 01947 603358, - ,,,No ratings yet Rate it yourself - /Services/opticians/LeaveReview/DefaultView.aspx?id=OP_5KK_10738__000001_YO211DY,0,0,
Specsavers Opticians,OP_5E4_12692__000001_YO152DN,OPT,29 King Street,,,Bridlington,,YO15 2DN,Tel: 01262 400011, - ,,,No ratings yet Rate it yourself - /Services/opticians/LeaveReview/DefaultView.aspx?id=OP_5E4_12692__000001_YO152DN,0,0,
Crown Optical,OP_5E4_14664__000001_YO152PX,OPT,4a The Promenade,,Bridlington,E Yorkshire,,YO15 2PX,Tel: 01262 674350, - ,,,No ratings yet Rate it yourself - /Services/opticians/LeaveReview/DefaultView.aspx?id=OP_5E4_14664__000001_YO152PX,0,0,
Specsavers Opticians,OP_5KK_12540__000001_YO177DT,OPT,Specsavers,10 Castlegate,,Malton,,YO17 7DT,Tel: 01653 692784, - ,,,No ratings yet Rate it yourself - /Services/opticians/LeaveReview/DefaultView.aspx?id=OP_5KK_12540__000001_YO177DT,0,0,
Glen Opticians,CO-3860,OPT,,21 Wheelgate,,Malton,North Yorkshire,YO17 7HT,Tel: 01653 600058, - ,,,No ratings yet Rate it yourself - /Services/opticians/LeaveReview/DefaultView.aspx?id=CO-3860,0,0,
Robinsons Opticians,OP_5KK_3255__000001_YO177JE,OPT,9 Newbiggin,,Malton,,,YO17 7JE,Tel: 01653 692283, - ,,,3 ratings Rate it yourself - /Services/opticians/LeaveReview/DefaultView.aspx?id=OP_5KK_3255__000001_YO177JE,,,
Scrivens Ltd,OP_5KK_5473__000002_YO177LX,OPT,40 Market Place,,,Malton,Yorkshire,YO17 7LY,Tel: 01653 692052, - ,,,No ratings yet Rate it yourself - /Services/opticians/LeaveReview/DefaultView.aspx?id=OP_5KK_5473__000002_YO177LX,0,0,
Specsavers Opticians,OP_5E4_14669__000001_YO256AP,OPT,7 Market Place,,Driffield,E Yorkshire,,YO25 6AP,Tel: 01377 249710, - ,,,No ratings yet Rate it yourself - /Services/opticians/LeaveReview/DefaultView.aspx?id=OP_5E4_14669__000001_YO256AP,0,0,
Scrivens Opticians,OP_5E4_6784__000001_YO256QF,OPT,71 Middle Street South,,,Driffield,Yorkshire(East Riding),YO25 6QF,Tel: 01377 253145, - ,,,No ratings yet Rate it yourself - /Services/opticians/LeaveReview/DefaultView.aspx?id=OP_5E4_6784__000001_YO256QF,0,0,
Glens Optical Ltd,OP_5E4_2457__000002_YO256PS,OPT,23/3 Middle Street South,,Driffield,Driffield,,YO25 6PS,Tel: 01377 257252, - ,,,No ratings yet Rate it yourself - /Services/opticians/LeaveReview/DefaultView.aspx?id=OP_5E4_2457__000002_YO256PS,0,0,
R M Higson Optometrist ,OP_5E4_1270__000001_YO256QE,OPT,100 Middle Street South,,Driffield,,,YO25 6QE,Tel: 01377 253039, - ,,,1 rating Rate it yourself - /Services/opticians/LeaveReview/DefaultView.aspx?id=OP_5E4_1270__000001_YO256QE,,,
Onlookers Ltd,OP_5NW_ONLOOKERS__000002_YO259DJ,OPT,,83 Kelleythorpe Industrial Estate,,Driffield,Yorkshire(East Riding),YO25 9DJ,Tel: 01377 200040, - ,,,No ratings yet Rate it yourself - /Services/opticians/LeaveReview/DefaultView.aspx?id=OP_5NW_ONLOOKERS__000002_YO259DJ,0,0,
John Tomlinson Mobile Optician,OP_5E4_14668__000003_YO259QZ,OPT,Mobile Unit,Station Yard (Friday (Pm),Hutton Cranswick,,,YO25 9QZ,Tel: 07976 567487, - ,,,No ratings yet Rate it yourself - /Services/opticians/LeaveReview/DefaultView.aspx?id=OP_5E4_14668__000003_YO259QZ,0,0,
Loftus Optical,TS13 4PW,OPT,,24 Zetland Road,,Loftus,,TS13 4PW,, - ,,,6 ratings Rate it yourself - /Services/opticians/LeaveReview/DefaultView.aspx?id=TS13 4PW,,,
Home Visit Eyecare Ltd,OP_TS134PW_34241,OPT,,24 Zetland Road,,Loftus,,TS13 4PW,, - ,,,No ratings yet Rate it yourself - /Services/opticians/LeaveReview/DefaultView.aspx?id=OP_TS134PW_34241,0,0,
Scrivens Opticians,OP_5E4_10770__000001_YO422DG,OPT,4 George Street,,Pocklington,E Yorkshire,,YO42 2DG,Tel: 01759 303150, - ,,,No ratings yet Rate it yourself - /Services/opticians/LeaveReview/DefaultView.aspx?id=OP_5E4_10770__000001_YO422DG,0,0,
Specsavers,TP730,OPT,,17-21 Market Place,,Pocklington,,YO42 2AS,, - ,,,No ratings yet Rate it yourself - /Services/opticians/LeaveReview/DefaultView.aspx?id=TP730,0,0,
JJJ Optical Ltd,OP_5KN_2577__000002_TS122DY,OPT,107 High Street,Skelton-In-Cleveland,Saltburn-By-The-Sea,.,,TS12 2DY,Tel: 01287 650 655, - ,,,No ratings yet Rate it yourself - /Services/opticians/LeaveReview/DefaultView.aspx?id=OP_5KN_2577__000002_TS122DY,0,0,
S H Reily Ltd,OP_5KN_12501__000001_TS121DN,OPT,33 Milton Street,,Saltburn-By-The-Sea,,,TS12 1DN,Tel: 01287 622889, - ,,,No ratings yet Rate it yourself - /Services/opticians/LeaveReview/DefaultView.aspx?id=OP_5KN_12501__000001_TS121DN,0,0,
Breen Opticians,TS11 7LA,OPT,,8-10 The Wynd,,Marske-By-The-Sea,,TS11 7LA,Tel: 01642 756 740, - ,,,No ratings yet Rate it yourself - /Services/opticians/LeaveReview/DefaultView.aspx?id=TS11 7LA,0,0,
JJJ Optical Ltd,OP_5KN_12543__000001_TS116AA,OPT,5 Redcar Road,Marske-By-The-Sea,Redcar,Redcar,,TS11 6AA,Tel: 01642 485 084, - ,,,No ratings yet Rate it yourself - /Services/opticians/LeaveReview/DefaultView.aspx?id=OP_5KN_12543__000001_TS116AA,0,0,
