Organisation Name,NACS Code,Organisation Type,Address1,Address2,Address3,Address4,Address5,PostCode,Telephone Number,Opening time,Value  (Opening time),Banding Classification  (Opening time),NHS.UK users rating,Value  (NHS.UK users rating),Banding Classification  (NHS.UK users rating),Car parking (Is there car parking at this organisation?)
Eye 2 Eye,OP_5L2_11435__000002_ME160PU,OPT,Mid Kent Shopping Centre,Castle Road,Allington,Maidstone,Kent,ME16 0PU,Tel: 01622 672563, - ,,,4 ratings Rate it yourself - /Services/opticians/LeaveReview/DefaultView.aspx?id=OP_5L2_11435__000002_ME160PU,,,yes
Specsavers (Maidstone),OPT_ME141QS_1,OPT,,21-25 Week Street,,Maidstone,Kent,ME14 1QS,Tel: 01622 663111, - ,,,No ratings yet Rate it yourself - /Services/opticians/LeaveReview/DefaultView.aspx?id=OPT_ME141QS_1,0,0,
Bayfields Opticians and Audiologists (Maidstone),I9V4Y,OPT,,6 Pudding Lane,,Maidstone,,ME14 1LN,Tel: 01622 758566, - ,,,No ratings yet Rate it yourself - /Services/opticians/LeaveReview/DefaultView.aspx?id=I9V4Y,0,0,
Boots-Maidstone - King St,OP_5L2_195__000002_ME141BW,OPT,56-62 King Street,,Kent,Maidstone,,ME14 1BW,Tel: 01622 762337, - ,,,No ratings yet Rate it yourself - /Services/opticians/LeaveReview/DefaultView.aspx?id=OP_5L2_195__000002_ME141BW,0,0,
Tinsons ,OP_5L2_760__000001_ME141TG,OPT,9 Middle Row,,Kent,Maidstone,,ME14 1TG,Tel: 01622 686051, - ,,,No ratings yet Rate it yourself - /Services/opticians/LeaveReview/DefaultView.aspx?id=OP_5L2_760__000001_ME141TG,0,0,
William J Wilkinson (Maidstone),OP_5L2_2043__000001_ME156JJ,OPT,50 Gabriels Hill,,Kent,Maidstone,,ME15 6JJ,Tel: 01622 677424, - ,,,No ratings yet Rate it yourself - /Services/opticians/LeaveReview/DefaultView.aspx?id=OP_5L2_2043__000001_ME156JJ,0,0,
Vision Express (Maidstone),OP_5L2_6952__000001_ME156AS,OPT,346-348 Dukes Walk,Chequers Centre,Maidstone,Kent,,ME15 6AS,Tel: 01622 678123, - ,,,No ratings yet Rate it yourself - /Services/opticians/LeaveReview/DefaultView.aspx?id=OP_5L2_6952__000001_ME156AS,0,0,
Specsavers Opticians,OPT_ME207NA_2,OPT,,Sainsburys Supermarket,"Quarry Wood, Mills road",Aylesford,Kent,ME20 7NA,Tel: 01622 797200, - ,,,No ratings yet Rate it yourself - /Services/opticians/LeaveReview/DefaultView.aspx?id=OPT_ME207NA_2,0,0,
Vraitch Vision (Walderslade),OPT_ME59LR_1,OPT,,3-4 Thetford House,,Walderslade,,ME5 9LR,Tel: 01634 682595, - ,,,No ratings yet Rate it yourself - /Services/opticians/LeaveReview/DefaultView.aspx?id=OPT_ME59LR_1,0,0,
Kent Eye Care Ltd,NKCCKNCK,OPT,Kent Eye Care Independent Specialist Optometrists & Opticians,786 London Road,,"Larkfield, Aylesford",Kent,ME20 6BE,Tel: 01732 873378, - ,,,1 rating Rate it yourself - /Services/opticians/LeaveReview/DefaultView.aspx?id=NKCCKNCK,,,no
Tesco Optician (Lunsford Park),ME206RJ060716,OPT,,Lunsford Park,,Larkfield,,ME20 6RJ,Tel: 0345 601 3479, - ,,,No ratings yet Rate it yourself - /Services/opticians/LeaveReview/DefaultView.aspx?id=ME206RJ060716,0,0,
Vision Express (Gillingham),OPT_ME73PD_1,OPT,,Unit 39 Hempstead Valley Shopping Centre,,Gillingham,,ME7 3PD,Tel: 01634 365661, - ,,,No ratings yet Rate it yourself - /Services/opticians/LeaveReview/DefaultView.aspx?id=OPT_ME73PD_1,0,0,
Leightons Opticians & Hearing Care,OP_5L3_154__000001_ME73PD,OPT,,67 Hempstead Valley Shopping Centre,,Gillingham,Kent,ME7 3PD,Tel: 01634 261311, - ,,,No ratings yet Rate it yourself - /Services/opticians/LeaveReview/DefaultView.aspx?id=OP_5L3_154__000001_ME73PD,0,0,
Buchanan Optometrists,OP_5L2_663__000001_ME65AG,OPT,Buchanan House,56 Malling Road,,Snodland,Kent,ME6 5NB,Tel: 01634 757227, - ,,,20 ratings Rate it yourself - /Services/opticians/LeaveReview/DefaultView.aspx?id=OP_5L2_663__000001_ME65AG,,,yes
The Village Optician,OPT_ME65NJ_1,OPT,,4 Holborough Road,,Snodland,,ME6 5NJ,Tel: 01634 240090, - ,,,No ratings yet Rate it yourself - /Services/opticians/LeaveReview/DefaultView.aspx?id=OPT_ME65NJ_1,0,0,
West Malling Opticians ,OP_5L2_7653__000001_ME196QR,OPT,32 High Street,,Kent,West Malling,,ME19 6QR,Tel: 01732 841403, - ,,,No ratings yet Rate it yourself - /Services/opticians/LeaveReview/DefaultView.aspx?id=OP_5L2_7653__000001_ME196QR,0,0,
Kings Hill Opticians,00325__000001_ME194AU,OPT,Liberty Square,,West Malling,Kent,,ME19 4AU,Tel: 01732 875544, - ,,,17 ratings Rate it yourself - /Services/opticians/LeaveReview/DefaultView.aspx?id=00325__000001_ME194AU,,,
T. J. Woolley,000179__000002_ME72YN,OPT,60 Watling Street,,Gillingham,Kent,,ME7 2YN,Tel: 01634 281291, - ,,,12 ratings Rate it yourself - /Services/opticians/LeaveReview/DefaultView.aspx?id=000179__000002_ME72YN,,,
Tesco Optician (Gillingham),ME80GX060716,OPT,,Courtney Road,,Gillingham,,ME8 0GX,Tel: 0345 601 3479, - ,,,1 rating Rate it yourself - /Services/opticians/LeaveReview/DefaultView.aspx?id=ME80GX060716,,,
Vision Express (Chatham),OP_5L3_6149__000002_ME44BG,OPT,199 - 201 High Street,,Chatham,Kent,,ME4 4BG,Tel: 01634 404808, - ,,,1 rating Rate it yourself - /Services/opticians/LeaveReview/DefaultView.aspx?id=OP_5L3_6149__000002_ME44BG,,,
Specsavers (Chatham),OP_5L3_7948__000001_ME44BG,OPT,215 High Street,,Chatham,Kent,,ME4 4BG,Tel: 01634 818555, - ,,,5 ratings Rate it yourself - /Services/opticians/LeaveReview/DefaultView.aspx?id=OP_5L3_7948__000001_ME44BG,,,
John High Opticians (Rainham),OP_5L3_439__000001_ME87PH,OPT,73 High Street,Rainham,Gillingham,Kent,,ME8 7HS,Tel: 01634 233634, - ,,,1 rating Rate it yourself - /Services/opticians/LeaveReview/DefaultView.aspx?id=OP_5L3_439__000001_ME87PH,,,
Patrick Duff Opticians,OP_5L3_2150__000001_ME87HS,OPT,65 High Street,Rainham,Gillingham,Kent,,ME8 7HS,Tel: 01634 231308, - ,,,1 rating Rate it yourself - /Services/opticians/LeaveReview/DefaultView.aspx?id=OP_5L3_2150__000001_ME87HS,,,
Boots-Chatham - Wilmot Sq,OP_5L3_1784__000002_ME44BB,OPT,30-34 Wilmot Square,Pentagon Centre,,Kent,Kent,ME4 4BB,Tel: 01634 828672, - ,,,1 rating Rate it yourself - /Services/opticians/LeaveReview/DefaultView.aspx?id=OP_5L3_1784__000002_ME44BB,,,
Boots-Rainham,OP_5L3_7198__000003_ME87HW,OPT,15 Rainham Shopping Centre,Rainham,Gillingham,Kent,,ME8 7HW,Tel: 01634 362738, - ,,,No ratings yet Rate it yourself - /Services/opticians/LeaveReview/DefaultView.aspx?id=OP_5L3_7198__000003_ME87HW,0,0,
Specsavers (Gillingham),00323__000002_ME71AQ,OPT,137 High Street,,Gillingham,Kent,,ME7 1AQ,Tel: 01634 583350, - ,,,1 rating Rate it yourself - /Services/opticians/LeaveReview/DefaultView.aspx?id=00323__000002_ME71AQ,,,
Specsavers Opticians,OPT_ME24AR_1,OPT,,58 High Street,,"Strood, Rochester",Kent,ME2 4AR,Tel: 01634 540399, - ,,,No ratings yet Rate it yourself - /Services/opticians/LeaveReview/DefaultView.aspx?id=OPT_ME24AR_1,0,0,
Niall O'Kane Optometrists,OP_5L3_10355__000001_ME24AR,OPT,78 - 80 High Street,Strood,Rochester,Kent,,ME2 4AR,Tel: 01634 290178, - ,,,7 ratings Rate it yourself - /Services/opticians/LeaveReview/DefaultView.aspx?id=OP_5L3_10355__000001_ME24AR,,,
Boots-Strood,OP_5L3_1926__000001_ME24TJ,OPT,117 High Street,,,Strood,Kent,ME2 4TJ,Tel: 01634 718676, - ,,,No ratings yet Rate it yourself - /Services/opticians/LeaveReview/DefaultView.aspx?id=OP_5L3_1926__000001_ME24TJ,0,0,
Asda Stores Limited,OPT_ME7 1RX,OPT,,Pier Road,,Gillingham,,ME7 1RX,Tel: 01732 753131, - ,,,No ratings yet Rate it yourself - /Services/opticians/LeaveReview/DefaultView.aspx?id=OPT_ME7 1RX,0,0,
Specsavvy Opticians Ltd,TP8FC,OPT,Unit 42,Dockside Shopping Centre,"Maritime Way, St Mary's Island",Chatham,Kent,ME4 3ED,Tel: 01634 891000, - ,,,39 ratings Rate it yourself - /Services/opticians/LeaveReview/DefaultView.aspx?id=TP8FC,,,
Sanford Opticians,000281__000001_ME39AA,OPT,7 Main Road,Hoo,Rochester,Kent,,ME3 9AA,Tel: 01634 256565, - ,,,No ratings yet Rate it yourself - /Services/opticians/LeaveReview/DefaultView.aspx?id=000281__000001_ME39AA,0,0,
Borough Green Opticians,OP_5FF_10481__000002_TN158BT,OPT,25 High Street,Borough Green,Sevenoaks,Kent,,TN15 8BT,Tel: 01732 884558, - ,,,1 rating Rate it yourself - /Services/opticians/LeaveReview/DefaultView.aspx?id=OP_5FF_10481__000002_TN158BT,,,
W & K Pope ,OP_5L4_9234__000001_ME104DW,OPT,The Oast Business Centre,Office 4C,62 Bell Road,Sittingbourne,Kent,ME10 4HE,Tel: 01795 470507, - ,,,No ratings yet Rate it yourself - /Services/opticians/LeaveReview/DefaultView.aspx?id=OP_5L4_9234__000001_ME104DW,0,0,
Peter Jones Opticians,OP_5L2_2643__000001_TN120AY,OPT,5 Church Hill,Staplehurst,Tonbridge,,,TN12 0AX,Tel: 01580 892269, - ,,,No ratings yet Rate it yourself - /Services/opticians/LeaveReview/DefaultView.aspx?id=OP_5L2_2643__000001_TN120AY,0,0,
John Frewin Opticians (Sittingbourne),OP_5L4_1462__000002_ME104PL,OPT,,114 High Street,,Sittingbourne,,ME10 4PL,Tel: 01795 472550, - ,,,No ratings yet Rate it yourself - /Services/opticians/LeaveReview/DefaultView.aspx?id=OP_5L4_1462__000002_ME104PL,0,0,
Patrick Duff,OP_5L2_12575__000001_TN126EN,OPT,3 Commercial Road,Paddock Wood,Tonbridge,,,TN12 6EN,Tel: 01892 838608, - ,,,No ratings yet Rate it yourself - /Services/opticians/LeaveReview/DefaultView.aspx?id=OP_5L2_12575__000001_TN126EN,0,0,
Boots Opticians (Sittingbourne),OPT_ME104AJ_1,OPT,,99 High Street,,Sittingbourne,,ME10 4AJ,Tel: 01795 427935, - ,,,No ratings yet Rate it yourself - /Services/opticians/LeaveReview/DefaultView.aspx?id=OPT_ME104AJ_1,0,0,
Vision Express (Sittingbourne),OP_5L4_10433__000002_ME104PB,OPT,,38 High Street,,Sittingbourne,,ME10 4PB,Tel: 01795 424149, - ,,,No ratings yet Rate it yourself - /Services/opticians/LeaveReview/DefaultView.aspx?id=OP_5L4_10433__000002_ME104PB,0,0,
Specsavers (Sittingbourne),OP_5L4_9722__000001_ME103DL,OPT,,7/8 The Forum,,Sittingbourne,Kent,ME10 3DL,Tel: 01795 436100, - ,,,2 ratings Rate it yourself - /Services/opticians/LeaveReview/DefaultView.aspx?id=OP_5L4_9722__000001_ME103DL,,,
Headcorn Eye Centre,OPT_TN279NH_1,OPT,,25 High Street,,Headcorn,Kent,TN27 9NH,Tel: 01622 890044, - ,,,1 rating Rate it yourself - /Services/opticians/LeaveReview/DefaultView.aspx?id=OPT_TN279NH_1,,,
John High Opticians (Sittingbourne),OP_5L4_2920__000001_ME104AW,OPT,,73 High Street,,Sittingbourne,,ME10 4AW,Tel: 01795 472525, - ,,,No ratings yet Rate it yourself - /Services/opticians/LeaveReview/DefaultView.aspx?id=OP_5L4_2920__000001_ME104AW,0,0,
Elaine M Yorwarth,00156__000001_TN126DP,OPT,70 Commercial Road,,Paddock Wood,Kent,,TN12 6DP,Tel: 01892 833017, - ,,,No ratings yet Rate it yourself - /Services/opticians/LeaveReview/DefaultView.aspx?id=00156__000001_TN126DP,0,0,
Portobello Eyecare Ltd,K8A7B,OPT,,"3 Portobello Parade, Fawkham Road",,"West Kingsdown, Kent",,TN15 6JP,, - ,,,1 rating Rate it yourself - /Services/opticians/LeaveReview/DefaultView.aspx?id=K8A7B,,,
Osborne Harle,OP_5FF_397__000003_TN104AE,OPT,1-3 Martin Hardie Way,Tonbridge,,Kent,,TN10 4AE,Tel: 01732 368678, - ,,,9 ratings Rate it yourself - /Services/opticians/LeaveReview/DefaultView.aspx?id=OP_5FF_397__000003_TN104AE,,,yes
Rowland Opticians,OP_5CM_2066__000002_DA37QA,OPT,,79 Station Road,Kent,Longfield,,DA3 7QA,Tel: 01474 702125, - ,,,No ratings yet Rate it yourself - /Services/opticians/LeaveReview/DefaultView.aspx?id=OP_5CM_2066__000002_DA37QA,0,0,
Medical Eye Centre,00314__000001_DA122EB,OPT,14 King Street,,Gravesend,Kent,,DA12 2EB,Tel: 01474 321553, - ,,,No ratings yet Rate it yourself - /Services/opticians/LeaveReview/DefaultView.aspx?id=00314__000001_DA122EB,0,0,
Specsavers (Gravesend),OP_5CM_2356__000001_DA110AU,OPT,19-20 Thamesgate Shopping Centre,,Kent,Gravesend,,DA11 0AU,Tel: 01474 537 878, - ,,,1 rating Rate it yourself - /Services/opticians/LeaveReview/DefaultView.aspx?id=OP_5CM_2356__000001_DA110AU,,,
Boots-Gravesend - Kempthorne St,OP_5CM_416__000002_DA110TA,OPT,9 Kempthorne Street,St Georges Shopping Centre,,Gravsend,Kent,DA11 0TA,Tel: 01474 352911, - ,,,No ratings yet Rate it yourself - /Services/opticians/LeaveReview/DefaultView.aspx?id=OP_5CM_416__000002_DA110TA,0,0,
Ewoma Aibangbee,OPT_DA118BZ_1,OPT,,"Gateway Medical Practice, Fleet Health Campus, Vale Road",Northfleet,Gravesend,Kent,DA11 8BZ,Tel: 07591 246595, - ,,,No ratings yet Rate it yourself - /Services/opticians/LeaveReview/DefaultView.aspx?id=OPT_DA118BZ_1,0,0,
Asda Opticans (Gravesend),00306__000001_DA110DQ,OPT,Thames Way,,Gravesend,Kent,,DA11 0DQ,Tel: 01474 543 412, - ,,,No ratings yet Rate it yourself - /Services/opticians/LeaveReview/DefaultView.aspx?id=00306__000001_DA110DQ,0,0,
Crayford Optical Centre,OPT_TN91RE_3,OPT,,Home Visits,,Kent,,TN9 1RE,Tel: 01322 557 700, - ,,,2 ratings Rate it yourself - /Services/opticians/LeaveReview/DefaultView.aspx?id=OPT_TN91RE_3,,,
Complete Community Care Kent Ltd,OPT_TN91RE_2,OPT,,Home Visits,,Kent,,TN9 1RE,Tel: 01732 458 424, - ,,,No ratings yet Rate it yourself - /Services/opticians/LeaveReview/DefaultView.aspx?id=OPT_TN91RE_2,0,0,
Bansal Opticians ,OPT_TN91RE_1,OPT,,Home Visits,,Kent and Medway,Kent,TN9 1RE,Tel: 020 8470 1133, - ,,,No ratings yet Rate it yourself - /Services/opticians/LeaveReview/DefaultView.aspx?id=OPT_TN91RE_1,0,0,
William J Wilkinson (Tonbridge),OP_5FF_2040__000001_TN91AP,OPT,90 High Street,,Kent,Tonbridge,,TN9 1AP,Tel: 01732 353803, - ,,,1 rating Rate it yourself - /Services/opticians/LeaveReview/DefaultView.aspx?id=OP_5FF_2040__000001_TN91AP,,,
Boots-Tonbridge,OP_5FF_3325__000002_TN91SD,OPT,59 High Street,,,Tonbridge,Kent,TN9 1SD,Tel: 01732 357565, - ,,,No ratings yet Rate it yourself - /Services/opticians/LeaveReview/DefaultView.aspx?id=OP_5FF_3325__000002_TN91SD,0,0,
Specsavers (Tonbridge),00289__000001_TN91SQ,OPT,15 High Street,,Tonbridge,Kent,,TN9 1SQ,Tel: 01732 370480, - ,,,2 ratings Rate it yourself - /Services/opticians/LeaveReview/DefaultView.aspx?id=00289__000001_TN91SQ,,,
Scrivens Opticians (Tonbridge),OP_5FF_13081__000001_TN91TE,OPT,8 The Pavilion,High Street,Tonbridge,Kent,,TN9 1TE,Tel: 01732 352565, - ,,,No ratings yet Rate it yourself - /Services/opticians/LeaveReview/DefaultView.aspx?id=OP_5FF_13081__000001_TN91TE,0,0,
K Lewis & Partners,OP_5GQ_9847__000001_RM187QT,OPT,39 - 41 Calcutta Road,,Tilbury,Essex,,RM18 7QT,Tel: 01375 843074, - ,,,No ratings yet Rate it yourself - /Services/opticians/LeaveReview/DefaultView.aspx?id=OP_5GQ_9847__000001_RM187QT,0,0,
The Hammond Optical Practice,OP_5L2_6686__000001_TN173RB,OPT,,High Street,,Cranbrook,Kent,TN17 3RB,Tel: 01580 715008, - ,,,No ratings yet Rate it yourself - /Services/opticians/LeaveReview/DefaultView.aspx?id=OP_5L2_6686__000001_TN173RB,0,0,
Peter Jones Opticians,OP_5L2_1737__000001_TN173HE,OPT,25 Stone Street,Cranbrook,Kent,,,TN17 3HE,Tel: 01580 712254, - ,,,1 rating Rate it yourself - /Services/opticians/LeaveReview/DefaultView.aspx?id=OP_5L2_1737__000001_TN173HE,,,
Sheppey Eyecare Centre,TP5E7,OPT,,6 Halfway Road,,Sheerness,Kent,ME12 3AU,Tel: 01795 667255, - ,,,1 rating Rate it yourself - /Services/opticians/LeaveReview/DefaultView.aspx?id=TP5E7,,,
Eyelines,OPT_TN131LP_1,OPT,,88 High Street,,Sevenoaks,,TN13 1LP,Tel: 01732 460317, - ,,,No ratings yet Rate it yourself - /Services/opticians/LeaveReview/DefaultView.aspx?id=OPT_TN131LP_1,0,0,
Leslie Warren Optician,OP_5FF_4538__000002_TN131LP,OPT,Leslie Warren Opticians,82 High Street,,Sevenoaks,Kent,TN13 1LP,Tel: 01732 452135, - ,,,1 rating Rate it yourself - /Services/opticians/LeaveReview/DefaultView.aspx?id=OP_5FF_4538__000002_TN131LP,,,
Boots-Sevenoaks,OP_5FF_223__000001_TN131LU,OPT,110 High Street,,,Sevenoaks,Kent,TN13 1LU,Tel: 01732 465989, - ,,,1 rating Rate it yourself - /Services/opticians/LeaveReview/DefaultView.aspx?id=OP_5FF_223__000001_TN131LU,,,
William J Wilkinson (Sevenoaks),OP_5FF_3280__000001_TN131UX,OPT,143 High Street,,Kent,Sevenoaks,,TN13 1UX,Tel: 01732 453137, - ,,,1 rating Rate it yourself - /Services/opticians/LeaveReview/DefaultView.aspx?id=OP_5FF_3280__000001_TN131UX,,,
Specsavers (Sevenoaks),OPT_TN131LE_1,OPT,,93 High Street,,Sevenoaks,,TN13 1LE,Tel: 01732 459588, - ,,,2 ratings Rate it yourself - /Services/opticians/LeaveReview/DefaultView.aspx?id=OPT_TN131LE_1,,,
Scrivens Opticians (Sevenoaks),OP_5FF_11111__000001_TN131JF,OPT,73a/73b High Street,,Kent,Sevenoaks,,TN13 1LD,Tel: 01732 454558, - ,,,No ratings yet Rate it yourself - /Services/opticians/LeaveReview/DefaultView.aspx?id=OP_5FF_11111__000001_TN131JF,0,0,
W & K  Pope ,OP_5L4_4276__000002_ME121TX,OPT,,83 High Street,,Sheerness,,ME12 1TX,Tel: 01795 662460, - ,,,No ratings yet Rate it yourself - /Services/opticians/LeaveReview/DefaultView.aspx?id=OP_5L4_4276__000002_ME121TX,0,0,
Specsavers Opticians (Sheerness),TP925,OPT,,67-69 High Street,,Sheerness,Kent,ME12 1NS,Tel: 01795 414000, - ,,,No ratings yet Rate it yourself - /Services/opticians/LeaveReview/DefaultView.aspx?id=TP925,0,0,
John Frewin Opticians (Sheerness),OP_5L4_3360__000001_ME121AB,OPT,,7 Broadway,,Sheerness,,ME12 1AB,Tel: 01795 662818, - ,,,1 rating Rate it yourself - /Services/opticians/LeaveReview/DefaultView.aspx?id=OP_5L4_3360__000001_ME121AB,,,
Chandler Clarke Opticians,OP_5GQ_4880__000001_RM164BD,OPT,83 Riverview,Chadwell St. Mary,Grays,Essex,,RM16 4BD,Tel: 01375 842103, - ,,,No ratings yet Rate it yourself - /Services/opticians/LeaveReview/DefaultView.aspx?id=OP_5GQ_4880__000001_RM164BD,0,0,
Vision Express (Bluewater),OP_5CM_1771__000001_DA99SP,OPT,Unit 14 Upper Rose Gallery,Bluewater,Greenhithe,Kent,,DA9 9SP,Tel: 01322 624814, - ,,,4 ratings Rate it yourself - /Services/opticians/LeaveReview/DefaultView.aspx?id=OP_5CM_1771__000001_DA99SP,,,
Boots-Bluewater Dartford,DA9 9SJ_98372,OPT,,"Unit MSU02, Lower Thames Walk",Bluewater Shopping Centre,Greenhithe,,DA9 9SJ,Tel: 01322624780, - ,,,No ratings yet Rate it yourself - /Services/opticians/LeaveReview/DefaultView.aspx?id=DA9 9SJ_98372,0,0,
John Lewis Opticians,OPT_DA99SA_1,OPT,,Bluewater,,Greenhithe,,DA9 9SA,, - ,,,No ratings yet Rate it yourself - /Services/opticians/LeaveReview/DefaultView.aspx?id=OPT_DA99SA_1,0,0,
David Clulow (Bluewater),OP_5CM_10603__000001_DA99SS,OPT,Unit 110 Upper Guild Hall,Bluewater,Greenhithe,Kent,,DA9 9SS,Tel: 01322 624915, - ,,,No ratings yet Rate it yourself - /Services/opticians/LeaveReview/DefaultView.aspx?id=OP_5CM_10603__000001_DA99SS,0,0,
Boots Opticians (Bluewater),OP_5CM_972__000002_DA99BA,OPT,South Mall,Bluewater Shopping Centre,Greenhithe,Kent,,DA9 9BA,Tel: 01322 623854, - ,,,1 rating Rate it yourself - /Services/opticians/LeaveReview/DefaultView.aspx?id=OP_5CM_972__000002_DA99BA,,,
Asda Opticians (Greenhithe),00276__000002_DA99RE,OPT,Station Road,,Greenhithe,Kent,,DA9 9RE,Tel: 01322 374162, - ,,,4 ratings Rate it yourself - /Services/opticians/LeaveReview/DefaultView.aspx?id=00276__000002_DA99RE,,,
Day Lewis Opticians (Southborough),OPT_TN40PN_1,OPT,,100 London Road,,Southborough,,TN4 0PN,Tel: 01892 529626, - ,,,No ratings yet Rate it yourself - /Services/opticians/LeaveReview/DefaultView.aspx?id=OPT_TN40PN_1,0,0,
Eye Concern,DOMICILIARYEYECARE1,OPT,,"134 London Road, Southborough",,Tunbridge Wells,,TN4 0PL,Tel: 01892 517312, - ,,,5 ratings Rate it yourself - /Services/opticians/LeaveReview/DefaultView.aspx?id=DOMICILIARYEYECARE1,,,
Specsavers,RM17 6QF__000001_RM176QF,OPT,3 The Mall,Grays Shopping Centre,Grays,Essex,,RM17 6QF,Tel: 01375 389740, - ,,,No ratings yet Rate it yourself - /Services/opticians/LeaveReview/DefaultView.aspx?id=RM17 6QF__000001_RM176QF,0,0,
Kennedy Rath Opticians,0111910__000002_RM176QE,OPT,32 The Mall,,Grays,Essex,,RM17 6QE,Tel: 01375 372444, - ,,,No ratings yet Rate it yourself - /Services/opticians/LeaveReview/DefaultView.aspx?id=0111910__000002_RM176QE,0,0,
Euin Steele & Partners,OP_5GQ_587__000001_RM175EH,OPT,58 Orsett Road,,,Grays,,RM17 5EH,Tel: 01375 373000, - ,,,No ratings yet Rate it yourself - /Services/opticians/LeaveReview/DefaultView.aspx?id=OP_5GQ_587__000001_RM175EH,0,0,
Day Lewis Opticians (Riverhead),OP_5FF_8001__000001_TN132BH,OPT,1 London Road,,Sevenoaks,Riverhead,,TN13 2BH,Tel: 01732 451039, - ,,,No ratings yet Rate it yourself - /Services/opticians/LeaveReview/DefaultView.aspx?id=OP_5FF_8001__000001_TN132BH,0,0,
Stanford Opticians,OP_5GQ_7872__000001_SS170EX,OPT,6 The Green,,Stanford-le-Hope,Essex,,SS17 0EX,Tel: 01375 672149, - ,,,No ratings yet Rate it yourself - /Services/opticians/LeaveReview/DefaultView.aspx?id=OP_5GQ_7872__000001_SS170EX,0,0,
Boots-Tunbridge Wells - Calverley Rd,OP_5FF_12824__000001_TN12UU,OPT,49 Calverley Road,,,Tunbridge Wells,Kent,TN1 2TT,Tel: 01892 525 561, - ,,,No ratings yet Rate it yourself - /Services/opticians/LeaveReview/DefaultView.aspx?id=OP_5FF_12824__000001_TN12UU,0,0,
Vision Express (Tunbridge Wells),OP_5FF_1__000001_TN12TH,OPT,23 Calverley Road,,Kent,Tunbridge Wells,,TN1 2TH,Tel: 01892 537585, - ,,,3 ratings Rate it yourself - /Services/opticians/LeaveReview/DefaultView.aspx?id=OP_5FF_1__000001_TN12TH,,,
Castle Opticians,OP_5JP_1560__000001_SS80JP,OPT,164 Long Road,,Canvey Island,Essex,,SS8 0JP,Tel: 01268 514666, - ,,,No ratings yet Rate it yourself - /Services/opticians/LeaveReview/DefaultView.aspx?id=OP_5JP_1560__000001_SS80JP,0,0,
Boots-Tunbridge Wells - Calverley Rd (in Boots UK),OP_5FF_11550__000002_TN12TE,OPT,7-11 Calverley Road,,,Tunbridge Wells,Kent,TN1 2TE,Tel: 01892 546063, - ,,,No ratings yet Rate it yourself - /Services/opticians/LeaveReview/DefaultView.aspx?id=OP_5FF_11550__000002_TN12TE,0,0,
Leightons Opticians and Hearing Care,TP4N9,OPT,,2 Goods Station Road,,Tunbridge Wells,Kent,TN1 2BJ,Tel: 01892 539808, - ,,,No ratings yet Rate it yourself - /Services/opticians/LeaveReview/DefaultView.aspx?id=TP4N9,0,0,
Edney & Edney,OPT_TN11LS_1,OPT,,35 Monson Road,,Tunbridge Wells,,TN1 1LS,Tel: 01892 517986, - ,,,No ratings yet Rate it yourself - /Services/opticians/LeaveReview/DefaultView.aspx?id=OPT_TN11LS_1,0,0,
Edney & Edney Ltd,CO-5383,OPT,,35 Monson Road,,"Tunbridge Wells, Kent ",,TN1 1LS,, - ,,,No ratings yet Rate it yourself - /Services/opticians/LeaveReview/DefaultView.aspx?id=CO-5383,0,0,
Specsavers (Tunbridge Wells),OP_5FF_2826__000001_TN11QR,OPT,119 Mount Pleasant Road,,Kent,Tunbridge Wells,,TN1 1QR,Tel: 01892 533550, - ,,,1 rating Rate it yourself - /Services/opticians/LeaveReview/DefaultView.aspx?id=OP_5FF_2826__000001_TN11QR,,,
Optical Express,K5B4X,OPT,40 Lower Level,"Riverbridge House, Anchor Boulevard",,Dartford,Kent,DA2 6SL,Tel: 0800 023 2020, - ,,,No ratings yet Rate it yourself - /Services/opticians/LeaveReview/DefaultView.aspx?id=K5B4X,0,0,
Tyler Goodchild,OP_5JP_4887__000002_SS87AG,OPT,51 Furtherwick Road,,Canvey Island,Essex,,SS8 7AG,Tel: 01268 693532, - ,,,No ratings yet Rate it yourself - /Services/opticians/LeaveReview/DefaultView.aspx?id=OP_5JP_4887__000002_SS87AG,0,0,
Scrivens Opticians (Tunbridge Wells),OP_5FF_11300__000001_TN11PN,OPT,29 Mount Pleasant,,Kent,Tunbridge Wells,,TN1 1PN,Tel: 01892 527999, - ,,,No ratings yet Rate it yourself - /Services/opticians/LeaveReview/DefaultView.aspx?id=OP_5FF_11300__000001_TN11PN,0,0,
Bodys-Optic (part of the Goldsmith Webb Group),OP_5JP_2441__000002_SS87AD,OPT,12 Knightswick Centre,,Canvey Island,Essex,Essex,SS8 7AD,Tel: 01268 683447, - ,,,No ratings yet Rate it yourself - /Services/opticians/LeaveReview/DefaultView.aspx?id=OP_5JP_2441__000002_SS87AD,0,0,yes
David Clulow,OPT_TN11NX_1,OPT,,32-34 High Street,,Tunbridge Wells,Kent,TN1 1NX,Tel: 01892 512385, - ,,,No ratings yet Rate it yourself - /Services/opticians/LeaveReview/DefaultView.aspx?id=OPT_TN11NX_1,0,0,
Goldsmith Webb,OP_5GQ_11951__000001_SS177LY,OPT,8 Grover Walk,Corringham,Stanford-le-Hope,Essex,,SS17 7LY,Tel: 01375 677577, - ,,,No ratings yet Rate it yourself - /Services/opticians/LeaveReview/DefaultView.aspx?id=OP_5GQ_11951__000001_SS177LY,0,0,
Belson & Sons,OP_5GQ_4450__000001_SS177NA,OPT,63 St. Johns Way,Corringham,Stanford-le-Hope,Essex,,SS17 7NA,Tel: 01375 674130, - ,,,No ratings yet Rate it yourself - /Services/opticians/LeaveReview/DefaultView.aspx?id=OP_5GQ_4450__000001_SS177NA,0,0,
John High Opticians (Faversham),OP_5LN_3423__000001_ME137AA,OPT,,8 Market Street,,Faversham,,ME13 7AA,Tel: 01795 532803, - ,,,4 ratings Rate it yourself - /Services/opticians/LeaveReview/DefaultView.aspx?id=OP_5LN_3423__000001_ME137AA,,,