Organisation Name,NACS Code,Organisation Type,Address1,Address2,Address3,Address4,Address5,PostCode,Telephone Number,Opening time,Value  (Opening time),Banding Classification  (Opening time),NHS.UK users rating,Value  (NHS.UK users rating),Banding Classification  (NHS.UK users rating),Car parking (Is there car parking at this organisation?)
South Bank Eye Centre,OP_5LD_10161__000001_SW82JL,OPT,395 Wandsworth Road,,London,,,SW8 2JL,Tel: 020 7720 0938, - ,,,No ratings yet Rate it yourself - /Services/opticians/LeaveReview/DefaultView.aspx?id=OP_5LD_10161__000001_SW82JL,0,0,
Medirex Opticans,OP_5LD_12859__000002_SW82UX,OPT,28-29 Wilcox Close,Lambeth,London,,,SW8 2UD,Tel: 020 76221893, - ,,,No ratings yet Rate it yourself - /Services/opticians/LeaveReview/DefaultView.aspx?id=OP_5LD_12859__000002_SW82UX,0,0,
Monoptics Ltd,OP_5LD_12861__000002_SW99AU,OPT,11 Stockwell Road,Stockwell,London,,,SW9 9AU,Tel: 020 7274 6636, - ,,,No ratings yet Rate it yourself - /Services/opticians/LeaveReview/DefaultView.aspx?id=OP_5LD_12861__000002_SW99AU,0,0,
Bromptons Opticians,OP_5LD_12855__000001_SW47TB,OPT,103 Clapham High Street,,London,,,SW4 7TB,Tel: 020 7627 5753, - ,,,No ratings yet Rate it yourself - /Services/opticians/LeaveReview/DefaultView.aspx?id=OP_5LD_12855__000001_SW47TB,0,0,
Pimlico Eyecare ,OP_5LC_13402__000002_SW1V3EN,OPT,109 Lupus Street,,London,,,SW1V 3EN,Tel: 020 7233 8398, - ,,,No ratings yet Rate it yourself - /Services/opticians/LeaveReview/DefaultView.aspx?id=OP_5LC_13402__000002_SW1V3EN,0,0,
Boots-Clapham,OP_5LD_10592__000002_SW47SS,OPT,151-153 Clapham High Street,,Clapham,London,,SW4 7SS,Tel: 0207 622 3023, - ,,,No ratings yet Rate it yourself - /Services/opticians/LeaveReview/DefaultView.aspx?id=OP_5LD_10592__000002_SW47SS,0,0,
The Eye Centre,OP_5LD_2325__000001_SW40HY,OPT,,2 The Pavement,Clapham Common,London,,SW4 0HY,Tel: 020 7622 1649, - ,,,No ratings yet Rate it yourself - /Services/opticians/LeaveReview/DefaultView.aspx?id=OP_5LD_2325__000001_SW40HY,0,0,
A & I Lask,OP_5LD_4638__000001_SW96BS,OPT,60a Brixton Road,,London,,,SW9 6BS,Tel: 020 7735 5309, - ,,,No ratings yet Rate it yourself - /Services/opticians/LeaveReview/DefaultView.aspx?id=OP_5LD_4638__000001_SW96BS,0,0,
Quinlans Opticians,647000__000001_SW1V2PD,OPT,,34 Moreton Street,,London,,SW1V 2PD,Tel: 02072337770, - ,,,No ratings yet Rate it yourself - /Services/opticians/LeaveReview/DefaultView.aspx?id=647000__000001_SW1V2PD,0,0,
R Woodfall Opticians,OP_5LD_6631__000002_SW97AW,OPT,396 Brixton Road,,London,,,SW9 7AW,Tel: 020 7274 4356, - ,,,No ratings yet Rate it yourself - /Services/opticians/LeaveReview/DefaultView.aspx?id=OP_5LD_6631__000002_SW97AW,0,0,
Clive Kay Opticians,OP_5LC_13369__000001_SW1V1RU,OPT,4 Warwick Way,,London,,,SW1V 1RU,Tel: 020 7834 7296, - ,,,No ratings yet Rate it yourself - /Services/opticians/LeaveReview/DefaultView.aspx?id=OP_5LC_13369__000001_SW1V1RU,0,0,
Specsavers Opticians,OP_5LD_10155__000001_SW98EQ,OPT,492 Brixton Road,Brixton,London,,,SW9 8EQ,Tel: 020 7738 5999, - ,,,1 rating Rate it yourself - /Services/opticians/LeaveReview/DefaultView.aspx?id=OP_5LD_10155__000001_SW98EQ,,,
Banks Optometrists,OP_5LD_12858__000002_SW25SG,OPT,8 Acre Lane,Brixton,London,,,SW2 5SG,Tel: 020 7274 4414, - ,,,No ratings yet Rate it yourself - /Services/opticians/LeaveReview/DefaultView.aspx?id=OP_5LD_12858__000002_SW25SG,0,0,
Clear Vision,OP_5LD_10787__000001_SW98LF,OPT,428 Coldharbour Lane,,London,,,SW9 8LF,Tel: 020 7737 3660, - ,,,No ratings yet Rate it yourself - /Services/opticians/LeaveReview/DefaultView.aspx?id=OP_5LD_10787__000001_SW98LF,0,0,
Hattons Opticians,OP_5LD_190__000002_SE116EE,OPT,157 Lambeth Walk,,London,,,SE11 6EE,Tel: 020 7582 8877, - ,,,No ratings yet Rate it yourself - /Services/opticians/LeaveReview/DefaultView.aspx?id=OP_5LD_190__000002_SE116EE,0,0,
David Clulow Opticians,OP_5LC_12150__000001_SW1W9SJ,OPT,Victoria Place Shopping Centre,115 Buckingham Palace Road,London,,,SW1W 9SJ,Tel: 020 7233 8848, - ,,,No ratings yet Rate it yourself - /Services/opticians/LeaveReview/DefaultView.aspx?id=OP_5LC_12150__000001_SW1W9SJ,0,0,
Karen Lockyer Optometrists,07252__000002_SW113BS,OPT,98 St John's Road,Battersea,London,,,SW11 3BS,Tel: 020 7228 0467, - ,,,No ratings yet Rate it yourself - /Services/opticians/LeaveReview/DefaultView.aspx?id=07252__000002_SW113BS,0,0,
Optique Opticians,OP_5LG_11706__000001_SW113BS,OPT,276 Battersea Park Road,,Battersea,,,SW11 3BS,Tel: 0207 228 2754, - ,,,1 rating Rate it yourself - /Services/opticians/LeaveReview/DefaultView.aspx?id=OP_5LG_11706__000001_SW113BS,,,
Unia Opticians,OP_5LC_7309__000002_SW1P2HY,OPT,9 Strutton Ground,,St James’s Park,London,,SW1P 2HY,Tel: 020 7222 0066, - ,,,No ratings yet Rate it yourself - /Services/opticians/LeaveReview/DefaultView.aspx?id=OP_5LC_7309__000002_SW1P2HY,0,0,
Boots-London - Victoria,OP_5LC_5034__000003_SW1E5JL,OPT,145 Victoria Street,,London,London,,SW1E 5NH,Tel: 020 7834 4017, - ,,,No ratings yet Rate it yourself - /Services/opticians/LeaveReview/DefaultView.aspx?id=OP_5LC_5034__000003_SW1E5JL,0,0,
David Clulow Opticians,OP_5LC_1840__000001_SW1H0HW,OPT,61-71 Victoria Street,,London,,,SW1H 0HW,Tel: 020 7233 2339, - ,,,2 ratings Rate it yourself - /Services/opticians/LeaveReview/DefaultView.aspx?id=OP_5LC_1840__000001_SW1H0HW,,,
Specsavers Opticians,OLO1192205LC__000001_SW1E5JH,OPT,1 Cathedral Walk,Cardinal Place Victoria,London,,,SW1E 5JH,Tel: 020 7976 4250, - ,,,No ratings yet Rate it yourself - /Services/opticians/LeaveReview/DefaultView.aspx?id=OLO1192205LC__000001_SW1E5JH,0,0,
Oliver Peoples,OPT_SW1X9BX_1,OPT,,151 Sloane Street,,London,,SW1X 9BX,, - ,,,No ratings yet Rate it yourself - /Services/opticians/LeaveReview/DefaultView.aspx?id=OPT_SW1X9BX_1,0,0,
Dollond & Aitchison,OP_5LA_962__000001_SW1X9AS,OPT,127a Sloane Street,,London,,,SW1X 9AS,Tel: 020 7730 4870, - ,,,No ratings yet Rate it yourself - /Services/opticians/LeaveReview/DefaultView.aspx?id=OP_5LA_962__000001_SW1X9AS,0,0,
Auerbach & Steele,OP_5LA_3188__000001_SW34PW,OPT,129 Kings Road,,,London,,SW3 4PW,Tel: 020 7349 0001, - ,,,No ratings yet Rate it yourself - /Services/opticians/LeaveReview/DefaultView.aspx?id=OP_5LA_3188__000001_SW34PW,0,0,
Chelsea Eye Centre,OP_5LA_2527__000001_SW34UP,OPT,176 Kings Road,,London,,,SW3 4UP,Tel: 020 7351 3847, - ,,,2 ratings Rate it yourself - /Services/opticians/LeaveReview/DefaultView.aspx?id=OP_5LA_2527__000001_SW34UP,,,
Prime Opticians,TP98H,OPT,,18 St John's Road,,London,Greater London,SW11 1PN,Tel: 0208 150 1950, - ,,,No ratings yet Rate it yourself - /Services/opticians/LeaveReview/DefaultView.aspx?id=TP98H,0,0,
David Clulow Opticians,OP_5LA_9869__000001_SW35EB,OPT,185 Kings Road,,London,,,SW3 5EB,Tel: 020 7376 5733, - ,,,No ratings yet Rate it yourself - /Services/opticians/LeaveReview/DefaultView.aspx?id=OP_5LA_9869__000001_SW35EB,0,0,
Specsavers Opticians,OP_5LG_3535__000002_SW111PW,OPT,,54-56 St John's Road,London,Clapham,,SW11 1PR,Tel: 0207 978 6626, - ,,,1 rating Rate it yourself - /Services/opticians/LeaveReview/DefaultView.aspx?id=OP_5LG_3535__000002_SW111PW,,,
Rodney Opticians,OP_5LE_7527__000002_SE57AF,OPT,7 Camberwell Green,,,London,,SE5 7AF,Tel: 020 7703 3615, - ,,,1 rating Rate it yourself - /Services/opticians/LeaveReview/DefaultView.aspx?id=OP_5LE_7527__000002_SE57AF,,,
Churchills of London Ltd,OP_5LE_7985__000001_SE171JE,OPT,220-222 Walworth Road,,London,,,SE17 1JE,Tel: 020 7703 0405, - ,,,No ratings yet Rate it yourself - /Services/opticians/LeaveReview/DefaultView.aspx?id=OP_5LE_7985__000001_SE171JE,0,0,
Boots-London - Walworth Rd,OP_5LE_13044__000002_SE172TG,OPT,297 Walworth Road,,,London,,SE17 2TG,Tel: 0207 703 3814, - ,,,No ratings yet Rate it yourself - /Services/opticians/LeaveReview/DefaultView.aspx?id=OP_5LE_13044__000002_SE172TG,0,0,
Bayfields Opticians and Audiologist Northcote Road,SW11 6PS__000001_SW116PS,OPT,126 Northcote Road,126 Northcote Road,Clapham Junction,London,,SW11 6QU,Tel: 020 7228 8200, - ,,,No ratings yet Rate it yourself - /Services/opticians/LeaveReview/DefaultView.aspx?id=SW11 6PS__000001_SW116PS,0,0,
Chatoo Opticians,OP_5LC_131__000003_SW1X9JF,OPT,25f Lowndes Street,,London,,,SW1X 9JF,Tel: 020 7235 2783, - ,,,No ratings yet Rate it yourself - /Services/opticians/LeaveReview/DefaultView.aspx?id=OP_5LC_131__000003_SW1X9JF,0,0,
East Street Eye Clinic,D4K5V,OPT,,40 East Street,,London,,SE17 2DN,, - ,,,3 ratings Rate it yourself - /Services/opticians/LeaveReview/DefaultView.aspx?id=D4K5V,,,
R & J Optical,OP_5LE_13042__000001_SE172DJ,OPT,39-41 East Street,,London,,,SE17 2DJ,Tel: 020 7252 4544, - ,,,No ratings yet Rate it yourself - /Services/opticians/LeaveReview/DefaultView.aspx?id=OP_5LE_13042__000001_SE172DJ,0,0,
Isis Opticians,OP_5LA_13985__000001_SW36SN,OPT,153c Fulham Road,,London,,,SW3 6SN,Tel: 020 7823 8080, - ,,,No ratings yet Rate it yourself - /Services/opticians/LeaveReview/DefaultView.aspx?id=OP_5LA_13985__000001_SW36SN,0,0,
36 Opticians,OLO98315LA__000001_SW31NU,OPT,36 Beauchamp Place,,London,,,SW3 1NU,Tel: 020 7581 6336, - ,,,No ratings yet Rate it yourself - /Services/opticians/LeaveReview/DefaultView.aspx?id=OLO98315LA__000001_SW31NU,0,0,
S Squared Ltd,OP_5LD_12856__000001_SE17RG,OPT,33 Lower Marsh,Waterloo,London,,,SE1 7RG,Tel: 020 7633 0680, - ,,,No ratings yet Rate it yourself - /Services/opticians/LeaveReview/DefaultView.aspx?id=OP_5LD_12856__000001_SE17RG,0,0,
D T Macdonald Opticians,OP_5LD_4076__000001_SE240NG,OPT,141 Dulwich Road,,London,,,SE24 0NG,Tel: 020 7274 5639, - ,,,No ratings yet Rate it yourself - /Services/opticians/LeaveReview/DefaultView.aspx?id=OP_5LD_4076__000001_SE240NG,0,0,
David Clulow Opticians,OP_5LC_7__000006_SW1X7XL,OPT,87-135 Brompton Road,Knightsbridge,London,,,SW1X 7XL,Tel: 020 7893 8840, - ,,,No ratings yet Rate it yourself - /Services/opticians/LeaveReview/DefaultView.aspx?id=OP_5LC_7__000006_SW1X7XL,0,0,
Thomas H Collison Ltd,OP_5LA_9283__000001_SW109NH,OPT,Chelsea and Westminster Hospital,369 Fulham Road,London,London,,SW10 9NH,Tel: 020 3315 8886, - ,,,2 ratings Rate it yourself - /Services/opticians/LeaveReview/DefaultView.aspx?id=OP_5LA_9283__000001_SW109NH,,,
Abbot Opticians,OP_5LA_13378__000001_SW72NA,OPT,13 The Arcade,South Kensington Station,London,,,SW7 2NA,Tel: 020 7581 2330, - ,,,No ratings yet Rate it yourself - /Services/opticians/LeaveReview/DefaultView.aspx?id=OP_5LA_13378__000001_SW72NA,0,0,
Joy Optical,OP_5LA_264__000001_SW73DL,OPT,8 Old Brompton Road,8 Old Brompton Road,London,London,,SW7 3DL,Tel: 020 7584 4172, - ,,,No ratings yet Rate it yourself - /Services/opticians/LeaveReview/DefaultView.aspx?id=OP_5LA_264__000001_SW73DL,0,0,
Perfect Vision,OP_5LG_14643__000003_SW129BW,OPT,182 Balham High Road,Balham,London,,,SW12 9BW,Tel: 0208 673 2122, - ,,,No ratings yet Rate it yourself - /Services/opticians/LeaveReview/DefaultView.aspx?id=OP_5LG_14643__000003_SW129BW,0,0,
Boots Opticians Balham,A1T4Y,OPT,,170 High Road,,Balham,Greater London,SW12 9BW,Tel: 020 86731546, - ,,,No ratings yet Rate it yourself - /Services/opticians/LeaveReview/DefaultView.aspx?id=A1T4Y,0,0,
Clair Vision,SW12 9BW  A__000005_SW129BW,OPT,,164 Balham High Road,,Balham,,SW12 9BW,Tel: 0208 675 3368, - ,,,2 ratings Rate it yourself - /Services/opticians/LeaveReview/DefaultView.aspx?id=SW12 9BW  A__000005_SW129BW,,,
Washin Optical London,OP_5LC_2084__000001_W1R5PJ,OPT,14-20 Regent Street,,London,,,SW1Y 4PH,Tel: 020 7839 2091, - ,,,No ratings yet Rate it yourself - /Services/opticians/LeaveReview/DefaultView.aspx?id=OP_5LC_2084__000001_W1R5PJ,0,0,
Specsavers Fulham Wharf (Sainsbury’s),ODS: TP98Y,OPT,,"26 Townmead Road, Sands End ",,London,,SW6 2GD,, - ,,,No ratings yet Rate it yourself - /Services/opticians/LeaveReview/DefaultView.aspx?id=ODS: TP98Y,0,0,
Boots-London - Strand,OP_5LC_2028__000001_WC2R0QE,OPT,428 Strand,,,London,,WC2R 0QE,Tel: 0207 240 2049, - ,,,No ratings yet Rate it yourself - /Services/opticians/LeaveReview/DefaultView.aspx?id=OP_5LC_2028__000001_WC2R0QE,0,0,
Boots,OP_5HL_325__000001_W1B 5RA,OPT,Boots Opticians,44-46 regent street London,,Piccadilly,,W1B 5RA,Tel: 020 7287 2261, - ,,,No ratings yet Rate it yourself - /Services/opticians/LeaveReview/DefaultView.aspx?id=OP_5HL_325__000001_W1B 5RA,0,0,
University Vision ,OL01235225LC__000002_SW72AZ,OPT,Imperial College,The Walkway Level 2,Shefield Building,Exhibition Road,,SW7 2AZ,Tel: 020 7594 9746, - ,,,No ratings yet Rate it yourself - /Services/opticians/LeaveReview/DefaultView.aspx?id=OL01235225LC__000002_SW72AZ,0,0,
Walters Opticians,OP_5H1_4453__000001_SW62TF,OPT,112 Wandsworth Bridge Road,Fulham,London,,,SW6 2TF,Tel: 020 7736 8721, - ,,,No ratings yet Rate it yourself - /Services/opticians/LeaveReview/DefaultView.aspx?id=OP_5H1_4453__000001_SW62TF,0,0,
Strand Specsavers Ltd ,OP_WC2R0AG_29378,OPT,,114 Strand,,London,,WC2R 0AG,Tel: 020 3077 4950, - ,,,6 ratings Rate it yourself - /Services/opticians/LeaveReview/DefaultView.aspx?id=OP_WC2R0AG_29378,,,
Eyecare Clinic,OP_5LC_8884__000001_WC2H7JS,OPT,19a Newport Court,,London,,,WC2H 7JS,Tel: 020 7734 3688, - ,,,No ratings yet Rate it yourself - /Services/opticians/LeaveReview/DefaultView.aspx?id=OP_5LC_8884__000001_WC2H7JS,0,0,
Realeyes Ltd,OP_5LD_1539__000001_SW24UG,OPT,107 Streatham Hill,,London,London,,SW2 4UG,Tel: 020 8671 8659, - ,,,5 ratings Rate it yourself - /Services/opticians/LeaveReview/DefaultView.aspx?id=OP_5LD_1539__000001_SW24UG,,,
David Clulow Opticians,OP_5LC_9805__000001_W1V5PA,OPT,70 Old Compton Street,,London,,,W1D 4UL,Tel: 020 7437 4177, - ,,,No ratings yet Rate it yourself - /Services/opticians/LeaveReview/DefaultView.aspx?id=OP_5LC_9805__000001_W1V5PA,0,0,
Obhrai & Son Ltd,OP_5LC_913__000001_WC2R1JA,OPT,146 Strand,,London,,,WC2R 1JA,Tel: 020 7379 5226, - ,,,No ratings yet Rate it yourself - /Services/opticians/LeaveReview/DefaultView.aspx?id=OP_5LC_913__000001_WC2R1JA,0,0,
The Eye Establishment,TP8GN,OPT,,227-229 Old Brompton Road,,London,,SW5 0EA,, - ,,,1 rating Rate it yourself - /Services/opticians/LeaveReview/DefaultView.aspx?id=TP8GN,,,
Zafash Opticians,606231__000002_SW50EA,OPT,231b Old Brompton Road,,London,,,SW5 0EA,Tel: 020 7373 7755, - ,,,No ratings yet Rate it yourself - /Services/opticians/LeaveReview/DefaultView.aspx?id=606231__000002_SW50EA,0,0,
H A Curran,5LA0116718__000002_SW74QT,OPT,44 Gloucester Road,,London,,,SW7 4QT,Tel: 020 7584 2697, - ,,,No ratings yet Rate it yourself - /Services/opticians/LeaveReview/DefaultView.aspx?id=5LA0116718__000002_SW74QT,0,0,
David Clulow Opticians,OP_5LC_11207__000001_WC2E9JR,OPT,6 Neal Street,,London,,,WC2H 9LY,Tel: 020 7240 8284, - ,,,No ratings yet Rate it yourself - /Services/opticians/LeaveReview/DefaultView.aspx?id=OP_5LC_11207__000001_WC2E9JR,0,0,
Kensington Cromwell Road Specsavers Ltd,TP9AQ,OPT,,158A Cromwell Road,,London,,SW7 4EJ,Tel: 02073417683, - ,,,1 rating Rate it yourself - /Services/opticians/LeaveReview/DefaultView.aspx?id=TP9AQ,,,
Vision Express Opticians,OP_5LC_3710__000001_W1N9FA,OPT,263-265 Oxford Street,,London,,,W1C 2DF,Tel: 020 7409 7880, - ,,,1 rating Rate it yourself - /Services/opticians/LeaveReview/DefaultView.aspx?id=OP_5LC_3710__000001_W1N9FA,,,
Boots-London - Sedley Place,OLC016075LC__000001_W1C2JL,OPT,361 Oxford Street,,,London,,W1C 2JL,Tel: 0207 491 9644, - ,,,No ratings yet Rate it yourself - /Services/opticians/LeaveReview/DefaultView.aspx?id=OLC016075LC__000001_W1C2JL,0,0,
Boots-Peckham,OP_5LE_157__000001_SE155BY,OPT,60-62 Rye Lane,,Peckham,London,,SE15 5BY,Tel: 0207 639 0924, - ,,,No ratings yet Rate it yourself - /Services/opticians/LeaveReview/DefaultView.aspx?id=OP_5LE_157__000001_SE155BY,0,0,
Eyecloud Opticians,,OPT,,45 Rye Lane,,Peckham,Greater London,SE15 5ER,Tel: 0208 732 0008, - ,,,N/A - Data not available,,,
Paine & Hunter,OP_5LE_6817__000001_SE228EP,OPT,55 Lordship Lane,,London,,,SE22 8EP,Tel: 020 8299 1464, - ,,,2 ratings Rate it yourself - /Services/opticians/LeaveReview/DefaultView.aspx?id=OP_5LE_6817__000001_SE228EP,,,
South London Resource Centre,OP_5LE_13045__000002_SE19RT,OPT,Department Of Ophthalmology,Guys Hospital,St Thomas Street,,,SE1 9RT,Tel: 020 7955 4307, - ,,,No ratings yet Rate it yourself - /Services/opticians/LeaveReview/DefaultView.aspx?id=OP_5LE_13045__000002_SE19RT,0,0,
Specsavers Opticians,OP_5LE_1790__000003_SE155EW,OPT,Unit 3 Aylesham Centre,3 Rye Lane,Peckham,London,,SE15 5EW,Tel: 020 7277 7222, - ,,,No ratings yet Rate it yourself - /Services/opticians/LeaveReview/DefaultView.aspx?id=OP_5LE_1790__000003_SE155EW,0,0,
Sight Care ,OP_5LC_1023__000001_W1D2DZ,OPT,45 Oxford Street,,London,,,W1D 2DZ,Tel: 020 7434 2385, - ,,,No ratings yet Rate it yourself - /Services/opticians/LeaveReview/DefaultView.aspx?id=OP_5LC_1023__000001_W1D2DZ,0,0,
David Clulow Opticians,OP_5LC_46__000003_W1A1AB,OPT,4th Floor,Selfridges,400 Oxford Street,London,,W1A 1AB,Tel: 020 7318 3353, - ,,,No ratings yet Rate it yourself - /Services/opticians/LeaveReview/DefaultView.aspx?id=OP_5LC_46__000003_W1A1AB,0,0,
Optical Express,OP_5K7_5009__000002_WC2H8EL,OPT,219-229 Shaftesbury Avenue,,,London,,WC2H 8EL,Tel: 0800 023 2020, - ,,,No ratings yet Rate it yourself - /Services/opticians/LeaveReview/DefaultView.aspx?id=OP_5K7_5009__000002_WC2H8EL,0,0,
Aristone Opticians,OP_5H1_2309__000001_SW61LY,OPT,356 North End Road,Fulham,London,,,SW6 1LY,Tel: 020 7385 9772, - ,,,6 ratings Rate it yourself - /Services/opticians/LeaveReview/DefaultView.aspx?id=OP_5H1_2309__000001_SW61LY,,,
Paris Miki London Ltd,OP_5LC_5922__000001_W1R7HG,OPT,,Paris Miki London Ltd,19 Duke Street,London,,W1U 1DJ,Tel: 020 7935 1341, - ,,,No ratings yet Rate it yourself - /Services/opticians/LeaveReview/DefaultView.aspx?id=OP_5LC_5922__000001_W1R7HG,0,0,
Boots-London - Wigmore St,OP_5LC_568__000001_W1U1PN,OPT,35 Wigmore Street,,,London,,W1U 1PW,Tel: 0207 580 4343, - ,,,No ratings yet Rate it yourself - /Services/opticians/LeaveReview/DefaultView.aspx?id=OP_5LC_568__000001_W1U1PN,0,0,
BOWINGS,OP_5C3_14477__000001_EC4Y1JU,OPT,58 Fleet Street,London,London,,,EC4Y 1JU,Tel: 020 7353 7801, - ,,,No ratings yet Rate it yourself - /Services/opticians/LeaveReview/DefaultView.aspx?id=OP_5C3_14477__000001_EC4Y1JU,0,0,
Specsavers Opticians,OP_5K7_729__000002_W1P9DP,OPT,"Unit 6, 6-17 Tottenham Court Road",,London,,,W1T 1BG,Tel: 020 7580 5115, - ,,,1 rating Rate it yourself - /Services/opticians/LeaveReview/DefaultView.aspx?id=OP_5K7_729__000002_W1P9DP,,,
David Clulow Opticians,OP_5LC_503__000001_W1M9LE,OPT,41-43 Wigmore Street,,London,,,W1U 1PR,Tel: 020 7486 1485, - ,,,1 rating Rate it yourself - /Services/opticians/LeaveReview/DefaultView.aspx?id=OP_5LC_503__000001_W1M9LE,,,
GREGORY SEELEY,OP_5C3_14465__000001_EC4Y1HT,OPT,63 Fleet Street,City,,London,,EC4Y 1HT,Tel: 020 7353 1408, - ,,,No ratings yet Rate it yourself - /Services/opticians/LeaveReview/DefaultView.aspx?id=OP_5C3_14465__000001_EC4Y1HT,0,0,
Boots-London - Tottenham Court Road,OP_5K7_5005__000001_W1T2BE,OPT,16-17 Tottenham Court Road,,,London,,W1T 1BE,Tel: 0207 580 6510, - ,,,No ratings yet Rate it yourself - /Services/opticians/LeaveReview/DefaultView.aspx?id=OP_5K7_5005__000001_W1T2BE,0,0,
Boots-Wandsworth,SW18 4TE__000001_SW184TE,OPT,28 South Side Shopping Centre,,Wandsworth,London,,SW18 4TE,Tel: 0208 871 9396, - ,,,No ratings yet Rate it yourself - /Services/opticians/LeaveReview/DefaultView.aspx?id=SW18 4TE__000001_SW184TE,0,0,
Specsavers Opticians,OP_5H1_13865__000002_SW61NP,OPT,387 North End Road,Fulham,,London,,SW6 1NP,Tel: 020 7471 0390, - ,,,4 ratings Rate it yourself - /Services/opticians/LeaveReview/DefaultView.aspx?id=OP_5H1_13865__000002_SW61NP,,,
R N  MORJARIA,SW18 4JB__000002_SW184JB,OPT,123 Wamdsworth High Street,,Wandsworth,London,,SW18 4JB,, - ,,,No ratings yet Rate it yourself - /Services/opticians/LeaveReview/DefaultView.aspx?id=SW18 4JB__000002_SW184JB,0,0,
Boots-Streatham,OP_5LD_12179__000001_SW161PR,OPT,6 Astoria Parade,,Streatham High Road,London,,SW16 1PR,Tel: 0208 769 1030, - ,,,2 ratings Rate it yourself - /Services/opticians/LeaveReview/DefaultView.aspx?id=OP_5LD_12179__000001_SW161PR,,,
R Woodfall,OP_5LE_10117__000001_SE154TP,OPT,183 Rye Lane,,London,,,SE15 4TP,Tel: 020 7639 4520, - ,,,No ratings yet Rate it yourself - /Services/opticians/LeaveReview/DefaultView.aspx?id=OP_5LE_10117__000001_SE154TP,0,0,
EYELINK (SECOND SIGHT LTD),10024__000001_EC4V6DU,OPT,11 Ludgate,Broadgate,London,,,EC4V 6DU,Tel: 020 7329 4462, - ,,,No ratings yet Rate it yourself - /Services/opticians/LeaveReview/DefaultView.aspx?id=10024__000001_EC4V6DU,0,0,
EAGLE EYES,SW16 4DR__000001_SW184DR,OPT,199 Garrett Lane,,Wandsworth,London,,SW18 4DR,, - ,,,No ratings yet Rate it yourself - /Services/opticians/LeaveReview/DefaultView.aspx?id=SW16 4DR__000001_SW184DR,0,0,
Vision Express,OP_EC4A2AX_30661,OPT,,108 Fleet St,,London,,EC4A 2AX,, - ,,,No ratings yet Rate it yourself - /Services/opticians/LeaveReview/DefaultView.aspx?id=OP_EC4A2AX_30661,0,0,
Viren Jani Optometrist,OP_5LC_8471__000001_W1K2TQ,OPT,15 New Quebec Street,,London,,,W1H 7RT,Tel: 020 77247788, - ,,,No ratings yet Rate it yourself - /Services/opticians/LeaveReview/DefaultView.aspx?id=OP_5LC_8471__000001_W1K2TQ,0,0,
Eye Care Marble Arch,-425 5LC__000001_W22JE,OPT,19 Edgware Road,,London,,,W2 2JE,Tel: 020 7402 3260, - ,,,No ratings yet Rate it yourself - /Services/opticians/LeaveReview/DefaultView.aspx?id=-425 5LC__000001_W22JE,0,0,
Boots-Kensington - High St,OP_5LA_13145__000001_W85NP,OPT,13 High Street,,Kensington,London,,W8 5NP,Tel: 0207 937 0666, - ,,,No ratings yet Rate it yourself - /Services/opticians/LeaveReview/DefaultView.aspx?id=OP_5LA_13145__000001_W85NP,0,0,
Optical Express,,OPT,,22 Harley Street,,London,,W1G 9AP,, - ,,,N/A - Data not available,,,
Optical Express,W1G 9AP_11111,OPT,22 Harley Street,,,London,,W1G 9AP,Tel: 0800 023 2020, - ,,,1 rating Rate it yourself - /Services/opticians/LeaveReview/DefaultView.aspx?id=W1G 9AP_11111,,,
The Eye Place,,OPT,,5 Charlotte Place,,Fitzrovia London,,W1T 1SF,Tel: 020 7583 1936, - ,,,N/A - Data not available,,,
Hodd Barnes Dickins,OP_5K7_4265__000001_WC1V6LF,OPT,94 High Holborn,,London,,,WC1V 6LF,Tel: 020 7242 3492, - ,,,No ratings yet Rate it yourself - /Services/opticians/LeaveReview/DefaultView.aspx?id=OP_5K7_4265__000001_WC1V6LF,0,0,
R Woodfall Opticians,OP_5LD_667__000001_SE279AF,OPT,286 Norwood Road,,London,,,SE27 9AF,Tel: 020 8670 4100, - ,,,No ratings yet Rate it yourself - /Services/opticians/LeaveReview/DefaultView.aspx?id=OP_5LD_667__000001_SE279AF,0,0,
Unger and Fagan Opticians,OP_5LC_13433__000001_W1H5PA,OPT,5 George Street,,Marylebone,London,,W1U 3QQ,Tel: 020 7486 6933, - ,,,No ratings yet Rate it yourself - /Services/opticians/LeaveReview/DefaultView.aspx?id=OP_5LC_13433__000001_W1H5PA,0,0,
Specsavers Opticians,OP_5LD_10154__000004_SW161BB,OPT,192 Streatham High Road,Streatham,London,,,SW16 1BB,Tel: 020 8677 5866, - ,,,2 ratings Rate it yourself - /Services/opticians/LeaveReview/DefaultView.aspx?id=OP_5LD_10154__000004_SW161BB,,,
City Opticians,OP_5K7_8810__000001_WC2A1AA,OPT,75 Chancery Lane,,London,,,WC2A 1AA,Tel: 020 7405 4875, - ,,,No ratings yet Rate it yourself - /Services/opticians/LeaveReview/DefaultView.aspx?id=OP_5K7_8810__000001_WC2A1AA,0,0,
Store Street Opticians,TP8TM,OPT,,34 Store Street,,Camden,Greater London,WC1E 7BS,Tel: 020 7636 8925, - ,,,1 rating Rate it yourself - /Services/opticians/LeaveReview/DefaultView.aspx?id=TP8TM,,,
Specsavers Opticians,OP 932__000001_WC1V7PU,OPT,"Unit 4, 311-318 High Holborn",Camden,London,,,WC1V 7PU,Tel: 020 7404 4432, - ,,,No ratings yet Rate it yourself - /Services/opticians/LeaveReview/DefaultView.aspx?id=OP 932__000001_WC1V7PU,0,0,
Hollands Of London,OLOTHER5LC__000001_W1G8UX,OPT,3 New Cavendish Street,,London,,,W1G 8UX,Tel: 020 7487 4267, - ,,,No ratings yet Rate it yourself - /Services/opticians/LeaveReview/DefaultView.aspx?id=OLOTHER5LC__000001_W1G8UX,0,0,