Organisation Name,NACS Code,Organisation Type,Address1,Address2,Address3,Address4,Address5,PostCode,Telephone Number,Opening time,Value  (Opening time),Banding Classification  (Opening time),NHS.UK users rating,Value  (NHS.UK users rating),Banding Classification  (NHS.UK users rating),Car parking (Is there car parking at this organisation?)
Carolyn Parker Optometrist (owned by Terry & Associates Ltd),OP_5MN_4147__000001_ST195AA,OPT,Crown Bridge,Penkridge,,Stafford,Staffordshire,ST19 5AA,Tel: 01785 713861, - ,,,No ratings yet Rate it yourself - /Services/opticians/LeaveReview/DefaultView.aspx?id=OP_5MN_4147__000001_ST195AA,0,0,
Flint & Partners,OP_5MN_6856__000001_ST199ES,OPT,The Surgery,Sandy Lane,Brewood,,,ST19 9ES,Tel: 0844 4770924, - ,,,No ratings yet Rate it yourself - /Services/opticians/LeaveReview/DefaultView.aspx?id=OP_5MN_6856__000001_ST199ES,0,0,
Webb & Lucas ,OP_5MN_3588__000001_ST162HL,OPT,"Webb, Lucas & Stubbs Optometrists",8 Bridge Street,,Stafford,Staffordshire,ST16 2HL,Tel: 01785 242127, - ,,,1 rating Rate it yourself - /Services/opticians/LeaveReview/DefaultView.aspx?id=OP_5MN_3588__000001_ST162HL,,,
The Eye Works,D-10610__000001_ST162DF,OPT,"Unit G24, Sts. John's Market",Earl Street,,Stafford,,ST16 2DF,, - ,,,No ratings yet Rate it yourself - /Services/opticians/LeaveReview/DefaultView.aspx?id=D-10610__000001_ST162DF,0,0,
Eye Works,6800,OPT,,"No. 4, St. Mary's Mews",,Stafford,Staffordshire,ST16 2AP,Tel: 01785 249417, - ,,,No ratings yet Rate it yourself - /Services/opticians/LeaveReview/DefaultView.aspx?id=6800,0,0,
Vision Express Opticians,20135__000001_ST162BB,OPT,Unit 3,Stafford Riverside,Stafford,Staffs,,ST16 3AA,Tel: 01785 215077, - ,,,No ratings yet Rate it yourself - /Services/opticians/LeaveReview/DefaultView.aspx?id=20135__000001_ST162BB,0,0,
Asda Opticians,20129__000001_ST163TA,OPT,Queensway,,Stafford,Staffordshire,,ST16 3TA,Tel: 01785 782020, - ,,,No ratings yet Rate it yourself - /Services/opticians/LeaveReview/DefaultView.aspx?id=20129__000001_ST163TA,0,0,
"Goodwin & Edge Ltd, T/A Mincher-Lockett Optometric Group",OP_5MN_3642__000001_ST162BP,OPT,18 Stafford Street,Stafford,,Staffordshire,,ST16 2BP,Tel: 01785 253478, - ,,,No ratings yet Rate it yourself - /Services/opticians/LeaveReview/DefaultView.aspx?id=OP_5MN_3642__000001_ST162BP,0,0,
Boots-Stafford - Goalgate St,OP_5MN_12039__000001_ST162NR,OPT,39 Gaolgate Street,,,Stafford,Staffordshire,ST16 2NR,Tel: 01785 225948, - ,,,1 rating Rate it yourself - /Services/opticians/LeaveReview/DefaultView.aspx?id=OP_5MN_12039__000001_ST162NR,,,
Direct Specs,5PK_ST16 2JU__000001_ST162JU,OPT,1 Salter Street,,Stafford,Staffordshire,,ST16 2JU,Tel: 01785 212001, - ,,,No ratings yet Rate it yourself - /Services/opticians/LeaveReview/DefaultView.aspx?id=5PK_ST16 2JU__000001_ST162JU,0,0,
Specsavers Opticians,OP_5MN_11367__000001_ST162BQ,OPT,20 Gaolgate Street,Stafford,,Staffordshire,,ST16 2BQ,Tel: 01785 255210, - ,,,No ratings yet Rate it yourself - /Services/opticians/LeaveReview/DefaultView.aspx?id=OP_5MN_11367__000001_ST162BQ,0,0,
Boots-Cannock,CO-2377/5MM/C__000002_WS111BN,OPT,,69 High Green,,Cannock,Staffordshire,WS11 1BN,Tel: 01543 503 356, - ,,,No ratings yet Rate it yourself - /Services/opticians/LeaveReview/DefaultView.aspx?id=CO-2377/5MM/C__000002_WS111BN,0,0,
Puri Healthcare Ltd T/A Chase Eyecare,CO-2707/5MM/C__000003_WS111BN,OPT,75 High Green,,Cannock,Staffordshire,Staffordshire,WS11 1BN,Tel: 01543 570313, - ,,,No ratings yet Rate it yourself - /Services/opticians/LeaveReview/DefaultView.aspx?id=CO-2707/5MM/C__000003_WS111BN,0,0,yes
Puri Healthcare Ltd T/A Chase Eyecare,OP_5MM_7952__000001_WS125AY,OPT,75 High Green,,Cannock,Cannock,Staffordshire,WS11 1BN,Tel: 01543 570313, - ,,,No ratings yet Rate it yourself - /Services/opticians/LeaveReview/DefaultView.aspx?id=OP_5MM_7952__000001_WS125AY,0,0,yes
LAM Ltd,OP_5MM_5057__000001_WS111BN,OPT,,69 High Green,,Cannock,,WS11 1BN,Tel: 01543 503356, - ,,,No ratings yet Rate it yourself - /Services/opticians/LeaveReview/DefaultView.aspx?id=OP_5MM_5057__000001_WS111BN,0,0,
Specsavers Opticians,OP_5MM_8649__000001_WS111WS,OPT,19 Cannock Shopping Centre,Cannock,Staffordshire,,,WS11 1WS,Tel: 01543 462232, - ,,,No ratings yet Rate it yourself - /Services/opticians/LeaveReview/DefaultView.aspx?id=OP_5MM_8649__000001_WS111WS,0,0,
"Goodwin & Edge Ltd, T/A Mincher-Lockett Optometric Group",5PK_ST20 0EZ__000001_ST200EZ,OPT,Station Road,Gnosall,,Stafford,,ST20 0EZ,Tel: 01785 823790, - ,,,No ratings yet Rate it yourself - /Services/opticians/LeaveReview/DefaultView.aspx?id=5PK_ST20 0EZ__000001_ST200EZ,0,0,
Philip Howard Opticians,5PK/WS11 1DD__000001_WS111DD,OPT,4a Market Place,,Cannock,Staffordshire,,WS11 1DD,Tel: 01543 467277, - ,,,No ratings yet Rate it yourself - /Services/opticians/LeaveReview/DefaultView.aspx?id=5PK/WS11 1DD__000001_WS111DD,0,0,
Portland Opticians,OP_5MM_11876__000001_WS111BZ,OPT,17 Market Place,Cannock,Staffordshire,Staffordshire,,WS11 1BZ,Tel: 01543 503343, - ,,,No ratings yet Rate it yourself - /Services/opticians/LeaveReview/DefaultView.aspx?id=OP_5MM_11876__000001_WS111BZ,0,0,
Portland Eye Care Services Ltd,5MX095,OPT,,19 New Street,Bridgtown,Cannock,,WS11 0DD,Tel: 01543 462029, - ,,,No ratings yet Rate it yourself - /Services/opticians/LeaveReview/DefaultView.aspx?id=5MX095,0,0,
Boots Opticians,OP_5DQ_14950__000004_WS125AG,OPT,88 Market Street,Hednesford,,Staffordshire,,WS12 1AG,Tel: 01543 422113, - ,,,No ratings yet Rate it yourself - /Services/opticians/LeaveReview/DefaultView.aspx?id=OP_5DQ_14950__000004_WS125AG,0,0,
Heather Bailey,OP_5MM_8119__000003_WS125AG,OPT,T/a Boots Optician,88 Market Street,,Cannock,,WS12 5AG,Tel: 01543 422113, - ,,,No ratings yet Rate it yourself - /Services/opticians/LeaveReview/DefaultView.aspx?id=OP_5MM_8119__000003_WS125AG,0,0,
Optical and Hearing Centre,5PK/6400__000001_WV107AU,OPT,Surgery House,2 South Crescent,Featherstone,,,WV10 7AU,Tel: 01902 306925, - ,,,No ratings yet Rate it yourself - /Services/opticians/LeaveReview/DefaultView.aspx?id=5PK/6400__000001_WV107AU,0,0,
Cannock Voyager Specsavers,L6R0Z,OPT,Sainsbury's,Voyager Drive,Orbital Retail Centre,Cannock,Staffordshire,WS11 8XP,Tel: 01543 462 232, - ,,,No ratings yet Rate it yourself - /Services/opticians/LeaveReview/DefaultView.aspx?id=L6R0Z,0,0,
Flint & Partners,OP_5MN_7633__000001_WV81PT,OPT,15 The Square,Wolverhampton Road,,Codsall,,WV8 1PT,Tel: 01902 846745, - ,,,No ratings yet Rate it yourself - /Services/opticians/LeaveReview/DefaultView.aspx?id=OP_5MN_7633__000001_WV81PT,0,0,
KELCHER OPTOMETRISTS,OP_5MN_12465__000001_WS66DZ,OPT,88A Wardles Lane,Great Wryley,,Walsall,Staffordshire,WS6 6DY,Tel: 01922 412040, - ,,,No ratings yet Rate it yourself - /Services/opticians/LeaveReview/DefaultView.aspx?id=OP_5MN_12465__000001_WS66DZ,0,0,Data not available
Bains Optical Healthcare,TP5KL,OPT,,160-162 Hednesford Road,,"Heath Hayes, Cannock",,WS12 3DZ,Tel: 01543 270080, - ,,,18 ratings Rate it yourself - /Services/opticians/LeaveReview/DefaultView.aspx?id=TP5KL,,,
4 Sight Eyecare Centre,OP_5MN_13987__000002_WV81PE,OPT,88 Wolverhampton Road,Birches Bridge,Codsall,,,WV8 1PE,Tel: 01902 844201, - ,,,No ratings yet Rate it yourself - /Services/opticians/LeaveReview/DefaultView.aspx?id=OP_5MN_13987__000002_WV81PE,0,0,
Scrivens Ltd,OP_5MV_585__000001_WV106BA,OPT,5 Three Tuns Parade,Stafford Road,,Fordhouses,West Midlands,WV10 6BA,Tel: 01902 782280, - ,,,No ratings yet Rate it yourself - /Services/opticians/LeaveReview/DefaultView.aspx?id=OP_5MV_585__000001_WV106BA,0,0,
Miracle Eyes Ltd,OP_5MV_853__000001_WV106RT,OPT,Unit 4 Marsh Lane Parade,"Three Tuns, Fordhouses",,Wolverhampton,,WV10 6RT,Tel: 01902 789900, - ,,,No ratings yet Rate it yourself - /Services/opticians/LeaveReview/DefaultView.aspx?id=OP_5MV_853__000001_WV106RT,0,0,
Bushbury Eyecare,,OPT,,339a Bushbury Lane,,Wolverhampton,,WV10 9UL,, - ,,,N/A - Data not available,,,
Evenett & Bishop Opticians,OP_5M2_10687__000002_WV73JA,OPT,67 High Street,Albrighton,Wolverhampton,,,WV7 3JP,Tel: 01902 372141, - ,,,No ratings yet Rate it yourself - /Services/opticians/LeaveReview/DefaultView.aspx?id=OP_5M2_10687__000002_WV73JA,0,0,
Miracle Eyes,OP_WV109BA_29921,OPT,,5 Showell Circus,,Wolverhampton,,WV10 9BA,, - ,,,No ratings yet Rate it yourself - /Services/opticians/LeaveReview/DefaultView.aspx?id=OP_WV109BA_29921,0,0,
Overton Eyecare,OP_5MV_9203__000001_WV108PN,OPT,743-745 Cannock Road,The Scotlands,,Wolverhampton,,WV10 8PN,Tel: 01902 731158, - ,,,1 rating Rate it yourself - /Services/opticians/LeaveReview/DefaultView.aspx?id=OP_5MV_9203__000001_WV108PN,,,
Albrighton Eye Clinic,P6X7L,OPT,,"2 Station Road, Albrighton",,Wolverhampton,,WV7 3QG,Tel: 01902 374727, - ,,,1 rating Rate it yourself - /Services/opticians/LeaveReview/DefaultView.aspx?id=P6X7L,,,
Ashmore Park Opticians,OP_5MV_371__000001_WV112JN,OPT,54 Griffiths Drive,Ashmore Park,,Wolverhampton,,WV11 2JW,Tel: 01902 739777, - ,,,4 ratings Rate it yourself - /Services/opticians/LeaveReview/DefaultView.aspx?id=OP_5MV_371__000001_WV112JN,,,
4 Sight Eye Care Centres Ltd,OP_5MV_886__000002_WV109QY,OPT,1 Raynor Road,Fallings Park,,Wolverhampton,,WV10 9QY,Tel: 01902 723449, - ,,,No ratings yet Rate it yourself - /Services/opticians/LeaveReview/DefaultView.aspx?id=OP_5MV_886__000002_WV109QY,0,0,
Right Vision Ophthalmic Opticians,01-19976/5PL/C__000002_B694DS,OPT,6 Richardson Way,,Rugeley,Staffordshire,,WS15 2TD,Tel: 07966 960606, - ,,,No ratings yet Rate it yourself - /Services/opticians/LeaveReview/DefaultView.aspx?id=01-19976/5PL/C__000002_B694DS,0,0,
Scrivens Opticians & Hearing Care,OP_5MM_438__000001_WS152DN,OPT,16a Upper Brook Street,16a Upper Brook Street,Staffordshire,Rugeley,,WS15 2DN,Tel: 01889 575257, - ,,,No ratings yet Rate it yourself - /Services/opticians/LeaveReview/DefaultView.aspx?id=OP_5MM_438__000001_WS152DN,0,0,
Boots-Rugeley,OL/01-014482/5PK__000001_WS152DR,OPT,2 Brook Square,,,Rugeley,Staffordshire,WS15 2DR,Tel: 01889 579000, - ,,,1 rating Rate it yourself - /Services/opticians/LeaveReview/DefaultView.aspx?id=OL/01-014482/5PK__000001_WS152DR,,,
"Specsavers Opticians, Rugeley",CO-3227/5PK/C__000003_WS152DP,OPT,5 Upper Brook Street,,Rugeley,Staffordshire,,WS15 2DP,Tel: 01889 576060, - ,,,No ratings yet Rate it yourself - /Services/opticians/LeaveReview/DefaultView.aspx?id=CO-3227/5PK/C__000003_WS152DP,0,0,
Colin Lee Opticians (Rugeley),OP_5DQ_14952__000002_WS152DA,OPT,1 Shrewsbury Mall,Market Square,Rugeley,,,WS15 2DA,Tel: 01889 570544, - ,,,3 ratings Rate it yourself - /Services/opticians/LeaveReview/DefaultView.aspx?id=OP_5DQ_14952__000002_WS152DA,,,
Samantha Hague Optometry,OP_5MV_596__000001_WV28QT,OPT,10 High Street,Tettenhall,,Wolverhampton,West Midlands,WV6 8QT,Tel: 01902757454, - ,,,10 ratings Rate it yourself - /Services/opticians/LeaveReview/DefaultView.aspx?id=OP_5MV_596__000001_WV28QT,,,no
Portland Eye Care Services Ltd,OP_5MV_ 795__000001_WV111TW,OPT,45 Lichfield Road,Wednesfield,,Wolverhampton,,WV11 1TW,Tel: 01902 723898, - ,,,No ratings yet Rate it yourself - /Services/opticians/LeaveReview/DefaultView.aspx?id=OP_5MV_ 795__000001_WV111TW,0,0,
NVision Eyecare,OP_WV60QW_29780,OPT,,The Avion Centre,4 Bargate Drive,Wolverhampton,,WV6 0QW,Tel: 01902 779077, - ,,,2 ratings Rate it yourself - /Services/opticians/LeaveReview/DefaultView.aspx?id=OP_WV60QW_29780,,,
C M Biddle & Co Ltd,OP_5MV_3311__000004_WV111SZ,OPT,20 High Street,Wednesfield,,Wolverhampton,,WV11 1SZ,Tel: 01902 729028, - ,,,No ratings yet Rate it yourself - /Services/opticians/LeaveReview/DefaultView.aspx?id=OP_5MV_3311__000004_WV111SZ,0,0,
Flint & Partners,OP_5MV_2445__000001_WV111SR,OPT,11 Church Street,Wednesfield,,Wolverhampton,,WV11 1SR,Tel: 01902 719 850, - ,,,2 ratings Rate it yourself - /Services/opticians/LeaveReview/DefaultView.aspx?id=OP_5MV_2445__000001_WV111SR,,,
See to it Opticians Ltd,S7T7F,OPT,,21 Ruston Road,,Burntwood,,WS7 3RU,, - ,,,No ratings yet Rate it yourself - /Services/opticians/LeaveReview/DefaultView.aspx?id=S7T7F,0,0,
David Stidwill Optometrist,OP_5DQ_9442__000001_WS78AG,OPT,31 Rugeley Road,Chase Terrace,Burntwood,,,WS7 8AG,Tel: 01543 682730, - ,,,No ratings yet Rate it yourself - /Services/opticians/LeaveReview/DefaultView.aspx?id=OP_5DQ_9442__000001_WS78AG,0,0,
Boots-Chase Terrace - Burntwood,OP_5DQ_14949__000002_WS78JR,OPT,Unit 14,Burntwood Town Centre,,Cannock Road,,WS7 1JR,Tel: 01543 686 498, - ,,,No ratings yet Rate it yourself - /Services/opticians/LeaveReview/DefaultView.aspx?id=OP_5DQ_14949__000002_WS78JR,0,0,
Perton Eye Centre,OP_5MN_13221__000002_WV67QH,OPT,"Unit 4, anders Square",Unit 4,Wolverhampton,Perton,,WV6 7QH,Tel: 01902 759666, - ,,,No ratings yet Rate it yourself - /Services/opticians/LeaveReview/DefaultView.aspx?id=OP_5MN_13221__000002_WV67QH,0,0,
Focus Eye Clinic,OP_WV100QB_34100,OPT,Unit 6 Crossways Shopping Centre,Wolverhampton Road,Heath Town,Wolverhampton,West Midlands,WV10 0QB,Tel: 01902 546820, - ,,,No ratings yet Rate it yourself - /Services/opticians/LeaveReview/DefaultView.aspx?id=OP_WV100QB_34100,0,0,
Specsavers,TP9EM,OPT,,"Unit 9 Baddeley Court , Newport ",,Shropshire,,TF10 7GQ,, - ,,,No ratings yet Rate it yourself - /Services/opticians/LeaveReview/DefaultView.aspx?id=TP9EM,0,0,
Kelcher & Pearson Opticians Ltd,OP_5M3_3698__000001_WS32EX,OPT,4 Queens Parade,,Walsall,,,WS3 2EX,Tel: 01922 409000, - ,,,No ratings yet Rate it yourself - /Services/opticians/LeaveReview/DefaultView.aspx?id=OP_5M3_3698__000001_WS32EX,0,0,
Malcolm Gray & Associates,OP_5MN_1689__000001_ST216BZ,OPT,56 High Street,,Stafford,Eccleshall,Staffordshire,ST21 6BZ,Tel: 01785 851015, - ,,,2 ratings Rate it yourself - /Services/opticians/LeaveReview/DefaultView.aspx?id=OP_5MN_1689__000001_ST216BZ,,,
Glass House Eye Care Centre,OP_5MK_6162__000002_TF107AT,OPT,43 High Street,,Newport,,,TF10 7AT,Tel: 01952 812009, - ,,,1 rating Rate it yourself - /Services/opticians/LeaveReview/DefaultView.aspx?id=OP_5MK_6162__000002_TF107AT,,,
Evenett & Bishop Opticians,OP_5MK_5867__000001_TF107AT,OPT,35 High Street,,Newport,Shropshire,,TF10 7AT,Tel: 01952 810808, - ,,,No ratings yet Rate it yourself - /Services/opticians/LeaveReview/DefaultView.aspx?id=OP_5MK_5867__000001_TF107AT,0,0,
K B Opticians,OP_5M3_7191__000002_WS33LQ,OPT,236 High Street,Bloxwich,Walsall,,,WS3 3LQ,Tel: 01922 476553, - ,,,No ratings yet Rate it yourself - /Services/opticians/LeaveReview/DefaultView.aspx?id=OP_5M3_7191__000002_WS33LQ,0,0,
Specsavers Bloxwich,TP2JT,OPT,,135 High St,Bloxwich,Walsall,,WS3 3LE,Tel: 01922 400366, - ,,,No ratings yet Rate it yourself - /Services/opticians/LeaveReview/DefaultView.aspx?id=TP2JT,0,0,
Duignan Phelps Opticians,OP5MK49__000001_TF107AB,OPT,10 St Mary's Street,,Newport,Shropshire,,TF10 7AB,Tel: 01952 812820, - ,,,No ratings yet Rate it yourself - /Services/opticians/LeaveReview/DefaultView.aspx?id=OP5MK49__000001_TF107AB,0,0,yes
Flint & Partners,OP_5MV_7631__000001_WV39NB,OPT,59 Tettenhall Road,,,Wolverhampton,,WV3 9NB,Tel: 01902 422096, - ,,,No ratings yet Rate it yourself - /Services/opticians/LeaveReview/DefaultView.aspx?id=OP_5MV_7631__000001_WV39NB,0,0,
Hill the Opticians,OP_5M3_2576__000001_WS33LA,OPT,198a High Street,Bloxwich,,Walsall,,WS3 3LA,Tel: 01922 475388, - ,,,No ratings yet Rate it yourself - /Services/opticians/LeaveReview/DefaultView.aspx?id=OP_5M3_2576__000001_WS33LA,0,0,
Eyeopeners ,OP_WS11PB_29575,OPT,,198c High Street,,Bloxwich,,WS3 3LA,Tel: 01922 726040, - ,,,No ratings yet Rate it yourself - /Services/opticians/LeaveReview/DefaultView.aspx?id=OP_WS11PB_29575,0,0,
Eyedeal,5M3-203__000002_WS33LA,OPT,212 High Street,Bloxwich,,Walsall,,WS3 3LA,Tel: 01922 473999, - ,,,No ratings yet Rate it yourself - /Services/opticians/LeaveReview/DefaultView.aspx?id=5M3-203__000002_WS33LA,0,0,
Lichfield Street Opticians,OP_5MV_793__000003_WV11DG,OPT,44 Lichfield Street,,Wolverhampton,West Midlands,,WV1 1DG,Tel: 01902 420348, - ,,,No ratings yet Rate it yourself - /Services/opticians/LeaveReview/DefaultView.aspx?id=OP_5MV_793__000003_WV11DG,0,0,
Partridge Opticians,OP_5MK_9908__000001_TF107AY,OPT,Partridge Opticians,81 High Street,,Newport,Shropshire,TF10 7AY,Tel: 01952 811750, - ,,,No ratings yet Rate it yourself - /Services/opticians/LeaveReview/DefaultView.aspx?id=OP_5MK_9908__000001_TF107AY,0,0,
R K Flatters,OP_5MV_1492__000001_WV13JW,OPT,35 Queen Street,,,Wolverhampton,,WV1 3JW,Tel: 01902 423359, - ,,,No ratings yet Rate it yourself - /Services/opticians/LeaveReview/DefaultView.aspx?id=OP_5MV_1492__000001_WV13JW,0,0,
Taylor Biddle Opticians,OP_5MV_1765__000002_WV68AF,OPT,39 Bridgnorth Road,Compton,,Wolverhampton,,WV6 8AF,Tel: 01902 750325, - ,,,18 ratings Rate it yourself - /Services/opticians/LeaveReview/DefaultView.aspx?id=OP_5MV_1765__000002_WV68AF,,,
Harris Opticians,OP_5MV_ 751__000001_WV14LF,OPT,44 School Street,Off Darlington Street,,Wolverhampton,,WV1 4LF,Tel: 01902 421820, - ,,,No ratings yet Rate it yourself - /Services/opticians/LeaveReview/DefaultView.aspx?id=OP_5MV_ 751__000001_WV14LF,0,0,
Scrivens Ltd,OP_5MV_3780__000001_WV13NP,OPT,16 Dudley St,,,Wolverhampton,,WV1 3EY,Tel: 01902 424775, - ,,,No ratings yet Rate it yourself - /Services/opticians/LeaveReview/DefaultView.aspx?id=OP_5MV_3780__000001_WV13NP,0,0,
Khalil Opticians Ltd,OP_5MV_493__000002_WV13NP,OPT,22 Victoria Street,Wolverhampton,,West Midlands,,WV1 3NP,Tel: 01902 771267, - ,,,No ratings yet Rate it yourself - /Services/opticians/LeaveReview/DefaultView.aspx?id=OP_5MV_493__000002_WV13NP,0,0,
Ideal Eyes Optical Ltd,OP_5MV_813__000003_WV13NP,OPT,2 Victoria Street,,,Wolverhampton,,WV1 3NP,Tel: 01902 423030, - ,,,No ratings yet Rate it yourself - /Services/opticians/LeaveReview/DefaultView.aspx?id=OP_5MV_813__000003_WV13NP,0,0,
Boots-Wolverhampton - Mander Centre (in Boots UK),OP_5MV_9292__000001_WV13NN,OPT,"Unit 221, 30-34 The Gallery",Mander Centre,,Wolverhampton,West Midlands,WV1 3NN,Tel: 01902 711755, - ,,,No ratings yet Rate it yourself - /Services/opticians/LeaveReview/DefaultView.aspx?id=OP_5MV_9292__000001_WV13NN,0,0,
Vision Express (UK) Ltd,OP_5MV_11313__000001_WV13NJ,OPT,11-12 The Gallery,Mander Centre,,Wolverhampton,,WV1 3NJ,Tel: 01902 716999, - ,,,No ratings yet Rate it yourself - /Services/opticians/LeaveReview/DefaultView.aspx?id=OP_5MV_11313__000001_WV13NJ,0,0,
4 Sight Eye Care Centres Ltd,OP_5MV_249__000001_WV13ET,OPT,14-16 Central Arcade,,,Wolverhampton,,WV1 3ET,Tel: 01902 714559, - ,,,No ratings yet Rate it yourself - /Services/opticians/LeaveReview/DefaultView.aspx?id=OP_5MV_249__000001_WV13ET,0,0,yes
Specsavers Opticians,OP_5MV_13061__000001_WV13HG,OPT,58-59 Wulfrun Centre,,,Wolverhampton,,WV1 3HG,Tel: 01902 715 844, - ,,,No ratings yet Rate it yourself - /Services/opticians/LeaveReview/DefaultView.aspx?id=OP_5MV_13061__000001_WV13HG,0,0,
Marshoptical,OP_5MV_691__000002_WV13HH,OPT,Cleveland Street,,Wolverhampton,,,WV1 3HH,Tel: 01902 420919, - ,,,No ratings yet Rate it yourself - /Services/opticians/LeaveReview/DefaultView.aspx?id=OP_5MV_691__000002_WV13HH,0,0,
M G Wheeler,OP_5M3_12432__000001_WS34LZ,OPT,37a High Street,Pelsall,,Walsall,West Midlands,WS3 4LX,Tel: 01922 683080, - ,,,No ratings yet Rate it yourself - /Services/opticians/LeaveReview/DefaultView.aspx?id=OP_5M3_12432__000001_WS34LZ,0,0,
Tim Vanes Dispensing Optician,OP_5MK_4742__000002_TF42EX,OPT,5a Park Street,Shifnal,,Shropshire,,TF11 9BA,Tel: 01952 461387, - ,,,No ratings yet Rate it yourself - /Services/opticians/LeaveReview/DefaultView.aspx?id=OP_5MK_4742__000002_TF42EX,0,0,
H. Wyn  Williams Optometrist,OP_5MV_4776__000002_WV37HT,OPT,6 Trysull Road,Bradmore,,Wolverhampton,West Midlands,WV3 7HT,Tel: 01902 620352, - ,,,1 rating Rate it yourself - /Services/opticians/LeaveReview/DefaultView.aspx?id=OP_5MV_4776__000002_WV37HT,,,yes
NVision Eyecare,01-21451 - 1,OPT,,84 Windmill Lane,Castle Croft,Wolverhampton,,WV3 8HG,Tel: 01902 380 000, - ,,,1 rating Rate it yourself - /Services/opticians/LeaveReview/DefaultView.aspx?id=01-21451 - 1,,,
Ferguson Family Eye Care,TP9DC,OPT,,Ferguson family Eye Care,17 leamore Lane,Walsall,,WS3 2BJ,Tel: 01922278989, - ,,,3 ratings Rate it yourself - /Services/opticians/LeaveReview/DefaultView.aspx?id=TP9DC,,,
Specsavers Opticians,OP_WS86EQ_29574,OPT,,"Unit 1, 12 - 28 High Street",,Brownhills,,WS8 6EQ,Tel: 01543 363790, - ,,,No ratings yet Rate it yourself - /Services/opticians/LeaveReview/DefaultView.aspx?id=OP_WS86EQ_29574,0,0,
Vision Care Direct Opticians,5M3-201__000002_WV131TG,OPT,,13 Stafford Street,,Willenhall,,WV13 1TG,Tel: 01902 609244, - ,,,No ratings yet Rate it yourself - /Services/opticians/LeaveReview/DefaultView.aspx?id=5M3-201__000002_WV131TG,0,0,
Frames 4 U,OP_5M3_12441__000001_WS86HH,OPT,50 High Street,Brownhills,,Walsall,,WS8 6EL,Tel: 01543 373731, - ,,,1 rating Rate it yourself - /Services/opticians/LeaveReview/DefaultView.aspx?id=OP_5M3_12441__000001_WS86HH,,,
Boots-Brownhills,OP_5M3_6340__000001_WS86EL,OPT,42 High Street,Brownhills,,Walsall,West Midlands,WS8 6EL,Tel: 01543 372 696, - ,,,No ratings yet Rate it yourself - /Services/opticians/LeaveReview/DefaultView.aspx?id=OP_5M3_6340__000001_WS86EL,0,0,
Colin Lee Opticians,7790_7791__000001_WS70DW,OPT,2 Swan Island Shopping Precinct,Chase Road,Burntwood,Staffordshire,,WS7 0DW,, - ,,,No ratings yet Rate it yourself - /Services/opticians/LeaveReview/DefaultView.aspx?id=7790_7791__000001_WS70DW,0,0,
Supa Specs Ltd,OP_5M3_12438__000001_WV132AA,OPT,12 Market Place,Willenhall,,Wolverhampton,,WV13 2AA,Tel: 01902 630393, - ,,,No ratings yet Rate it yourself - /Services/opticians/LeaveReview/DefaultView.aspx?id=OP_5M3_12438__000001_WV132AA,0,0,
Scrivens Ltd,OP_5M3_1341__000001_WV131PU,OPT,33 Cross Street,,,Willenhall,West Midlands,WV13 1PG,Tel: 01902 605386, - ,,,No ratings yet Rate it yourself - /Services/opticians/LeaveReview/DefaultView.aspx?id=OP_5M3_1341__000001_WV131PU,0,0,
Silver Court Opticians,OP_5M3_2035__000001_WS86ED,OPT,High Street,Brownhills,,Walsall,,WS8 6HA,Tel: 01543 372504, - ,,,No ratings yet Rate it yourself - /Services/opticians/LeaveReview/DefaultView.aspx?id=OP_5M3_2035__000001_WS86ED,0,0,
Brian Hitchin (DOM),5LA_OPT_44__000003_ST158AD,OPT,"60, Pirehill Lane,",,,Stone,Staffordshire,ST15 0JN,Tel: 017581 5656, - ,,,No ratings yet Rate it yourself - /Services/opticians/LeaveReview/DefaultView.aspx?id=5LA_OPT_44__000003_ST158AD,0,0,
Penn Eyecare,OP_5MV_512__000001_WV44AD,OPT,Penn Eyecare,252 Penn Road,Penn,Wolverhampton,West Midlands,WV4 4AD,Tel: 01902 342999, - ,,,No ratings yet Rate it yourself - /Services/opticians/LeaveReview/DefaultView.aspx?id=OP_5MV_512__000001_WV44AD,0,0,yes
Tesco T/A Tesco Opticians ,OP_WS28HX_29573,OPT,,Littleton Street West,,Walsall,,WS2 8HX,Tel: 01922 777338, - ,,,No ratings yet Rate it yourself - /Services/opticians/LeaveReview/DefaultView.aspx?id=OP_WS28HX_29573,0,0,
Miracle Eyes Ltd,OP_5MV_635__000002_WV45QF,OPT,317a Penn Road,Penn,,Wolverhampton,,WV4 5QF,Tel: 01902 621111, - ,,,No ratings yet Rate it yourself - /Services/opticians/LeaveReview/DefaultView.aspx?id=OP_5MV_635__000002_WV45QF,0,0,
Scrivens Opticians & Hearing Care,,OPT,,27 High Street,,Stone,,ST15 8AJ,Tel: 01785 814777, - ,,,N/A - Data not available,,,
Eye Openers,OP_WV140AX_29781,OPT,,63 Church Street,,Bilston,,WV14 0AX,Tel: 01902 492020, - ,,,No ratings yet Rate it yourself - /Services/opticians/LeaveReview/DefaultView.aspx?id=OP_WV140AX_29781,0,0,
Jacksons Opticians,OP_WV140AX_29782,OPT,,"53a Church Street,",,Bilston,,WV14 0AX,Tel: 01902 491358, - ,,,No ratings yet Rate it yourself - /Services/opticians/LeaveReview/DefaultView.aspx?id=OP_WV140AX_29782,0,0,
Specsavers Opticians,OP_WV140AX_29785,OPT,,84 Church Street,,Bilston,,WV14 0AX,Tel: 01902 407940, - ,,,No ratings yet Rate it yourself - /Services/opticians/LeaveReview/DefaultView.aspx?id=OP_WV140AX_29785,0,0,