Organisation Name,NACS Code,Organisation Type,Address1,Address2,Address3,Address4,Address5,PostCode,Telephone Number,Opening time,Value  (Opening time),Banding Classification  (Opening time),NHS.UK users rating,Value  (NHS.UK users rating),Banding Classification  (NHS.UK users rating),Car parking (Is there car parking at this organisation?)
Memory Opticians,OP_5K4_619__000001_SP97NN,OPT,Station Road,,Tidworth,,,SP9 7NN,Tel: 01980 843440, - ,,,No ratings yet Rate it yourself - /Services/opticians/LeaveReview/DefaultView.aspx?id=OP_5K4_619__000001_SP97NN,0,0,
Haine & Smith Opticians,SP4 7HD,OPT,,20 Salisbury Street,,Amesbury,Wiltshire,SP4 7HD,Tel: 01980 626551, - ,,,No ratings yet Rate it yourself - /Services/opticians/LeaveReview/DefaultView.aspx?id=SP4 7HD,0,0,
Memory Opticians,OP_5DJ_14124__000005_SP47HD,OPT,44b Salisbury Street,,Amesbury,,,SP4 7HD,Tel: 01980 624065, - ,,,1 rating Rate it yourself - /Services/opticians/LeaveReview/DefaultView.aspx?id=OP_5DJ_14124__000005_SP47HD,,,
Batemans (Opticians) Ltd,OP_5DJ_10456__000004_SP47HD,OPT,12 Salisbury Street,,,Amesbury,Wiltshire,SP4 7HD,Tel: 01980 623228, - ,,,No ratings yet Rate it yourself - /Services/opticians/LeaveReview/DefaultView.aspx?id=OP_5DJ_10456__000004_SP47HD,0,0,
Carol Underwood,PCTCAROLUNDERWOOD1__000001_SP103DG,OPT,King George Road,,andover,Hants,,SP10 3DG,Tel: 0845 602 3842, - ,,,No ratings yet Rate it yourself - /Services/opticians/LeaveReview/DefaultView.aspx?id=PCTCAROLUNDERWOOD1__000001_SP103DG,0,0,
Leightons Opticians & Hearing Care,OP_5E9_433__000001_SP101RW,OPT,,68 The Chantry Centre,,Andover,Hampshire,SP10 1RW,Tel: 01264 365695, - ,,,No ratings yet Rate it yourself - /Services/opticians/LeaveReview/DefaultView.aspx?id=OP_5E9_433__000001_SP101RW,0,0,
Vision Express,OP_5E9_1549__000001_SP101LU,OPT,45 Chantry Way,The Chantry Centre,andover,Hampshire,,SP10 1LQ,Tel: 01264 324801, - ,,,No ratings yet Rate it yourself - /Services/opticians/LeaveReview/DefaultView.aspx?id=OP_5E9_1549__000001_SP101LU,0,0,
Boots-Andover - High St,OP_5E9_6071__000001_SP101LP,OPT,63 High Street,,,Andover,Hampshire,SP10 1LP,Tel: 01264 352887, - ,,,2 ratings Rate it yourself - /Services/opticians/LeaveReview/DefaultView.aspx?id=OP_5E9_6071__000001_SP101LP,,,
West Country Eyecare,OL/5FT__000004_SP101NG,OPT,76 High Street,,andover,Hants,,SP10 1NG,Tel: 01264 366165, - ,,,No ratings yet Rate it yourself - /Services/opticians/LeaveReview/DefaultView.aspx?id=OL/5FT__000004_SP101NG,0,0,
Specsavers,OP_5E9_5988__000001_SP101NG,OPT,,72 High Street,,Andover,Hampshire,SP10 1NG,Tel: 01264 339 369, - ,,,2 ratings Rate it yourself - /Services/opticians/LeaveReview/DefaultView.aspx?id=OP_5E9_5988__000001_SP101NG,,,
Tesco Opticians,OP_SP101UZ_29725,OPT,,River Way,,Andover,Hampshire,SP10 1UZ,Tel: 0345 601 3479, - ,,,No ratings yet Rate it yourself - /Services/opticians/LeaveReview/DefaultView.aspx?id=OP_SP101UZ_29725,0,0,
S J Hussey Opticians,OP_5K4_12376__000002_SN95AQ,OPT,2 Old Ford Court,,Pewsey,Wiltshire,,SN9 5AQ,Tel: 01672 564617, - ,,,No ratings yet Rate it yourself - /Services/opticians/LeaveReview/DefaultView.aspx?id=OP_5K4_12376__000002_SN95AQ,0,0,
Bourneside Optometry Limited - Mrs S Downie,OPT_SP46HL_1,OPT,,Bourneside House,,Salisbury,,SP4 6HL,Tel: 01980 611433, - ,,,No ratings yet Rate it yourself - /Services/opticians/LeaveReview/DefaultView.aspx?id=OPT_SP46HL_1,0,0,
Vision Express (UK) Ltd,OP_5DJ_1147__000002_SP11EP,OPT,25-27 Butcher Row,,Salisbury,,,SP1 1EP,Tel: 01722 330056, - ,,,No ratings yet Rate it yourself - /Services/opticians/LeaveReview/DefaultView.aspx?id=OP_5DJ_1147__000002_SP11EP,0,0,
Specsavers Opticians,OP_5DJ_9766__000001_SP12DG,OPT,1 Catherine Street,,Salisbury,,,SP1 2DF,Tel: 01722 412255, - ,,,No ratings yet Rate it yourself - /Services/opticians/LeaveReview/DefaultView.aspx?id=OP_5DJ_9766__000001_SP12DG,0,0,
Memory Opticians,OP_5DJ_8550__000002_SP12DF,OPT,13 Catherine Street,,Salisbury,,,SP1 2DF,Tel: 01722 410959, - ,,,No ratings yet Rate it yourself - /Services/opticians/LeaveReview/DefaultView.aspx?id=OP_5DJ_8550__000002_SP12DF,0,0,
Boots-Salisbury - Catherine St,OP_5DJ_10591__000001_SP12DF,OPT,17 Catherine Street,,,Salisbury,Wiltshire,SP1 2DF,Tel: 01722 322 522, - ,,,No ratings yet Rate it yourself - /Services/opticians/LeaveReview/DefaultView.aspx?id=OP_5DJ_10591__000001_SP12DF,0,0,
Boots Opticians Limited,OP_5DJ_11593__000001_SP12AA,OPT,49-51 New Canel,,Salisbury,,,SP1 2AA,Tel: 01722 412625, - ,,,No ratings yet Rate it yourself - /Services/opticians/LeaveReview/DefaultView.aspx?id=OP_5DJ_11593__000001_SP12AA,0,0,
Batemans (Opticians) Ltd,OP_5DJ_3495__000001_SP12LX,OPT,6 Bridge Street,,Salisbury,,,SP1 2LX,Tel: 01722 322585, - ,,,No ratings yet Rate it yourself - /Services/opticians/LeaveReview/DefaultView.aspx?id=OP_5DJ_3495__000001_SP12LX,0,0,
Boots-Salisbury - Silver St,SP1 2NG_29481,OPT,,41-49 Silver Street,,Salisbury,Wiltshire,SP1 2NG,Tel: 01722 412625, - ,,,4 ratings Rate it yourself - /Services/opticians/LeaveReview/DefaultView.aspx?id=SP1 2NG_29481,,,
Silverthornes Opticians,OP_5DJ_14126__000001_SP12DD,OPT,50 Catherine Street,,Salisbury,Wiltshire,,SP1 2DD,Tel: 01722 322880, - ,,,No ratings yet Rate it yourself - /Services/opticians/LeaveReview/DefaultView.aspx?id=OP_5DJ_14126__000001_SP12DD,0,0,
Mark Jones Eyecare,OP_5DJ_14125__000001_SP27SU,OPT,,21 Fisherton Street,,Salisbury,,SP2 7SU,Tel: 01722 322891, - ,,,1 rating Rate it yourself - /Services/opticians/LeaveReview/DefaultView.aspx?id=OP_5DJ_14125__000001_SP27SU,,,
Haine & Smith Opticians,OP_5K4_11275__000002_SN81LT,OPT,,23-24  High Street,,Marlborough,Wiltshire,SN8 1LW,Tel: 01672 513432, - ,,,No ratings yet Rate it yourself - /Services/opticians/LeaveReview/DefaultView.aspx?id=OP_5K4_11275__000002_SN81LT,0,0,
Wilton i Ltd,SP2 0DF,OPT,within The Old Orchard Surgery,South Street,,Wilton,,SP2 0JU,Tel: 01722 743122, - ,,,No ratings yet Rate it yourself - /Services/opticians/LeaveReview/DefaultView.aspx?id=SP2 0DF,0,0,
Specavers Opticians,SN8 1HN,OPT,,131 High Street,,Marlborough,,SN8 1HN,Tel: 01672 517900, - ,,,No ratings yet Rate it yourself - /Services/opticians/LeaveReview/DefaultView.aspx?id=SN8 1HN,0,0,
Jacqueline Burns Opticians,OP_SN81HN_33975,OPT,,140 High Street,,Marlborough,,SN8 1HN,, - ,,,2 ratings Rate it yourself - /Services/opticians/LeaveReview/DefaultView.aspx?id=OP_SN81HN_33975,,,
Vision Express,OP_5DK_11298__000002_RG170DL,OPT,,21 High Street,,Hungerford,Berkshire,RG17 0NF,Tel: 01488 682458, - ,,,No ratings yet Rate it yourself - /Services/opticians/LeaveReview/DefaultView.aspx?id=OP_5DK_11298__000002_RG170DL,0,0,yes
Nixon & Shaw,OP_5K4_9397__000001_SN101DN,OPT,30 Monday Market Street,,Devizes,,,SN10 1DN,Tel: 01380 725802, - ,,,No ratings yet Rate it yourself - /Services/opticians/LeaveReview/DefaultView.aspx?id=OP_5K4_9397__000001_SN101DN,0,0,
A J Bass,OP_5DH_11495__000001_SP53LX,OPT,53 The Borough,Downton,Salisbury,Wiltshire,,SP5 3LX,Tel: 01725 512058, - ,,,No ratings yet Rate it yourself - /Services/opticians/LeaveReview/DefaultView.aspx?id=OP_5DH_11495__000001_SP53LX,0,0,
Specsavers,OP_5K4_12374__000005_SN101AJ,OPT,27 The Brittox,,Devizes,Wiltshire,,SN10 1AJ,Tel: 01380 722225, - ,,,No ratings yet Rate it yourself - /Services/opticians/LeaveReview/DefaultView.aspx?id=OP_5K4_12374__000005_SN101AJ,0,0,
Haine & Smith Opticians,OP_5K4_12246__000002_SN101AJ,OPT,,31 The Brittox,,Devizes,Wiltshire,SN10 1AJ,Tel: 01380 723446, - ,,,1 rating Rate it yourself - /Services/opticians/LeaveReview/DefaultView.aspx?id=OP_5K4_12246__000002_SN101AJ,,,
Boots-Devizes,SN10 1JG_19183,OPT,,33 Market Place,,Devizes,Wiltshire,SN10 1JG,Tel: 01380 728223, - ,,,1 rating Rate it yourself - /Services/opticians/LeaveReview/DefaultView.aspx?id=SN10 1JG_19183,,,
Eye Tech Opticians,OP_5K4_12373__000001_SN101JL,OPT,34 Market Place,,Devizes,,,SN10 1JG,Tel: 01380 722228, - ,,,No ratings yet Rate it yourself - /Services/opticians/LeaveReview/DefaultView.aspx?id=OP_5K4_12373__000001_SN101JL,0,0,
Ashleigh Sight Care,OP_5LY_14850__000001_SO518BU,OPT,,8 Church Street,,Romsey,Hampshire,SO51 8BU,Tel: 01794 512480, - ,,,1 rating Rate it yourself - /Services/opticians/LeaveReview/DefaultView.aspx?id=OP_5LY_14850__000001_SO518BU,,,
Mark Freeman Opticians,SO51 8NB__000003_SO518NB,OPT,3 Market Place,,Romsey,Hants,,SO51 8NB,Tel: 01794 513953, - ,,,No ratings yet Rate it yourself - /Services/opticians/LeaveReview/DefaultView.aspx?id=SO51 8NB__000003_SO518NB,0,0,
D N White Opticians,OP_5LY_14855__000001_SO518NA,OPT,23 Market Place,,Romsey,Hampshire,,SO51 8NA,Tel: 01794 517311, - ,,,No ratings yet Rate it yourself - /Services/opticians/LeaveReview/DefaultView.aspx?id=OP_5LY_14855__000001_SO518NA,0,0,
Romsey Eyecare,OPT_SO51 8DE,OPT,,"1 Victoria Place, Love Lane",,Romsey,Hampshire,SO51 8DE,Tel: 01794 522747, - ,,,3 ratings Rate it yourself - /Services/opticians/LeaveReview/DefaultView.aspx?id=OPT_SO51 8DE,,,
Boots Opticians,G7K1V,OPT,,3-5 The Hundred,,Romsey,Hampshire,SO51 8GD,Tel: 01794 513258, - ,,,No ratings yet Rate it yourself - /Services/opticians/LeaveReview/DefaultView.aspx?id=G7K1V,0,0,
Vision Express,OP_RG147HB_85778,OPT,,"Tesco Express, Pinchington Lane",,Newbury,,RG14 7HB,, - ,,,No ratings yet Rate it yourself - /Services/opticians/LeaveReview/DefaultView.aspx?id=OP_RG147HB_85778,0,0,
Eyesite Opticians,OP_5E9_12451__000001_SO239BX,OPT,Southgate Corner,65 High Street,,Winchester,Hampshire,SO23 9BX,Tel: 01962 864446, - ,,,No ratings yet Rate it yourself - /Services/opticians/LeaveReview/DefaultView.aspx?id=OP_5E9_12451__000001_SO239BX,0,0,
Rawlings Opticians,OP_5E9_615__000003_SO239BX,OPT,60-61 High Street,,Winchester,Hampshire,,SO23 9BX,Tel: 01962 853082, - ,,,1 rating Rate it yourself - /Services/opticians/LeaveReview/DefaultView.aspx?id=OP_5E9_615__000003_SO239BX,,,
Specsavers Opticians,OPT_SO239AH_1,OPT,,106a High Street,,Winchester,,SO23 9AH,, - ,,,No ratings yet Rate it yourself - /Services/opticians/LeaveReview/DefaultView.aspx?id=OPT_SO239AH_1,0,0,
Vision Express,OP_5DK_3370__000001_RG141AA,OPT,92 Northbrook Street,,Newbury,,,RG14 1AA,Tel: 01635 230294, - ,,,No ratings yet Rate it yourself - /Services/opticians/LeaveReview/DefaultView.aspx?id=OP_5DK_3370__000001_RG141AA,0,0,
Scott Waters Opticians,OP_5DK_5322__000002_RG141AA,OPT,,98 Northbrook Street,,Newbury,Berkshire,RG14 1AA,Tel: 01635 31113, - ,,,No ratings yet Rate it yourself - /Services/opticians/LeaveReview/DefaultView.aspx?id=OP_5DK_5322__000002_RG141AA,0,0,
Specsavers - Hectors Way Newbury,,OPT,,Sainsbury's Hectors Way,,Newbury,Berkshire,RG14 5AB,Tel: 01635 881 657, - ,,,N/A - Data not available,,,
Vision Express,OP_5E9_2258__000002_SO239BL,OPT,,40 High Street,,Winchester,Hampshire,SO23 9BL,Tel: 01962 856850, - ,,,No ratings yet Rate it yourself - /Services/opticians/LeaveReview/DefaultView.aspx?id=OP_5E9_2258__000002_SO239BL,0,0,
Leightons Opticians & Hearing Care,OP_5E9_158__000001_SO238AH,OPT,,67 St. Georges Street,,Winchester,Hampshire,SO23 8AH,Tel: 01962 852961, - ,,,No ratings yet Rate it yourself - /Services/opticians/LeaveReview/DefaultView.aspx?id=OP_5E9_158__000001_SO238AH,0,0,
Boots-Newbury - Northbrook St (in Boots UK),OP_RG141DJ_85768,OPT,4-5 Northbrook Street,,,Newbury,Berkshire,RG14 1DJ,Tel: 01635 40397, - ,,,2 ratings Rate it yourself - /Services/opticians/LeaveReview/DefaultView.aspx?id=OP_RG141DJ_85768,,,
Specsavers,OP_5E9_643__000001_SO238AF,OPT,The Brooks Centre,,Winchester,Hampshire,,SO23 8QY,Tel: 01962 844833, - ,,,1 rating Rate it yourself - /Services/opticians/LeaveReview/DefaultView.aspx?id=OP_5E9_643__000001_SO238AF,,,
Ottica UK Ltd,OP_RG141AY_85774,OPT,,38 Parkway,,Newbury,,RG14 1AY,, - ,,,No ratings yet Rate it yourself - /Services/opticians/LeaveReview/DefaultView.aspx?id=OP_RG141AY_85774,0,0,
Specsavers Opticians,OP_5DK_1746__000001_RG141DT,OPT,42-42a Northbrook Street,Newbury,Berkshire,,,RG14 1DT,Tel: 01635 46105, - ,,,No ratings yet Rate it yourself - /Services/opticians/LeaveReview/DefaultView.aspx?id=OP_5DK_1746__000001_RG141DT,0,0,
Boots-Winchester - High St,OP_5E9_1446__000001_SO239AY,OPT,144 High Street,,Winchester,Winchester,Hampshire,SO23 9AY,Tel: 01962 854553, - ,,,No ratings yet Rate it yourself - /Services/opticians/LeaveReview/DefaultView.aspx?id=OP_5E9_1446__000001_SO239AY,0,0,
Tesco Opticians,OP_SO237RS_29727,OPT,,Easton Lane,,Winchester,Hampshire,SO23 7RS,Tel: 0845 601 3479, - ,,,No ratings yet Rate it yourself - /Services/opticians/LeaveReview/DefaultView.aspx?id=OP_SO237RS_29727,0,0,
Hampson Opticians,OP_SO532FW_85744,OPT,,3A Hursley Road,,Chandlers Ford,,SO53 2FW,, - ,,,No ratings yet Rate it yourself - /Services/opticians/LeaveReview/DefaultView.aspx?id=OP_SO532FW_85744,0,0,
Haine & Smith Opticians,OP_5K4_2477__000003_SN110HA,OPT,,5 Phelps Parade,,Calne,Wiltshire,SN11 0HA,Tel: 01249 814560, - ,,,No ratings yet Rate it yourself - /Services/opticians/LeaveReview/DefaultView.aspx?id=OP_5K4_2477__000003_SN110HA,0,0,
Rawlings Opticians,OP_5LY_14074__000001_SO533DB,OPT,,"14 Fryern Arcade, Winchester Road",Chandlers Ford,Chandlers Ford,,SO53 2DQ,Tel: 023 8025 2428, - ,,,No ratings yet Rate it yourself - /Services/opticians/LeaveReview/DefaultView.aspx?id=OP_5LY_14074__000001_SO533DB,0,0,
Rayner Opticians,OP_5K4_10733__000001_SN110BS,OPT,,3 The Square,Wood Street,Calne,Wiltshire,SN11 0BY,Tel: 01249 813597, - ,,,No ratings yet Rate it yourself - /Services/opticians/LeaveReview/DefaultView.aspx?id=OP_5K4_10733__000001_SN110BS,0,0,no
Leightons Opticians & Hearing Care,OP_5LY_14073__000001_SO532QD,OPT,,"4-5 The Mall, Winchester Road",Chandlers Ford,Southampton,Hampshire,SO53 2QD,Tel: 02380 266 181, - ,,,No ratings yet Rate it yourself - /Services/opticians/LeaveReview/DefaultView.aspx?id=OP_5LY_14073__000001_SO532QD,0,0,
CGW Limited,OPT_SO533DA_1,OPT,,7 Bournemouth Road,,Chandlers Ford,,SO53 3DA,, - ,,,No ratings yet Rate it yourself - /Services/opticians/LeaveReview/DefaultView.aspx?id=OPT_SO533DA_1,0,0,
Peter Bennett,SO53 3AF__000001_SO533AF,OPT,232 Bournemouth Road,Chandlers Ford,Eastleigh,Hants,,SO53 3AF,, - ,,,No ratings yet Rate it yourself - /Services/opticians/LeaveReview/DefaultView.aspx?id=SO53 3AF__000001_SO533AF,0,0,
Haine & Smith Opticians,OP_5K3_2478__000002_SN49LN,OPT,8 Ellendune,Wroughton,,Wiltshire,,SN4 9LN,Tel: 01793 813054, - ,,,No ratings yet Rate it yourself - /Services/opticians/LeaveReview/DefaultView.aspx?id=OP_5K3_2478__000002_SN49LN,0,0,
Leightons Opticians & Hearing Care,OP_5DK_3647__000001_RG193JD,OPT,,12 Kingsland Centre,,Thatcham,Berkshire,RG19 3HN,Tel: 01635 863290, - ,,,1 rating Rate it yourself - /Services/opticians/LeaveReview/DefaultView.aspx?id=OP_5DK_3647__000001_RG193JD,,,
A.J Bass BSc FCOptom,OP_5A1_14086__000001_SP61AX,OPT,36 High Street,,Fordingbridge,Hampshire,,SP6 1AX,Tel: 01425 652663, - ,,,2 ratings Rate it yourself - /Services/opticians/LeaveReview/DefaultView.aspx?id=OP_5A1_14086__000001_SP61AX,,,
ASDA Opticians,OP_5LY_14072__000002_SO533YJ,OPT,Bournemouth Road,Chandlers Ford,Eastleigh,Hampshire,,SO53 3YJ,Tel: 023 8026 8341, - ,,,147 ratings Rate it yourself - /Services/opticians/LeaveReview/DefaultView.aspx?id=OP_5LY_14072__000002_SO533YJ,,,
Buyspecs Direct,TP0ML,OPT,,"Unit 9, Pipers Court",Berkshire Drive,Thatcham,Berkshire,RG19 4ER,Tel: 01635 293578, - ,,,No ratings yet Rate it yourself - /Services/opticians/LeaveReview/DefaultView.aspx?id=TP0ML,0,0,
Specsavers,OP_5LY_14851__000001_SO509EP,OPT,9 Leigh Road,,Eastleigh,Hampshire,,SO50 9EP,Tel: 023 8062 0011, - ,,,No ratings yet Rate it yourself - /Services/opticians/LeaveReview/DefaultView.aspx?id=OP_5LY_14851__000001_SO509EP,0,0,
M J Anthony,OP_5K4_12375__000001_SN68PX,OPT,Foxwood House,West End,Bishopstone,,,SN6 8PX,Tel: 01793 791352, - ,,,No ratings yet Rate it yourself - /Services/opticians/LeaveReview/DefaultView.aspx?id=OP_5K4_12375__000001_SN68PX,0,0,
Vision Visit,SN3 1JU,OPT,,51 Windsor Road,,Swindon,,SN3 1JU,Tel: 01793 232588, - ,,,No ratings yet Rate it yourself - /Services/opticians/LeaveReview/DefaultView.aspx?id=SN3 1JU,0,0,
Boots Opticians Warminster,240417135350,OPT,,51 Market Place,,Warminster,,BA12 9AZ,, - ,,,No ratings yet Rate it yourself - /Services/opticians/LeaveReview/DefaultView.aspx?id=240417135350,0,0,
Vision Express,OP_SO505RH_30046,OPT,,25 Market Street,,Eastleigh,Hampshire,SO50 5RH,Tel: 02380 650640, - ,,,No ratings yet Rate it yourself - /Services/opticians/LeaveReview/DefaultView.aspx?id=OP_SO505RH_30046,0,0,
Haine & Smith Opticians,OP_5DH_11016__000001_BA129AN,OPT,,10 Market Place,,Warminster,Wiltshire,BA12 9AN,Tel: 01985 212034, - ,,,No ratings yet Rate it yourself - /Services/opticians/LeaveReview/DefaultView.aspx?id=OP_5DH_11016__000001_BA129AN,0,0,
Specsavers,OPT_SO505RG_1,OPT,,35-37 Market Street,,Eastleigh,Hampshire,SO50 5RG,Tel: 02380 620011, - ,,,1 rating Rate it yourself - /Services/opticians/LeaveReview/DefaultView.aspx?id=OPT_SO505RG_1,,,
Batemans (Opticians) Ltd,OP_5DH_82__000001_BA129AY,OPT,21 Market Place,,,Warminster,Wiltshire,BA12 9AY,Tel: 01985 213347, - ,,,No ratings yet Rate it yourself - /Services/opticians/LeaveReview/DefaultView.aspx?id=OP_5DH_82__000001_BA129AY,0,0,
Specsavers Opticians,OP_5DH_645__000005_BA129AY,OPT,Unit 2,1 Market Place,Warminster,Wiltshire,,BA12 9AY,Tel: 01985 219 016, - ,,,No ratings yet Rate it yourself - /Services/opticians/LeaveReview/DefaultView.aspx?id=OP_5DH_645__000005_BA129AY,0,0,
Boots Opticians,OPT_SO505SF_1,OPT,,48 Swan Centre,,Eastleigh,,SO50 5SF,, - ,,,1 rating Rate it yourself - /Services/opticians/LeaveReview/DefaultView.aspx?id=OPT_SO505SF_1,,,
Leightons Opticians & Hearing Care,OP_5A1_14101__000001_SO403DG,OPT,,17 Water Lane,Totton,Southampton,Hampshire,SO40 3DG,Tel: 02380 862 456, - ,,,1 rating Rate it yourself - /Services/opticians/LeaveReview/DefaultView.aspx?id=OP_5A1_14101__000001_SO403DG,,,
Clapham Eyecare,OPT_SO403BX_1,OPT,,9 Commercial Road,,Totton,,SO40 3BX,, - ,,,No ratings yet Rate it yourself - /Services/opticians/LeaveReview/DefaultView.aspx?id=OPT_SO403BX_1,0,0,
Specsavers,SO40 3BX__000003_SO403BX,OPT,11 Commercial Road,,,Totton,,SO40 3BX,Tel: 02380 580 070, - ,,,No ratings yet Rate it yourself - /Services/opticians/LeaveReview/DefaultView.aspx?id=SO40 3BX__000003_SO403BX,0,0,
Carter & Harding,OP_5DH_9220__000001_BA133DN,OPT,21 Maristow Street,,Westbury,,,BA13 3DN,Tel: 01373 822084, - ,,,No ratings yet Rate it yourself - /Services/opticians/LeaveReview/DefaultView.aspx?id=OP_5DH_9220__000001_BA133DN,0,0,
Haine & Smith Opticians,OP_5DH_2366__000005_BA133BN,OPT,,19 High Street,,Westbury,Wiltshire,BA13 3BN,Tel: 01373 822163, - ,,,No ratings yet Rate it yourself - /Services/opticians/LeaveReview/DefaultView.aspx?id=OP_5DH_2366__000005_BA133BN,0,0,
Optique Opticians,OP_5A1_14102__000001_SO403BU,OPT,89 Junction Road,,Totton,Southampton (Totton),Hampshire,SO40 3BU,Tel: 023 8087 0002, - ,,,No ratings yet Rate it yourself - /Services/opticians/LeaveReview/DefaultView.aspx?id=OP_5A1_14102__000001_SO403BU,0,0,
Nixon & Shaw,OP_5DH_9392__000001_SN126JU,OPT,6 High Street,,Melksham,,,SN12 6JU,Tel: 01225 703218, - ,,,No ratings yet Rate it yourself - /Services/opticians/LeaveReview/DefaultView.aspx?id=OP_5DH_9392__000001_SN126JU,0,0,
Haine & Smith Opticians,OP_5DH_5723__000002_SN126LG,OPT,,27 High Street,,Melksham,Wiltshire,SN12 6JY,Tel: 01225 707881, - ,,,No ratings yet Rate it yourself - /Services/opticians/LeaveReview/DefaultView.aspx?id=OP_5DH_5723__000002_SN126LG,0,0,
The Outside Clinic,OP_5CC_14872__000024_SN14AN,OPT,Old Town Court,10-14 High Street,Old Town,Swindon,Wiltshire,SN1 3EP,Tel: 0800 60 50 40, - ,,,243 ratings Rate it yourself - /Services/opticians/LeaveReview/DefaultView.aspx?id=OP_5CC_14872__000024_SN14AN,,,
The Outside Clinic,OP_5CK_14996__000007_SN14AN,OPT,7 Wood Street,Old Town,Swindon,,,SN1 4AN,Tel: 0800 85 44 77, - ,,,3 ratings Rate it yourself - /Services/opticians/LeaveReview/DefaultView.aspx?id=OP_5CK_14996__000007_SN14AN,,,
Leightons Opticians & Hearing Care,OP_5K3_4081__000004_SN14AN,OPT,,33 Wood Street,,Swindon,Wiltshire,SN1 4AN,Tel: 01793 522 586, - ,,,No ratings yet Rate it yourself - /Services/opticians/LeaveReview/DefaultView.aspx?id=OP_5K3_4081__000004_SN14AN,0,0,
Scrivens Opticians & Hearing Care,OP_5L1_14121__000001_SO153NG,OPT,40 Shirley High Street,Shirley,,Southampton (Shirley),Hampshire,SO15 3NG,Tel: 023 8077 0804, - ,,,No ratings yet Rate it yourself - /Services/opticians/LeaveReview/DefaultView.aspx?id=OP_5L1_14121__000001_SO153NG,0,0,
Specsavers,SO15 3NH__000002_SO153NH,OPT,18-20 Shirley High Street,Shirley,Southampton,Hants,,SO15 3NH,Tel: 02380 778818, - ,,,No ratings yet Rate it yourself - /Services/opticians/LeaveReview/DefaultView.aspx?id=SO15 3NH__000002_SO153NH,0,0,
G D Monk,OP_5K3_14301__000004_SN11SD,OPT,35 Havelock Street,,Swindon,Wiltshire,,SN1 1SD,Tel: 01793 523743, - ,,,No ratings yet Rate it yourself - /Services/opticians/LeaveReview/DefaultView.aspx?id=OP_5K3_14301__000004_SN11SD,0,0,
Haine & Smith Opticians,OP_5K3_2612__000003_SN11JS,OPT,,45c Regent Street,Swindon,Wiltshire,,SN1 1JS,Tel: 01793 487888, - ,,,1 rating Rate it yourself - /Services/opticians/LeaveReview/DefaultView.aspx?id=OP_5K3_2612__000003_SN11JS,,,
Specsavers Opticians,OP_5K3_12126__000001_SN11SD,OPT,62/63 Regent Street,,Swindon,,,SN1 1JS,Tel: 01793 617858, - ,,,No ratings yet Rate it yourself - /Services/opticians/LeaveReview/DefaultView.aspx?id=OP_5K3_12126__000001_SN11SD,0,0,
The White Horse Optical Practice,OP_5K3_5315__000006_SN11LF,OPT,,7 Brunel Plaza,,Swindon,,SN1 1LF,Tel: 01793 432751, - ,,,No ratings yet Rate it yourself - /Services/opticians/LeaveReview/DefaultView.aspx?id=OP_5K3_5315__000006_SN11LF,0,0,
Boots-Swindon - Brunel Plaza (in Boots UK),OP_5K3_11563__000002_SN11LF,OPT,3 Brunel Plaza,,,Swindon,Wiltshire,SN1 1LF,Tel: 01793 433060, - ,,,6 ratings Rate it yourself - /Services/opticians/LeaveReview/DefaultView.aspx?id=OP_5K3_11563__000002_SN11LF,,,
Vision Express (UK) Ltd,OP_5K3_11424__000001_SN11JY,OPT,83 Regent Street,,Swindon,,,SN1 1JY,Tel: 01793 491194, - ,,,No ratings yet Rate it yourself - /Services/opticians/LeaveReview/DefaultView.aspx?id=OP_5K3_11424__000001_SN11JY,0,0,
Costco Wholesale UK Ltd,OPT_SO158TA_1,OPT,,Regents Park Road,,Southampton,,SO15 8TA,Tel: 02380 764 825, - ,,,No ratings yet Rate it yourself - /Services/opticians/LeaveReview/DefaultView.aspx?id=OPT_SO158TA_1,0,0,
Rawlings Opticians,OP_5E9_6187__000001_SO249AT,OPT,Bay Tree House,26 West Street,Alresford,Hampshire,,SO24 9AT,Tel: 01962 733269, - ,,,2 ratings Rate it yourself - /Services/opticians/LeaveReview/DefaultView.aspx?id=OP_5E9_6187__000001_SO249AT,,,
Matheson Optometrists,OP_5E9_572__000001_SO249AG,OPT,1-3 West Street,,,Alresford,,SO24 9AG,Tel: 01962 732336, - ,,,2 ratings Rate it yourself - /Services/opticians/LeaveReview/DefaultView.aspx?id=OP_5E9_572__000001_SO249AG,,,
Leightons Opticians & Hearing Care,OP_5DF_7434__000001_RG264HN,OPT,,Dental Surgery,Newchurch Road,Tadley,Hampshire,RG26 4HN,Tel: 0118 981 2250, - ,,,No ratings yet Rate it yourself - /Services/opticians/LeaveReview/DefaultView.aspx?id=OP_5DF_7434__000001_RG264HN,0,0,
Optical Express,SN1 1DA_83473,OPT,,"1st Floor (suite 4), Minton Place, Station Road",,Swindon,,SN1 1DA,Tel: 08000232020, - ,,,No ratings yet Rate it yourself - /Services/opticians/LeaveReview/DefaultView.aspx?id=SN1 1DA_83473,0,0,
R J Holmes Opticians Ltd,OP_5K3_8460__000003_SN57DL,OPT,West Swindon District Centre,Tewkesbury Way,Swindon,,,SN5 7DL,Tel: 01793 870011, - ,,,1 rating Rate it yourself - /Services/opticians/LeaveReview/DefaultView.aspx?id=OP_5K3_8460__000003_SN57DL,,,
Ashleigh Sight Care,OP_5L1_14117__000002_SO172NG,OPT,255 Portswood Road,Portswood,,Southampton,,SO17 2NG,Tel: 023 8055 0431, - ,,,No ratings yet Rate it yourself - /Services/opticians/LeaveReview/DefaultView.aspx?id=OP_5L1_14117__000002_SO172NG,0,0,yes
Tesco Opticians,TP41K,OPT,,Ocotal Way,,Swindon,,SN1 2EH,, - ,,,No ratings yet Rate it yourself - /Services/opticians/LeaveReview/DefaultView.aspx?id=TP41K,0,0,