Organisation Name,NACS Code,Organisation Type,Address1,Address2,Address3,Address4,Address5,PostCode,Telephone Number,Opening time,Value  (Opening time),Banding Classification  (Opening time),NHS.UK users rating,Value  (NHS.UK users rating),Banding Classification  (NHS.UK users rating),Car parking (Is there car parking at this organisation?)
Eye Options,SM46JSBRIGNALL,OPT,,"20-22 Rosehill Court, Bishopsford Road",,Morden,,SM4 6JS,Tel: 0208 648 4814, - ,,,2 ratings Rate it yourself - /Services/opticians/LeaveReview/DefaultView.aspx?id=SM46JSBRIGNALL,,,
Visionary Eyecare,VISIONARYEYECARE1,OPT,,"Suite 21/22, Marshall House, 124 Middleton Road",,Morden,Surrey,SM4 6RW,Tel: 0800 052 0355, - ,,,No ratings yet Rate it yourself - /Services/opticians/LeaveReview/DefaultView.aspx?id=VISIONARYEYECARE1,0,0,
MORDEN EYE CENTRE,SM4 6NP__000002_SM45NP,OPT,85 London Road,,,Morden,,SM4 5HP,Tel: 0208 648 3503, - ,,,1 rating Rate it yourself - /Services/opticians/LeaveReview/DefaultView.aspx?id=SM4 6NP__000002_SM45NP,,,
Michael Banes Opticians,20082015SM45BL,OPT,,18 Crown Lane,,Morden,Surrey,SM4 5BL,Tel: 0208 542 5775, - ,,,No ratings yet Rate it yourself - /Services/opticians/LeaveReview/DefaultView.aspx?id=20082015SM45BL,0,0,
SPECSAVERS,SM4 58Q__000003_SM45BQ,OPT,,30 London Road,,Morden,Surrey,SM4 5BQ,Tel: 0208 685 6600, - ,,,No ratings yet Rate it yourself - /Services/opticians/LeaveReview/DefaultView.aspx?id=SM4 58Q__000003_SM45BQ,0,0,
SECOND SIGHT,SM1 2QN__000002_SM12QN,OPT,,,,.,Surrey,SM1 2QN,Tel: 0208 642 2798, - ,,,No ratings yet Rate it yourself - /Services/opticians/LeaveReview/DefaultView.aspx?id=SM1 2QN__000002_SM12QN,0,0,
Anthony Opticians,OPT_SM38HW_1,OPT,,526 London Road,,Cheam,Surrey,SM3 8HW,Tel: 020 8644 9915, - ,,,No ratings yet Rate it yourself - /Services/opticians/LeaveReview/DefaultView.aspx?id=OPT_SM38HW_1,0,0,
John Lewis Opticians,CR43NH260615,OPT,,261 London Road,,Mitcham,,CR4 3NH,Tel: 0208 640 5353, - ,,,3 ratings Rate it yourself - /Services/opticians/LeaveReview/DefaultView.aspx?id=CR43NH260615,,,
REALEYES,CR4 3HN__000001_CR34NH,OPT,,235 London Road,,Mitcham,Surrey,CR4 3NH,Tel: 0208 544 5222, - ,,,2 ratings Rate it yourself - /Services/opticians/LeaveReview/DefaultView.aspx?id=CR4 3HN__000001_CR34NH,,,
Vision Express,OP_5M7_10667__000001_SM11JH,OPT,,145 High Street,,Sutton,Surrey,SM1 1JH,Tel: 0208 661 0303, - ,,,No ratings yet Rate it yourself - /Services/opticians/LeaveReview/DefaultView.aspx?id=OP_5M7_10667__000001_SM11JH,0,0,
TESCO OPTICIANS,KT2 4PJ__000002_KT34PJ,OPT,,300 Beverley Way,,New Malden,Surrey,KT3 4PJ,Tel: 0208 273 7138, - ,,,No ratings yet Rate it yourself - /Services/opticians/LeaveReview/DefaultView.aspx?id=KT2 4PJ__000002_KT34PJ,0,0,
A M S OPTICIANS,KT4 8HY__000001_KT48HY,OPT,,56 -58 Central Road,,Worcester Park,Surrey,KT4 8HY,Tel: 0208 330 5364, - ,,,5 ratings Rate it yourself - /Services/opticians/LeaveReview/DefaultView.aspx?id=KT4 8HY__000001_KT48HY,,,
Boots-Sutton - High St,SM1 1JG_11122,OPT,109-111 High Street,,,Sutton,Surrey,SM1 1JG,Tel: 0208 661 9488, - ,,,5 ratings Rate it yourself - /Services/opticians/LeaveReview/DefaultView.aspx?id=SM1 1JG_11122,,,
Pitman & Risner,OP_5M7_10278__000001_SW200AY,OPT,,98 Coombe Lane,,West Wimbledon,Surrey,SW20 0AY,Tel: 0208 946 5331, - ,,,No ratings yet Rate it yourself - /Services/opticians/LeaveReview/DefaultView.aspx?id=OP_5M7_10278__000001_SW200AY,0,0,
Boots-Worcester Park,KT4 8HT_19973,OPT,,118 Central Road,,Worcester Park,Surrey,KT4 8HT,Tel: 0208 330 7586, - ,,,No ratings yet Rate it yourself - /Services/opticians/LeaveReview/DefaultView.aspx?id=KT4 8HT_19973,0,0,
 Specsavers Opticians ,TP8F2_KT4 8DY ,OPT,,103 Central Road,,Worcester Park ,,KT4 8DY,, - ,,,No ratings yet Rate it yourself - /Services/opticians/LeaveReview/DefaultView.aspx?id=TP8F2_KT4 8DY,0,0,
Specsavers Opticians,OP_5M7_11446__000001_SW191RQ,OPT,38 The Broadway,Wimbledon,,London,,SW19 1RQ,Tel: 0208 542 4434, - ,,,No ratings yet Rate it yourself - /Services/opticians/LeaveReview/DefaultView.aspx?id=OP_5M7_11446__000001_SW191RQ,0,0,
VISION EXPRESS,SW19 1QB__000001_SW191QB,OPT,,31 The Broadway,,Wimbledon,Surrey,SW19 1QB,Tel: 0208 947 3106, - ,,,No ratings yet Rate it yourself - /Services/opticians/LeaveReview/DefaultView.aspx?id=SW19 1QB__000001_SW191QB,0,0,
R Woodfall Opticians,KT4 8DT__000001_KT48DT,OPT,,159 Central Road,,Worcester Park,Surrey,KT4 8DT,Tel: 0208 337 2059, - ,,,No ratings yet Rate it yourself - /Services/opticians/LeaveReview/DefaultView.aspx?id=KT4 8DT__000001_KT48DT,0,0,
Specsavers Opticians,OP_5M7_9564__000001_SM11EZ,OPT,76 High Street,Sutton,,Surrey,,SM1 1EZ,Tel: 0208 643 3434, - ,,,5 ratings Rate it yourself - /Services/opticians/LeaveReview/DefaultView.aspx?id=OP_5M7_9564__000001_SM11EZ,,,
Boots-Wimbledon - Centre Court Shopping Centre,SW19 8YA_19134,OPT,53 Centre Court,Shopping Centre,,Wimbledon,,SW19 8YA,Tel: 0208 946 5533, - ,,,11 ratings Rate it yourself - /Services/opticians/LeaveReview/DefaultView.aspx?id=SW19 8YA_19134,,,
The Opticians @ Day Lewis,OPT_SW194DP_1,OPT,Ground Floor,Sterling House,6 - 10 St Georges Road,Wimbledon,,SW19 4DP,Tel: 0208 944 7839, - ,,,No ratings yet Rate it yourself - /Services/opticians/LeaveReview/DefaultView.aspx?id=OPT_SW194DP_1,0,0,
PERCEPTION OPTICAL T/A BOOTS OPTICIANS,SW19 8YE__000007_SW198YE,OPT,,Centre Court Shopping Centre,,Wimbledon,Surrey,SW19 8YE,Tel: 0208 946 1386, - ,,,No ratings yet Rate it yourself - /Services/opticians/LeaveReview/DefaultView.aspx?id=SW19 8YE__000007_SW198YE,0,0,
Leightons Opticians & Hearing Care,110520171021,OPT,,10 High Street,,Sutton,Surrey,SM1 1HN,Tel: 020 8642 2798, - ,,,No ratings yet Rate it yourself - /Services/opticians/LeaveReview/DefaultView.aspx?id=110520171021,0,0,
Optics Direct,OP_5M7_14655__000001_SM38BU,OPT,,18 Ewell Road,,Cheam,,SM3 8BU,Tel: 0208 642 2193, - ,,,No ratings yet Rate it yourself - /Services/opticians/LeaveReview/DefaultView.aspx?id=OP_5M7_14655__000001_SM38BU,0,0,
EYE CONTACT,KT3 4BH__000001_KT34BH,OPT,191 High Street,,,New Malden,,KT3 4BH,Tel: 0208 942 1104, - ,,,No ratings yet Rate it yourself - /Services/opticians/LeaveReview/DefaultView.aspx?id=KT3 4BH__000001_KT34BH,0,0,
Boots-New Malden,KT3 4ET__000004_KT34ET,OPT,,82 High Street,,New Malden,Surrey,KT3 4ET,Tel: 0208 942 0570, - ,,,No ratings yet Rate it yourself - /Services/opticians/LeaveReview/DefaultView.aspx?id=KT3 4ET__000004_KT34ET,0,0,
SPECSAVERS,OP_5A5_14575__000003_KT34ET,OPT,72 High Street,New Malden,,Surrey,,KT3 4ET,Tel: 0208 336 7620, - ,,,No ratings yet Rate it yourself - /Services/opticians/LeaveReview/DefaultView.aspx?id=OP_5A5_14575__000003_KT34ET,0,0,
Gordon Turner Optometrists,OP_5M7_0000__000001_SM38SG,OPT,,71 Station Way,Cheam,Surrey,,SM3 8SG,Tel: 020 8642 0563, - ,,,1 rating Rate it yourself - /Services/opticians/LeaveReview/DefaultView.aspx?id=OP_5M7_0000__000001_SM38SG,,,no
David Clulow Opticians,OPT_SW195EE_1,OPT,,65 High Street,Wimbledon Village,London,,SW19 5EE,Tel: 020 8946 2825, - ,,,No ratings yet Rate it yourself - /Services/opticians/LeaveReview/DefaultView.aspx?id=OPT_SW195EE_1,0,0,
Optics Vision,OP_5LG_14642__000001_SW179JR,OPT,25a London Road,,Tooting Junction,,,SW17 9JR,Tel: 0208 640 5362, - ,,,No ratings yet Rate it yourself - /Services/opticians/LeaveReview/DefaultView.aspx?id=OP_5LG_14642__000001_SW179JR,0,0,
Barlindene Ltd,OP_5M7_7788__000001_SM67NY,OPT,,381 Croydon Road,,Wallington,Surrey,SM6 7NY,Tel: 0208 647 8992, - ,,,No ratings yet Rate it yourself - /Services/opticians/LeaveReview/DefaultView.aspx?id=OP_5M7_7788__000001_SM67NY,0,0,
Fiona Watt Optometrists,SW20 0RH__000001_SW20 0RH,OPT,,265 Coombe Lane,,West Wimbledon,,SW20 0RH,Tel: 020 8944 6886, - ,,,4 ratings Rate it yourself - /Services/opticians/LeaveReview/DefaultView.aspx?id=SW20 0RH__000001_SW20 0RH,,,
Pearl Vision,5LG241105__000002_SW179NH,OPT,136-138 Mitcham Road,Tooting,,London,,SW17 9NH,Tel: 0208 672 2158, - ,,,No ratings yet Rate it yourself - /Services/opticians/LeaveReview/DefaultView.aspx?id=5LG241105__000002_SW179NH,0,0,
Specsavers Opticians,OP_5LG_6338__000002_SW179NA,OPT,24c Mitcham Road,Tooting,London,,,SW17 9NA,Tel: 0208 682 3333, - ,,,1 rating Rate it yourself - /Services/opticians/LeaveReview/DefaultView.aspx?id=OP_5LG_6338__000002_SW179NA,,,
Perfect Vision,OP_5LG_9554__000001_SW179NA,OPT,74 Mitcham Road,,Tooting,,,SW17 9NA,Tel: 0208 767 6501, - ,,,No ratings yet Rate it yourself - /Services/opticians/LeaveReview/DefaultView.aspx?id=OP_5LG_9554__000001_SW179NA,0,0,
Boots-Tooting,SW17 0RG__000003_SW170RG,OPT,46 Tooting High Street,,,London,,SW17 0RG,Tel: 0208 767 8292, - ,,,No ratings yet Rate it yourself - /Services/opticians/LeaveReview/DefaultView.aspx?id=SW17 0RG__000003_SW170RG,0,0,
Wheeler & Kirk,OP_5LG_14647__000002_SW170RG,OPT,,8 High Street,,Tooting,,SW17 0RG,Tel: 0208 672 7060, - ,,,No ratings yet Rate it yourself - /Services/opticians/LeaveReview/DefaultView.aspx?id=OP_5LG_14647__000002_SW170RG,0,0,
Punch Opticians,OP_5LG_14644__000002_SM60NN,OPT,400 Garrett Lane,,Wandsworth,,,SM6 0NN,Tel: 0208 669 2631, - ,,,No ratings yet Rate it yourself - /Services/opticians/LeaveReview/DefaultView.aspx?id=OP_5LG_14644__000002_SM60NN,0,0,
Wallington Opticians,OPT_SM60LY_1,OPT,,116 Woodcote Road,,Wallington,Surrey,SM6 0LY,Tel: 020 8647 3644, - ,,,No ratings yet Rate it yourself - /Services/opticians/LeaveReview/DefaultView.aspx?id=OPT_SM60LY_1,0,0,
SPECSAVERS,SM6 0LY__000002_SM60LY,OPT,,76 Woodcote Road,,Wallington,Surrey,SM6 0LY,Tel: 0208 835 3680, - ,,,1 rating Rate it yourself - /Services/opticians/LeaveReview/DefaultView.aspx?id=SM6 0LY__000002_SM60LY,,,
For Your Eyes,OP_5M7_14651__000001_SM60LY,OPT,,116 Woodcote Road,,Wallington,Surrey,SM6 0LY,Tel: 0208 647 3644, - ,,,No ratings yet Rate it yourself - /Services/opticians/LeaveReview/DefaultView.aspx?id=OP_5M7_14651__000001_SM60LY,0,0,
Asda Opticians,OPT_CR0 4XS,OPT,,Marlow Way,,Croydon,,CR0 4XS,Tel: 0208 6837614, - ,,,1 rating Rate it yourself - /Services/opticians/LeaveReview/DefaultView.aspx?id=OPT_CR0 4XS,,,
Eye Contact Vision Clinic,OPT_SM69BS_1,OPT,,152 Stafford Road,,Wallington,,SM6 9BS,Tel: 020 8773 3888, - ,,,No ratings yet Rate it yourself - /Services/opticians/LeaveReview/DefaultView.aspx?id=OPT_SM69BS_1,0,0,
London Eye Care Centre,OPT_SW164AH_1,OPT,,1415 London Road,,London,,SW16 4AH,Tel: 0208 679 0955, - ,,,No ratings yet Rate it yourself - /Services/opticians/LeaveReview/DefaultView.aspx?id=OPT_SW164AH_1,0,0,
London Eye Care Centre,OP_5K9_1006__000001_SW164AH,OPT,1415 London Road,,,London,,SW16 4AH,Tel: 020 8679 0955, - ,,,No ratings yet Rate it yourself - /Services/opticians/LeaveReview/DefaultView.aspx?id=OP_5K9_1006__000001_SW164AH,0,0,
Anthony Opticians,OP_5A5_7931__000001_KT67HR,OPT,84 The Broadway,Tolworth,,Surrey,,KT6 7HR,Tel: 0208 390 5219, - ,,,No ratings yet Rate it yourself - /Services/opticians/LeaveReview/DefaultView.aspx?id=OP_5A5_7931__000001_KT67HR,0,0,
Bayfields Opticians & Audiologists,X3N3Z,OPT,68 High Street,,Ewell,Surrey,,KT17 1RL,Tel: 020 8393 7711, - ,,,No ratings yet Rate it yourself - /Services/opticians/LeaveReview/DefaultView.aspx?id=X3N3Z,0,0,
Visionary Eyecare Limited,OP_5EA_14803__000001_SW165RT,OPT,24 Westwell Road,,London,,,SW16 5RT,Tel: 0800 052 0355, - ,,,No ratings yet Rate it yourself - /Services/opticians/LeaveReview/DefaultView.aspx?id=OP_5EA_14803__000001_SW165RT,0,0,
The Eye Centre,00-1411 - 00-1410__000001_CR77PA,OPT,830 London Road,Thornton Heath,,Croydon,,CR7 7PA,Tel: 020 8689 0011, - ,,,No ratings yet Rate it yourself - /Services/opticians/LeaveReview/DefaultView.aspx?id=00-1411 - 00-1410__000001_CR77PA,0,0,
Vision In The Village,SW18 5LT__000006_SW185LT,OPT,35 Replingham Road,,Southfields,London,,SW18 5LT,Tel: 0208 874 1001, - ,,,1 rating Rate it yourself - /Services/opticians/LeaveReview/DefaultView.aspx?id=SW18 5LT__000006_SW185LT,,,
Wheeler & Kirk,OP_5LG_718__000004_SW185LT,OPT,15 Replingham Road,Southfields,,London,,SW18 5LT,Tel: 020 8870 9706, - ,,,1 rating Rate it yourself - /Services/opticians/LeaveReview/DefaultView.aspx?id=OP_5LG_718__000004_SW185LT,,,
Thomas H. Collison Ltd,OP_5A5_11523__000001_KT67BA,OPT,372 Ewell Road,Tolworth,,Surrey,,KT6 7BA,Tel: 020 8399 0700, - ,,,1 rating Rate it yourself - /Services/opticians/LeaveReview/DefaultView.aspx?id=OP_5A5_11523__000001_KT67BA,,,
Boots-Croydon - London Rd,OP_5K9_2446__000001_CR76AR,OPT,511 London Road,,Thornton Heath,Croydon,Surrey,CR7 6AR,Tel: 0208 689 5565, - ,,,2 ratings Rate it yourself - /Services/opticians/LeaveReview/DefaultView.aspx?id=OP_5K9_2446__000001_CR76AR,,,
Asda Opticians,OPT_SW15 3DT,OPT,,"31, ROEHAMPTON VALE",,LONDON,,SW15 3DT,, - ,,,No ratings yet Rate it yourself - /Services/opticians/LeaveReview/DefaultView.aspx?id=OPT_SW15 3DT,0,0,
Asda Opticians,OPT_SW153DT_1,OPT,,"31, ROEHAMPTON VALE",ROEHAMPTON,LONDON,,SW15 3DT,Tel: 00000 000000, - ,,,No ratings yet Rate it yourself - /Services/opticians/LeaveReview/DefaultView.aspx?id=OPT_SW153DT_1,0,0,
Asda Opticians,OPT_SW153DT_3,OPT,,"31, ROEHAMPTON VALE",,LONDON,,SW15 3DT,Tel: 020 8780 4082, - ,,,No ratings yet Rate it yourself - /Services/opticians/LeaveReview/DefaultView.aspx?id=OPT_SW153DT_3,0,0,
Asda Opticians,OPT_SW153DT_2,OPT,,"31, ROEHAMPTON VALE",,LONDON,,SW15 3DT,, - ,,,No ratings yet Rate it yourself - /Services/opticians/LeaveReview/DefaultView.aspx?id=OPT_SW153DT_2,0,0,
Asda Opticians,OPT_SW153DT_4,OPT,,"31, ROEHAMPTON VALE",,LONDON,,SW15 3DT,, - ,,,No ratings yet Rate it yourself - /Services/opticians/LeaveReview/DefaultView.aspx?id=OPT_SW153DT_4,0,0,
J S Robin,OP_5LD_3788__000001_SW162DQ,OPT,Whittington Centre,11-13 Rutford Road,London,,,SW16 2DQ,Tel: 020 3049 5323, - ,,,No ratings yet Rate it yourself - /Services/opticians/LeaveReview/DefaultView.aspx?id=OP_5LD_3788__000001_SW162DQ,0,0,
Optilabs Ltd,OP_5K9_12617__000001_CR04NN,OPT,109 Stafford Road,,Croydon,,,CR0 4NN,Tel: 020 8686 5708, - ,,,2 ratings Rate it yourself - /Services/opticians/LeaveReview/DefaultView.aspx?id=OP_5K9_12617__000001_CR04NN,,,
Mistry Opticians,OP_5A5_13282__000001_KT67AB,OPT,287 Ewell Road,Surbiton,,Surrey,,KT6 7AB,Tel: 020 8399 4491, - ,,,1 rating Rate it yourself - /Services/opticians/LeaveReview/DefaultView.aspx?id=OP_5A5_13282__000001_KT67AB,,,
Specsavers Opticians,OP_5LD_10154__000004_SW161BB,OPT,192 Streatham High Road,Streatham,London,,,SW16 1BB,Tel: 020 8677 5866, - ,,,2 ratings Rate it yourself - /Services/opticians/LeaveReview/DefaultView.aspx?id=OP_5LD_10154__000004_SW161BB,,,
EAGLE EYES,SW16 4DR__000001_SW184DR,OPT,199 Garrett Lane,,Wandsworth,London,,SW18 4DR,, - ,,,No ratings yet Rate it yourself - /Services/opticians/LeaveReview/DefaultView.aspx?id=SW16 4DR__000001_SW184DR,0,0,
Costco Wholesale,OP_CR04RR_46729,OPT,,23-29 Imperial Way,,Croydon,,CR0 4RR,Tel: 0208 253 4115, - ,,,No ratings yet Rate it yourself - /Services/opticians/LeaveReview/DefaultView.aspx?id=OP_CR04RR_46729,0,0,
Spex Direct,OP_5K9_10386__000001_CR04JA,OPT,21 Rectory Grove,,Croydon,,,CR0 4JA,Tel: 020 8407 1728, - ,,,No ratings yet Rate it yourself - /Services/opticians/LeaveReview/DefaultView.aspx?id=OP_5K9_10386__000001_CR04JA,0,0,
Boots-Streatham,OP_5LD_12179__000001_SW161PR,OPT,6 Astoria Parade,,Streatham High Road,London,,SW16 1PR,Tel: 0208 769 1030, - ,,,2 ratings Rate it yourself - /Services/opticians/LeaveReview/DefaultView.aspx?id=OP_5LD_12179__000001_SW161PR,,,
Clair Vision,SW12 9BW  A__000005_SW129BW,OPT,,164 Balham High Road,,Balham,,SW12 9BW,Tel: 0208 675 3368, - ,,,2 ratings Rate it yourself - /Services/opticians/LeaveReview/DefaultView.aspx?id=SW12 9BW  A__000005_SW129BW,,,
Perfect Vision,OP_5LG_14643__000003_SW129BW,OPT,182 Balham High Road,Balham,London,,,SW12 9BW,Tel: 0208 673 2122, - ,,,No ratings yet Rate it yourself - /Services/opticians/LeaveReview/DefaultView.aspx?id=OP_5LG_14643__000003_SW129BW,0,0,
Boots Opticians Balham,A1T4Y,OPT,,170 High Road,,Balham,Greater London,SW12 9BW,Tel: 020 86731546, - ,,,No ratings yet Rate it yourself - /Services/opticians/LeaveReview/DefaultView.aspx?id=A1T4Y,0,0,
Kerr Eyecare,OP_5K9_9062__000001_CR02RE,OPT,37 London Road,,,West Croydon,Surrey,CR0 2RE,Tel: 020 8688 5076, - ,,,6 ratings Rate it yourself - /Services/opticians/LeaveReview/DefaultView.aspx?id=OP_5K9_9062__000001_CR02RE,,,
Specsavers Opticians,TP9GG,OPT,,Sainsburys,Kiln Lane,Epsom,Surrey,KT17 1EQ,Tel: 01372 677928, - ,,,No ratings yet Rate it yourself - /Services/opticians/LeaveReview/DefaultView.aspx?id=TP9GG,0,0,
Specsavers Opticians,OP_5K9_765__000001_CR01UD,OPT,112 North End,Croydon,,Surrey,,CR0 1UD,Tel: 020 8681 8688, - ,,,No ratings yet Rate it yourself - /Services/opticians/LeaveReview/DefaultView.aspx?id=OP_5K9_765__000001_CR01UD,0,0,
Vision Express ,OP_5K9_12585__000001_CR01TJ,OPT,73 North End,,,Croydon,,CR0 1TJ,Tel: 020 8649 7280, - ,,,1 rating Rate it yourself - /Services/opticians/LeaveReview/DefaultView.aspx?id=OP_5K9_12585__000001_CR01TJ,,,
Specsavers Opticians,OP_5K9_916__000001_CR01RH,OPT,19 Church Street,,,Croydon,,CR0 1RH,Tel: 0208 760 0574, - ,,,No ratings yet Rate it yourself - /Services/opticians/LeaveReview/DefaultView.aspx?id=OP_5K9_916__000001_CR01RH,0,0,
For Eyes (Optimistry Ltd),OPT_CR01TB_1,OPT,,55 Frith Road,,Croydon,Surrey,CR0 1TB,Tel: 020 8662 8012, - ,,,1 rating Rate it yourself - /Services/opticians/LeaveReview/DefaultView.aspx?id=OPT_CR01TB_1,,,
Boots-Croydon - Whitgift Centre,OP_5K9_2997__000001_CR91SN,OPT,12-18 Whitgift Centre,,,Croydon,Surrey,CR9 1SN,Tel: 0208 680 2733, - ,,,5 ratings Rate it yourself - /Services/opticians/LeaveReview/DefaultView.aspx?id=OP_5K9_2997__000001_CR91SN,,,
FOCAL POINT,SW15 4DQ__000004_SW154DQ,OPT,45 Danesbury Avenue,,Roehampton,London,,SW15 4DQ,Tel: 0208 780 3288, - ,,,No ratings yet Rate it yourself - /Services/opticians/LeaveReview/DefaultView.aspx?id=SW15 4DQ__000004_SW154DQ,0,0,
Boots-Wandsworth,SW18 4TE__000001_SW184TE,OPT,28 South Side Shopping Centre,,Wandsworth,London,,SW18 4TE,Tel: 0208 871 9396, - ,,,No ratings yet Rate it yourself - /Services/opticians/LeaveReview/DefaultView.aspx?id=SW18 4TE__000001_SW184TE,0,0,
Specsavers Opticians,TP10G,OPT,,2 Surbiton Parade,,Surbiton,,KT6 4RB,, - ,,,No ratings yet Rate it yourself - /Services/opticians/LeaveReview/DefaultView.aspx?id=TP10G,0,0,
Specsavers Opticians,TP10G,OPT,,2 Surbiton Parade,,Surbiton,Surrey,KT6 4RB,Tel: 0208 339 8900, - ,,,No ratings yet Rate it yourself - /Services/opticians/LeaveReview/DefaultView.aspx?id=TP10G,0,0,
Croydon Optical Ltd,OP_5K9_13029__000001_CR01XB,OPT,1143 Whitgift Centre,,,Croydon,,CR0 1XB,Tel: 020 8680 2828, - ,,,No ratings yet Rate it yourself - /Services/opticians/LeaveReview/DefaultView.aspx?id=OP_5K9_13029__000001_CR01XB,0,0,
Rawling and Sons,OP_5K9_14389__000001_CR01YA,OPT,8 High Street,Croydon,,Surrey,,CR0 1YA,Tel: 020 8688 1040, - ,,,No ratings yet Rate it yourself - /Services/opticians/LeaveReview/DefaultView.aspx?id=OP_5K9_14389__000001_CR01YA,0,0,
KALSI OPTICIANS,KT8 4QU__000001_KT64QU,OPT,24 Claremont Road,,,Surbiton,,KT6 4QU,Tel: 0208 399 9887, - ,,,No ratings yet Rate it yourself - /Services/opticians/LeaveReview/DefaultView.aspx?id=KT8 4QU__000001_KT64QU,0,0,
Arthur Hayes Opticians,OP_5K9_10535__000001_CR01UX,OPT,1070 Whitgift Centre,,,Croydon,,CR0 1UX,Tel: 020 8686 0707, - ,,,No ratings yet Rate it yourself - /Services/opticians/LeaveReview/DefaultView.aspx?id=OP_5K9_10535__000001_CR01UX,0,0,
Whitgift Foundation,OP_5K9_1004__000001_CR91SS,OPT,North End,,Croydon,,,CR9 1SS,Tel: 020 8681 2876, - ,,,No ratings yet Rate it yourself - /Services/opticians/LeaveReview/DefaultView.aspx?id=OP_5K9_1004__000001_CR91SS,0,0,
Boots-Thornton Heath,OP_5K9_742__000001_CR78RY,OPT,87 High Street,,,Thornton Heath,Surrey,CR7 8RY,Tel: 0208 684 1155, - ,,,No ratings yet Rate it yourself - /Services/opticians/LeaveReview/DefaultView.aspx?id=OP_5K9_742__000001_CR78RY,0,0,yes
Young's Opticians,OP_5K9_4107__000001_CR01YG,OPT,12 St. Georges Walk,,,Croydon,,CR0 1YG,Tel: 020 8686 0676, - ,,,2 ratings Rate it yourself - /Services/opticians/LeaveReview/DefaultView.aspx?id=OP_5K9_4107__000001_CR01YG,,,
Boots-Surbiton,KT6 4NR__000001_KT66NR,OPT,2 Onslow House,67 Victoria Rd,,Surbiton,,KT6 4NR,Tel: 020 8390 9268, - ,,,No ratings yet Rate it yourself - /Services/opticians/LeaveReview/DefaultView.aspx?id=KT6 4NR__000001_KT66NR,0,0,
Opticall Ltd,685P2__000001_W52QP,OPT,7 Acantha Court,"1st Floor, 21 Victoria Road",Ealing,"Surbiton, Surrey",,KT6 4JZ,, - ,,,No ratings yet Rate it yourself - /Services/opticians/LeaveReview/DefaultView.aspx?id=685P2__000001_W52QP,0,0,
Hollands Opticians Surbiton,KT6 4JZ__000002_KT64JZ,OPT,24a,Victoria Road,,Surbiton,,KT6 4JZ,Tel: 0208 399 8104, - ,,,3 ratings Rate it yourself - /Services/opticians/LeaveReview/DefaultView.aspx?id=KT6 4JZ__000002_KT64JZ,,,
Specsavers Opticians,OP_5A5_106__000001_KT11MP,OPT,56 - 58 Clarence Street,,,Kingston-upon-Thames,,KT1 1NP,Tel: 020 8974 6677, - ,,,No ratings yet Rate it yourself - /Services/opticians/LeaveReview/DefaultView.aspx?id=OP_5A5_106__000001_KT11MP,0,0,
R N  MORJARIA,SW18 4JB__000002_SW184JB,OPT,123 Wamdsworth High Street,,Wandsworth,London,,SW18 4JB,, - ,,,No ratings yet Rate it yourself - /Services/opticians/LeaveReview/DefaultView.aspx?id=SW18 4JB__000002_SW184JB,0,0,
Realeyes Ltd,OP_5LD_1539__000001_SW24UG,OPT,107 Streatham Hill,,London,London,,SW2 4UG,Tel: 020 8671 8659, - ,,,5 ratings Rate it yourself - /Services/opticians/LeaveReview/DefaultView.aspx?id=OP_5LD_1539__000001_SW24UG,,,
Optical Express,OP_5K9_7722__000001_CR01UY,OPT,Woolwich House,43 George Street,,Croydon,Surrey,CR0 1LB,Tel: 0800 023 2020, - ,,,No ratings yet Rate it yourself - /Services/opticians/LeaveReview/DefaultView.aspx?id=OP_5K9_7722__000001_CR01UY,0,0,
Banstead Opticians,OPT_SM72NT_1,OPT,,157 High Street,,Banstead,,SM7 2NT,, - ,,,No ratings yet Rate it yourself - /Services/opticians/LeaveReview/DefaultView.aspx?id=OPT_SM72NT_1,0,0,
HORROCKS & BOYD,KT1 1SF__000001_KT11SF,OPT,,39 Fife Raod,,Kingston Upon Thames,Surrey,KT1 1SF,Tel: 0208 546 2481, - ,,,No ratings yet Rate it yourself - /Services/opticians/LeaveReview/DefaultView.aspx?id=KT1 1SF__000001_KT11SF,0,0,no
SeeAbility Ltd,CO-4941,OPT,,Newplan House,,Surrey,,KT17 1BL,, - ,,,No ratings yet Rate it yourself - /Services/opticians/LeaveReview/DefaultView.aspx?id=CO-4941,0,0,
Optical Express,KT1 1NP__000001_KT11NP,OPT,3rd Floor,14-18 Fife Road,,Kingston,Surrey,KT1 1SZ,Tel: 0800 023 2020, - ,,,No ratings yet Rate it yourself - /Services/opticians/LeaveReview/DefaultView.aspx?id=KT1 1NP__000001_KT11NP,0,0,
Optical Express,,OPT,,93-95 Bedford Street,,Kingston Upon Thames,,KT1 1SZ,, - ,,,N/A - Data not available,,,
DOLLOND & AITCHISON,SM7 2NL__000003_SM72NL,OPT,103 High Street,,Banstead,Surrey,,SM7 2NL,Tel: 01737 362948, - ,,,No ratings yet Rate it yourself - /Services/opticians/LeaveReview/DefaultView.aspx?id=SM7 2NL__000003_SM72NL,0,0,
Specsavers Opticians,OPT_SM72NL_2,OPT,,105 High Street,,Banstead,Surrey,SM7 2NL,Tel: 01737 858940, - ,,,No ratings yet Rate it yourself - /Services/opticians/LeaveReview/DefaultView.aspx?id=OPT_SM72NL_2,0,0,
Boots Opticians,OPT_SM72NL_1,OPT,,103 High Street,,Banstead,,SM7 2NL,, - ,,,No ratings yet Rate it yourself - /Services/opticians/LeaveReview/DefaultView.aspx?id=OPT_SM72NL_1,0,0,
Boots-Banstead - High St ,OP_5KP_12811__000002_SM72NL,OPT,85-87 High Street,,Banstead,Banstead,Surrey,SM7 2NL,Tel: 01737 362948, - ,,,No ratings yet Rate it yourself - /Services/opticians/LeaveReview/DefaultView.aspx?id=OP_5KP_12811__000002_SM72NL,0,0,
M S Kalsi Opticians,TP856,OPT,,75 High Street,,Banstead,Surrey,SM7 2NL,Tel: 01737 362011, - ,,,No ratings yet Rate it yourself - /Services/opticians/LeaveReview/DefaultView.aspx?id=TP856,0,0,
Boots-Kingston - Union St,KT1 1RP__000005_KT11RP,OPT,42 Union Street,,,Kingston Upon Thames,Surrey,KT1 1RP,Tel: 0208 5411560, - ,,,1 rating Rate it yourself - /Services/opticians/LeaveReview/DefaultView.aspx?id=KT1 1RP__000005_KT11RP,,,