Organisation Name,NACS Code,Organisation Type,Address1,Address2,Address3,Address4,Address5,PostCode,Telephone Number,Opening time,Value  (Opening time),Banding Classification  (Opening time),NHS.UK users rating,Value  (NHS.UK users rating),Banding Classification  (NHS.UK users rating),Car parking (Is there car parking at this organisation?)
Specsavers Opticians,TP9A1,OPT,,46/48 Packhorse Road,,Gerrards Cross,Buckinghamshire,SL9 8EF,Tel: 01753 278030, - ,,,No ratings yet Rate it yourself - /Services/opticians/LeaveReview/DefaultView.aspx?id=TP9A1,0,0,
Boots-Gerrards Cross,OLCO27635G4__000002_SL98EF,OPT,52 Packhorse Road,,,Gerrards Cross,Buckinghamshire,SL9 8EF,Tel: 01753 279763, - ,,,No ratings yet Rate it yourself - /Services/opticians/LeaveReview/DefaultView.aspx?id=OLCO27635G4__000002_SL98EF,0,0,
Chilton Watson Ltd,OP_5G4_1559__000001_SL98ES,OPT,3 Station Road,,,Gerrards Cross,Buckinghamshire,SL9 8ES,Tel: 01753 886306, - ,,,No ratings yet Rate it yourself - /Services/opticians/LeaveReview/DefaultView.aspx?id=OP_5G4_1559__000001_SL98ES,0,0,
Olivers Opticians Ltd,OP_5G4_2237__000001_SL99EA,OPT,2 Market Place,,,Chalfont St Peter,Buckinghamshire,SL9 9EA,Tel: 01753 890822, - ,,,No ratings yet Rate it yourself - /Services/opticians/LeaveReview/DefaultView.aspx?id=OP_5G4_2237__000001_SL99EA,0,0,
Heaton Caffin Optometrists,OP_SL99QQ_46731,OPT,33 St Peter's Court,,,Chalfont St Peter,Buckinghamshire,SL9 9QQ,Tel: 01753 886806, - ,,,No ratings yet Rate it yourself - /Services/opticians/LeaveReview/DefaultView.aspx?id=OP_SL99QQ_46731,0,0,
Denham Opticians,OLCO34465QD__000001_UB95HB,OPT,4 The Broadway East,North Orbital Road,Denham Green,Buckinghamshire,,UB9 5HB,Tel: 01895 832122, - ,,,No ratings yet Rate it yourself - /Services/opticians/LeaveReview/DefaultView.aspx?id=OLCO34465QD__000001_UB95HB,0,0,
Harefield Opticians,OP_5AT_12107__000001_UB96BX,OPT,33 High Street,Harefield,Middlesex,UXBRIDGE,Middlesex,UB9 6BX,Tel: 01895 823 237, - ,,,54 ratings Rate it yourself - /Services/opticians/LeaveReview/DefaultView.aspx?id=OP_5AT_12107__000001_UB96BX,,,
Michael Blackstone Optometrists,OP_5G4_13333__000001_HP91QQ,OPT,18 The Highway,Station Road,,Beaconsfield,Buckinghamshire,HP9 1QQ,Tel: 01494 673782, - ,,,No ratings yet Rate it yourself - /Services/opticians/LeaveReview/DefaultView.aspx?id=OP_5G4_13333__000001_HP91QQ,0,0,
Boots-Beaconsfield,OP_5G4_13334__000001_HP91HH,OPT,25 Gregories Road,,,Beaconsfield,Buckinghamshire,HP9 1HH,Tel: 01494 673627, - ,,,No ratings yet Rate it yourself - /Services/opticians/LeaveReview/DefaultView.aspx?id=OP_5G4_13334__000001_HP91HH,0,0,
S H Harrold (1937) Ltd,OP_5G4_3077__000001_HP91HQ,OPT,26 Gregories Road,,Beaconsfield,,,HP9 1HQ,Tel: 01494 672193, - ,,,No ratings yet Rate it yourself - /Services/opticians/LeaveReview/DefaultView.aspx?id=OP_5G4_3077__000001_HP91HQ,0,0,
Heaton Caffin Opticians,OP_5GV_3059__000002_WD32DN,OPT,121 Uxbridge Road,Rickmansworth,Hertfordshire,,,WD3 7DN,Tel: 01923 774939, - ,,,No ratings yet Rate it yourself - /Services/opticians/LeaveReview/DefaultView.aspx?id=OP_5GV_3059__000002_WD32DN,0,0,
Chorleywood Eye Centre,CO-5238,OPT,,47c Lower Road,,Chorleywood,,WD3 5LQ,Tel: 019238286434, - ,,,3 ratings Rate it yourself - /Services/opticians/LeaveReview/DefaultView.aspx?id=CO-5238,,,
J E Landaw,OP_5GV_4631__000001_WD35NL,OPT,5 New Parade,Chorleywood,Rickmansworth,Hertfordshire,,WD3 5NJ,Tel: 01923 283494, - ,,,No ratings yet Rate it yourself - /Services/opticians/LeaveReview/DefaultView.aspx?id=OP_5GV_4631__000001_WD35NL,0,0,
Vision Express (UK) Ltd,OP_5AT_6652__000001_UB81LN,OPT,58 High Street,Uxbridge,Middlesex,,,UB8 1LN,Tel: 01895 231261, - ,,,No ratings yet Rate it yourself - /Services/opticians/LeaveReview/DefaultView.aspx?id=OP_5AT_6652__000001_UB81LN,0,0,
S H Harrold (1937) Ltd,OP_5AT_8013__000001_UB81JX,OPT,130-131 High Street,Uxbridge,Middlesex,,,UB8 1JX,Tel: 01895 234017, - ,,,No ratings yet Rate it yourself - /Services/opticians/LeaveReview/DefaultView.aspx?id=OP_5AT_8013__000001_UB81JX,0,0,
Specsavers Opticians,OP_5AT_1913__000002_UB81LN,OPT,,56 High Street,Uxbridge,Middlesex,,UB8 1JP,Tel: 01895 256010, - ,,,No ratings yet Rate it yourself - /Services/opticians/LeaveReview/DefaultView.aspx?id=OP_5AT_1913__000002_UB81LN,0,0,
Boots-Uxbridge - Market Sq,OP_5AT_6660__000001_UB81LH,OPT,30 Market Square,,,Uxbridge,Middlesex,UB8 1LH,Tel: 01895 254 885, - ,,,1 rating Rate it yourself - /Services/opticians/LeaveReview/DefaultView.aspx?id=OP_5AT_6660__000001_UB81LH,,,
Optical Express,OP_5AT_3746__000001_UB81AQ,OPT,Market House,29 High Street,Uxbridge,,,UB8 1AQ,Tel: 01895 253 779, - ,,,No ratings yet Rate it yourself - /Services/opticians/LeaveReview/DefaultView.aspx?id=OP_5AT_3746__000001_UB81AQ,0,0,
Mills Optometrists,OP_5AT_2743__000001_UB81AB,OPT,16 Windsor Street,Uxbridge,Middlesex,,,UB8 1AB,Tel: 01895 231694, - ,,,1 rating Rate it yourself - /Services/opticians/LeaveReview/DefaultView.aspx?id=OP_5AT_2743__000001_UB81AB,,,
Opticial Express,OP_12345_UB8 1JN,OPT,The Market House,High St,,Uxbridge,Middlesex,UB8 1JN,Tel: 0800 023 2020, - ,,,No ratings yet Rate it yourself - /Services/opticians/LeaveReview/DefaultView.aspx?id=OP_12345_UB8 1JN,0,0,
C R Turner,OP_5AT_9290__000002_UB81JN,OPT,11 High Street,Uxbridge,Middlesex,,,UB8 1JN,Tel: 01895 259110, - ,,,No ratings yet Rate it yourself - /Services/opticians/LeaveReview/DefaultView.aspx?id=OP_5AT_9290__000002_UB81JN,0,0,
Boots-Uxbridge   - Chimes Centre,OP_5AT_14006__000002_UB81GA,OPT,Unit 3,The Chimes Shopping Centre,,Uxbridge,,UB8 1GA,Tel: 01895 814557, - ,,,1 rating Rate it yourself - /Services/opticians/LeaveReview/DefaultView.aspx?id=OP_5AT_14006__000002_UB81GA,,,
Brian D Suttie Chalfont,L8Z0V,OPT,,14 Nightingales Corner,Little Chalfont,Amersham,Buckinghamshire,HP7 9PZ,Tel: 01494 762338, - ,,,No ratings yet Rate it yourself - /Services/opticians/LeaveReview/DefaultView.aspx?id=L8Z0V,0,0,
Boots-Rickmansworth,WD3 1AN_39472,OPT,,103 High Street,,Rickmansworth,Hertfordshire,WD3 1AN,Tel: 01923 777603, - ,,,No ratings yet Rate it yourself - /Services/opticians/LeaveReview/DefaultView.aspx?id=WD3 1AN_39472,0,0,
Windsor House,OP_5GV_8379__000001_WD31BX,OPT,13 Church Street,,Rickmansworth,,,WD3 1BX,Tel: 01923 771404, - ,,,No ratings yet Rate it yourself - /Services/opticians/LeaveReview/DefaultView.aspx?id=OP_5GV_8379__000001_WD31BX,0,0,
Realeyes - The Eye Clinic,OPT_SL14XP_1,OPT,,165 Farnham Road,,Slough,,SL1 4XP,Tel: 01753 915060, - ,,,No ratings yet Rate it yourself - /Services/opticians/LeaveReview/DefaultView.aspx?id=OPT_SL14XP_1,0,0,
AVK I-Care,D-13231,OPT,,15a Swakeleys Road,,Ickenham,,UB10 8DF,Tel: 01895347121, - ,,,No ratings yet Rate it yourself - /Services/opticians/LeaveReview/DefaultView.aspx?id=D-13231,0,0,
One Vision Professional Eyecare,0126643_12082015,OPT,,"37 High Street, Amersham",,Buckinghamshire,,HP7 0DP,Tel: 01494 721421, - ,,,No ratings yet Rate it yourself - /Services/opticians/LeaveReview/DefaultView.aspx?id=0126643_12082015,0,0,
Eyewise Opticians,OP_5AT_10924__000003_UB109PG,OPT,374 Long Lane,Hillingdon,Uxbridge,,,UB10 9PG,Tel: 01895 234563, - ,,,No ratings yet Rate it yourself - /Services/opticians/LeaveReview/DefaultView.aspx?id=OP_5AT_10924__000003_UB109PG,0,0,
Complete Community Care NW London Limited,COMPLETE COMMUNITYCARENWLONDONLIMITED1,OPT,,Unit 8 Shepherd's Court,111 High Street,Burnham,Buckinghamshire,SL1 7JZ,Tel: 01895 521 461, - ,,,No ratings yet Rate it yourself - /Services/opticians/LeaveReview/DefaultView.aspx?id=COMPLETE COMMUNITYCARENWLONDONLIMITED1,0,0,
Realeyes Limited,OP_SL17JP_46732,OPT,,32 High Street,,Burnham,Buckinghamshire,SL1 7JP,Tel: 01628 559000, - ,,,No ratings yet Rate it yourself - /Services/opticians/LeaveReview/DefaultView.aspx?id=OP_SL17JP_46732,0,0,
Walker & Campbell,OP_5G4_1382__000001_SL17JX,OPT,47 High Street,,Burnham,,,SL1 7JX,Tel: 01628 663055, - ,,,1 rating Rate it yourself - /Services/opticians/LeaveReview/DefaultView.aspx?id=OP_5G4_1382__000001_SL17JX,,,
Vision Express,OP_5G2_8065__000002_GU470FD,OPT,Tesco Express,Brunel Way,Wellington Street,Slough,,SL1 1XW,Tel: 01753 306 605, - ,,,No ratings yet Rate it yourself - /Services/opticians/LeaveReview/DefaultView.aspx?id=OP_5G2_8065__000002_GU470FD,0,0,
Vision Express (UK) Ltd,OP_5DM_12118__000001_SL11DD,OPT,33-35 Curzon Mall,Queensmere,Slough,,,SL1 1DD,Tel: 01753 693777, - ,,,No ratings yet Rate it yourself - /Services/opticians/LeaveReview/DefaultView.aspx?id=OP_5DM_12118__000001_SL11DD,0,0,
Thomas H Collison Ltd,OP_5DM_4323__000001_SL11EL,OPT,60 High Street,,Slough,Slough,,SL1 1EL,Tel: 01753 524392, - ,,,No ratings yet Rate it yourself - /Services/opticians/LeaveReview/DefaultView.aspx?id=OP_5DM_4323__000001_SL11EL,0,0,
Spectacle Express,OP_5DM_4198__000001_SL11LD,OPT,1 Observatory Centre,,Slough,,,SL1 1LE,Tel: 01753 517417, - ,,,1 rating Rate it yourself - /Services/opticians/LeaveReview/DefaultView.aspx?id=OP_5DM_4198__000001_SL11LD,,,
Hill Vision,OPT_HP65BX_1,OPT,CrossEyes,53 Hill Avenue,,Amersham,Buckinghamshire,HP6 5BX,Tel: 01494 258586, - ,,,No ratings yet Rate it yourself - /Services/opticians/LeaveReview/DefaultView.aspx?id=OPT_HP65BX_1,0,0,
Valli Opticians Stockport,E1D9Q,OPT,,15 Great Underbank,,Stockport,Greater Manchester,SL1 1LF,Tel: 01614740974, - ,,,No ratings yet Rate it yourself - /Services/opticians/LeaveReview/DefaultView.aspx?id=E1D9Q,0,0,
Boots-Ruislip,OP_5AT_676__000001_HA47AU,OPT,33 High Street,,,Ruislip,Middlesex,HA4 7AU,Tel: 01895 634 234, - ,,,1 rating Rate it yourself - /Services/opticians/LeaveReview/DefaultView.aspx?id=OP_5AT_676__000001_HA47AU,,,
The Eye Centre,OP_SL11PQ_34410,OPT,,1 Church Street,,Slough,,SL1 1PQ,Tel: 01753 691692, - ,,,No ratings yet Rate it yourself - /Services/opticians/LeaveReview/DefaultView.aspx?id=OP_SL11PQ_34410,0,0,
Specsavers Opticians,OP_5DM_660__000001_SL11DB,OPT,194-196 High Street,,Slough,,,SL1 1JS,Tel: 01753 502700, - ,,,No ratings yet Rate it yourself - /Services/opticians/LeaveReview/DefaultView.aspx?id=OP_5DM_660__000001_SL11DB,0,0,
Specsavers (Amersham),,OPT,,51 Sycamore Road,,Amersham,,HP6 5EQ,Tel: 01494 418752, - ,,,N/A - Data not available,,,
Boots Opticians,OP_5G4_1431__000001_HP65EQ,OPT,,69 Sycamore Road,,Amersham,Buckinghamshire,HP6 5EQ,Tel: 01494 728753, - ,,,2 ratings Rate it yourself - /Services/opticians/LeaveReview/DefaultView.aspx?id=OP_5G4_1431__000001_HP65EQ,,,
Specsavers (Amersham),,OPT,,51 Sycamore Road,,Amersham,,HP6 5EQ,Tel: 01494 418752, - ,,,N/A - Data not available,,,
Lamertons,OP_5AT_12378__000001_HA63AD,OPT,65 Green Lane,Northwood,Middlesex,,,HA6 3AD,Tel: 01923 822066, - ,,,No ratings yet Rate it yourself - /Services/opticians/LeaveReview/DefaultView.aspx?id=OP_5AT_12378__000001_HA63AD,0,0,
Chilton Watson Ltd,OP_5G4_14308__000003_HP65DR,OPT,85/87 Sycamore Road,Amersham,,Amersham,,HP6 5EJ,Tel: 01494 721795, - ,,,1 rating Rate it yourself - /Services/opticians/LeaveReview/DefaultView.aspx?id=OP_5G4_14308__000003_HP65DR,,,
Vision Express (UK) Ltd,OP_5AT_6219__000002_HA48LS,OPT,112 High Street,Ruislip,Middlesex,,,HA4 8LS,Tel: 01895 677461, - ,,,No ratings yet Rate it yourself - /Services/opticians/LeaveReview/DefaultView.aspx?id=OP_5AT_6219__000002_HA48LS,0,0,
Specsavers Opticians,OP_5AT_14107__000001_HA48LL,OPT,134 High Street,,Ruislip,Middlesex,,HA4 8LL,Tel: 01895 679750, - ,,,No ratings yet Rate it yourself - /Services/opticians/LeaveReview/DefaultView.aspx?id=OP_5AT_14107__000001_HA48LL,0,0,
Thomas H Collison Ltd,OP_5DM_12922__000002_SL38HJ,OPT,4 Harrow Market,Langley,Slough,LANGLEY,,SL3 8HJ,Tel: 01753 541170, - ,,,No ratings yet Rate it yourself - /Services/opticians/LeaveReview/DefaultView.aspx?id=OP_5DM_12922__000002_SL38HJ,0,0,
Opticiancall (Home Visiting Opticians),OP_HA61HJ_85747,OPT,,24 Knoll Crescent,,Northwood,Middlesex,HA6 1HJ,Tel: 0800 999 3937, - ,,,No ratings yet Rate it yourself - /Services/opticians/LeaveReview/DefaultView.aspx?id=OP_HA61HJ_85747,0,0,
Eye Design Opticians,OP_5AT_8112__000001_HA48LJ,OPT,170 High Street,Ruislip,Middlesex,,,HA4 8LJ,Tel: 01895 621135, - ,,,No ratings yet Rate it yourself - /Services/opticians/LeaveReview/DefaultView.aspx?id=OP_5AT_8112__000001_HA48LJ,0,0,
Ashton Opticians,OL124685G5__000001_HP109LS,OPT,1 Acorn House,12-16 Straight Bit,Flackwell Heath,High Wycombe,Buckinghamshire,HP10 9LS,Tel: 01628 530420, - ,,,1 rating Rate it yourself - /Services/opticians/LeaveReview/DefaultView.aspx?id=OL124685G5__000001_HP109LS,,,
Scrivens Opticians,OP_5G5_11089__000001_SL85SY,OPT,,20-24 The Parade,,Bourne End,Buckinghamshire,SL8 5SY,Tel: 01628 525999, - ,,,No ratings yet Rate it yourself - /Services/opticians/LeaveReview/DefaultView.aspx?id=OP_5G5_11089__000001_SL85SY,0,0,
Asda Opticians,OP_5DM_286__000001_SL19LA,OPT,,Asda Slough Superstore,Telford Drive,Slough,,SL1 9LA,Tel: 01753 894020, - ,,,1 rating Rate it yourself - /Services/opticians/LeaveReview/DefaultView.aspx?id=OP_5DM_286__000001_SL19LA,,,
S H Harrold,OP_5AT_6308__000001_HA61LU,OPT,85 Joel Street,Ryefield Parade,Northwood Hills,Middlesex,,HA6 1LU,Tel: 01923 823027, - ,,,1 rating Rate it yourself - /Services/opticians/LeaveReview/DefaultView.aspx?id=OP_5AT_6308__000001_HA61LU,,,
Kaleyes Opticians,OP_5AT_8491__000001_UB100LR,OPT,7 Marlborough Parade,Uxbridge Road,Hillingdon,Middlesex,,UB10 0LR,Tel: 01895 232113, - ,,,No ratings yet Rate it yourself - /Services/opticians/LeaveReview/DefaultView.aspx?id=OP_5AT_8491__000001_UB100LR,0,0,
Mansons Eyecare,OP_5AT_10107__000001_UB77BE,OPT,166 High Street,Yiewsley,West Drayton,Middlesex,,UB7 7BE,Tel: 01895 435411, - ,,,2 ratings Rate it yourself - /Services/opticians/LeaveReview/DefaultView.aspx?id=OP_5AT_10107__000001_UB77BE,,,
West Drayton Specsavers,CO-5537,OPT,,40 High Street,,West Drayton,,UB7 7DW,Tel: 01895 446 531, - ,,,4 ratings Rate it yourself - /Services/opticians/LeaveReview/DefaultView.aspx?id=CO-5537,,,
S H Harrold Ltd,OP_5AT_8917__000001_UB77LR,OPT,69 Station Road,West Drayton,Middlesex,,,UB7 7LR,Tel: 01895 442140, - ,,,No ratings yet Rate it yourself - /Services/opticians/LeaveReview/DefaultView.aspx?id=OP_5AT_8917__000001_UB77LR,0,0,
First Contact Opticians,OP_5AT_3927__000001_HA51RJ,OPT,126 Field End Road,Eastcote,Pinner,Middlesex,,HA5 1RJ,Tel: 020 8866 4911, - ,,,1 rating Rate it yourself - /Services/opticians/LeaveReview/DefaultView.aspx?id=OP_5AT_3927__000001_HA51RJ,,,
Leith Opticians,OP_5AT_4339__000002_HA51QR,OPT,175 Field End Road,Eastcote,Pinner,Middlesex,,HA5 1QR,Tel: 020 8868 2277, - ,,,No ratings yet Rate it yourself - /Services/opticians/LeaveReview/DefaultView.aspx?id=OP_5AT_4339__000002_HA51QR,0,0,
Crispe Opticians,OP_5AT_12413__000002_HA51QZ,OPT,207 Field End Road,Eastcote,Pinner,Middlesex,,HA5 1QZ,Tel: 020 8866 3998, - ,,,No ratings yet Rate it yourself - /Services/opticians/LeaveReview/DefaultView.aspx?id=OP_5AT_12413__000002_HA51QZ,0,0,
DomEyeCare Ltd,1609141104,OPT,,70 Lowlands Road,,Pinner,,HA5 1TU,Tel: 0208 868 8475, - ,,,No ratings yet Rate it yourself - /Services/opticians/LeaveReview/DefaultView.aspx?id=1609141104,0,0,
The Practice Opticians,OP_5G5_14974__000001_HP157BS,OPT,26 Eastern Dene,Hazlemere,,High Wycombe,Buckinghamshire,HP15 7BS,Tel: 01494 716708, - ,,,No ratings yet Rate it yourself - /Services/opticians/LeaveReview/DefaultView.aspx?id=OP_5G5_14974__000001_HP157BS,0,0,
Boots-Pinner,OP_5K6_12949__000002_HA53JF,OPT,28 Bridge Stree,,,Pinner,Middlesex,HA5 3JF,Tel: 020 8866 5106, - ,,,No ratings yet Rate it yourself - /Services/opticians/LeaveReview/DefaultView.aspx?id=OP_5K6_12949__000002_HA53JF,0,0,
Eyesey Eyecare,5K6- 3034__000006_HA53JF,OPT,,50 Bridge Street,,Pinner,Middlesex,HA5 3JF,Tel: 020 8429 0101, - ,,,No ratings yet Rate it yourself - /Services/opticians/LeaveReview/DefaultView.aspx?id=5K6- 3034__000006_HA53JF,0,0,
Specsavers Opticians,TP9FY,OPT,,36 Bridge Street,,Pinner,,HA5 3JF,, - ,,,No ratings yet Rate it yourself - /Services/opticians/LeaveReview/DefaultView.aspx?id=TP9FY,0,0,
G&G Pinner Optometrists,OP_5K6_14929__000001_HA53JD,OPT,3 Red Lion Parade,Bridge Street,Pinner,Pinner,Middlesex,HA5 3JD,Tel: 020 8866 2620, - ,,,No ratings yet Rate it yourself - /Services/opticians/LeaveReview/DefaultView.aspx?id=OP_5K6_14929__000001_HA53JD,0,0,yes
Insight Opticians (Seemera Ltd t/a),OP_5K6_2521__000001_HA53JE,OPT,6 Bridge Street,Pinner,Middlesex,,,HA5 3JE,Tel: 020 8866 5399, - ,,,No ratings yet Rate it yourself - /Services/opticians/LeaveReview/DefaultView.aspx?id=OP_5K6_2521__000001_HA53JE,0,0,
Icare Opticians,TP8VL,OPT,,6 Barters Walk,,Pinner,,HA5 5LU,, - ,,,No ratings yet Rate it yourself - /Services/opticians/LeaveReview/DefaultView.aspx?id=TP8VL,0,0,
Adams Opticians,OP_5GV_12388__000001_WD197AD,OPT,1 St andrews Road,,Watford,,,WD19 7AD,Tel: 020 8428 5152, - ,,,No ratings yet Rate it yourself - /Services/opticians/LeaveReview/DefaultView.aspx?id=OP_5GV_12388__000001_WD197AD,0,0,
Ultimate Eyewear Company,OP_5G4_14972__000001_HP51BG,OPT,25a The High Street,,Chesham,,,HP5 1BG,Tel: 01494 794466, - ,,,1 rating Rate it yourself - /Services/opticians/LeaveReview/DefaultView.aspx?id=OP_5G4_14972__000001_HP51BG,,,
Specsavers Opticians,OP_5QD_0115899__000002_HP51BG,OPT,9 High Street,,Chesham,Buckinghamshire,,HP5 1BG,Tel: 01494 777190, - ,,,No ratings yet Rate it yourself - /Services/opticians/LeaveReview/DefaultView.aspx?id=OP_5QD_0115899__000002_HP51BG,0,0,
Turner and Browning Opticians,OP_5G4_188__000002_HP51EP,OPT,4 High Street,,Chesham,,,HP5 1EP,Tel: 01494 782957, - ,,,No ratings yet Rate it yourself - /Services/opticians/LeaveReview/DefaultView.aspx?id=OP_5G4_188__000002_HP51EP,0,0,
Boots-Chesham,OLCO32345QD__000003_HP51EP,OPT,18 High Street,,,Chesham,Buckinghamshire,HP5 1EP,Tel: 01494 793498, - ,,,No ratings yet Rate it yourself - /Services/opticians/LeaveReview/DefaultView.aspx?id=OLCO32345QD__000003_HP51EP,0,0,
Boots-Windsor - Peascod St,TP4QA,OPT,119 Peascod Street,,,Windsor,Berkshire,SL4 1DW,Tel: 01753 867041, - ,,,No ratings yet Rate it yourself - /Services/opticians/LeaveReview/DefaultView.aspx?id=TP4QA,0,0,
Vision Express,OP_5QG_12112__000001_SL41TF,OPT,16 King Edward Court,Windsor,,Berkshire,,SL4 1TF,Tel: 01753 850550, - ,,,No ratings yet Rate it yourself - /Services/opticians/LeaveReview/DefaultView.aspx?id=OP_5QG_12112__000001_SL41TF,0,0,yes
Leightons Eye Windsor,OP_SL41DE_34402,OPT,,45 Peascod Street,,Windsor,Berkshire,SL4 1DE,Tel: 01753 336124, - ,,,No ratings yet Rate it yourself - /Services/opticians/LeaveReview/DefaultView.aspx?id=OP_SL41DE_34402,0,0,
Specsavers Optician,OP_SL41DE_46578,OPT,Specsavers Optician,59 Peascod Street,,Windsor,Berkshire,SL4 1DE,Tel: 01753 410970, - ,,,No ratings yet Rate it yourself - /Services/opticians/LeaveReview/DefaultView.aspx?id=OP_SL41DE_46578,0,0,
Hayes Eye Clinic,OP_5AT_9391__000002_UB40RS,OPT,814a Uxbridge Road,,Middlesex,Hayes,,UB4 0RS,Tel: 020 8561 1625, - ,,,13 ratings Rate it yourself - /Services/opticians/LeaveReview/DefaultView.aspx?id=OP_5AT_9391__000002_UB40RS,,,
J B Richards,OP_5GV_155__000001_WD18EH,OPT,20 Vicarage Road,,,Watford,Hertfordshire,WD18 0EH,Tel: 01923 227858, - ,,,No ratings yet Rate it yourself - /Services/opticians/LeaveReview/DefaultView.aspx?id=OP_5GV_155__000001_WD18EH,0,0,
Hatch End Eyecare,01-22088,OPT,Hatch End Eyecare,394 Uxbridge Road,,Pinner,,HA5 4HP,Tel: 020 8428 0025, - ,,,2 ratings Rate it yourself - /Services/opticians/LeaveReview/DefaultView.aspx?id=01-22088,,,yes
The Eyecare Studio (Lucrative Business Ltd T/A),OP_5K6_9376__000001_HA54JR,OPT,439 Uxbridge Road,Pinner,Middlesex,,,HA5 4JR,Tel: 020 8421 2277, - ,,,No ratings yet Rate it yourself - /Services/opticians/LeaveReview/DefaultView.aspx?id=OP_5K6_9376__000001_HA54JR,0,0,
Brian D Suttie (Chesham) Ltd,OP_5G4_3082__000001_HP53DX,OPT,44 Broad Street,,Chesham,,,HP5 3DX,Tel: 01494 784141, - ,,,1 rating Rate it yourself - /Services/opticians/LeaveReview/DefaultView.aspx?id=OP_5G4_3082__000001_HP53DX,,,
Day Lewis Opticians ,OP_5K6_2305__000002_HA55LU,OPT,6 Barters Walk,,Pinner,,,HA5 4LU,Tel: 0208 868 2597, - ,,,No ratings yet Rate it yourself - /Services/opticians/LeaveReview/DefaultView.aspx?id=OP_5K6_2305__000002_HA55LU,0,0,
Gardener & Basson Opticians,OP_5GV_6820__000001_WD17HE,OPT,11 Rickmansworth Road,,Watford,,,WD18 0JE,Tel: 01923 225370, - ,,,1 rating Rate it yourself - /Services/opticians/LeaveReview/DefaultView.aspx?id=OP_5GV_6820__000001_WD17HE,,,
David Williams ,HP11 1BA_22222,OPT,,7 Queen Victoria Road,,High Wycombe,,HP11 1BA,Tel: 01494 443448, - ,,,1 rating Rate it yourself - /Services/opticians/LeaveReview/DefaultView.aspx?id=HP11 1BA_22222,,,
Vision Express,TP79L,OPT,,47 High Street,Nicholson Centre,Maidenhead,Berkshire,SL6 1QB,Tel: 01628 781180, - ,,,No ratings yet Rate it yourself - /Services/opticians/LeaveReview/DefaultView.aspx?id=TP79L,0,0,
Home Health Clinic,HOMEHEALTHCLINIC1,OPT,,"2 Thorndyke Court, Westfield Park",,Pinner,Middlesex,HA5 4JG,Tel: 020 8428 4068, - ,,,No ratings yet Rate it yourself - /Services/opticians/LeaveReview/DefaultView.aspx?id=HOMEHEALTHCLINIC1,0,0,
Boots-Watford - High St,OP_5GV_9374__000001_WD12BS,OPT,78 High Street,,,Watford,Hertfordshire,WD17 2BP,Tel: 01923 229867, - ,,,No ratings yet Rate it yourself - /Services/opticians/LeaveReview/DefaultView.aspx?id=OP_5GV_9374__000001_WD12BS,0,0,
Weston Opticians Ltd,OP_5GV_8021__000001_WD12BP,OPT,82a High Street,,Watford,,,WD17 2BP,Tel: 01923 241100, - ,,,4 ratings Rate it yourself - /Services/opticians/LeaveReview/DefaultView.aspx?id=OP_5GV_8021__000001_WD12BP,,,
Specsaversn Opticians,OP_5GV_1247__000002_WD12RS,OPT,86-88 High Street,Watford,Hertfordshire,,,WD17 2GP,Tel: 01923 228888, - ,,,No ratings yet Rate it yourself - /Services/opticians/LeaveReview/DefaultView.aspx?id=OP_5GV_1247__000002_WD12RS,0,0,
Barnett Opticians,OP_5K6_14961__000001_HA55EN,OPT,367 Rayners Lane,,,Pinner,Middlesex,HA5 5EN,Tel: 020 8868 3003, - ,,,No ratings yet Rate it yourself - /Services/opticians/LeaveReview/DefaultView.aspx?id=OP_5K6_14961__000001_HA55EN,0,0,
Optico Opticians,OP_5G3_5994__000002_SL61PY,OPT,Optico Opticians,80 High Street,,Maidenhead,Berkshire,SL6 1PY,Tel: 01628 770607, - ,,,No ratings yet Rate it yourself - /Services/opticians/LeaveReview/DefaultView.aspx?id=OP_5G3_5994__000002_SL61PY,0,0,
Boots-Maidenhead - High St,OP_5G3_564__000003_SL61PY,OPT,,54/58 High Street,Maidenhead,Maidenhead,,SL6 1PY,Tel: 01628 674545, - ,,,1 rating Rate it yourself - /Services/opticians/LeaveReview/DefaultView.aspx?id=OP_5G3_564__000003_SL61PY,,,
Boots-Maidenhead - High St (in Boots UK),OP_5G3_2047__000004_SL61PY,OPT,54-58 High Street,,,Maidenhead,Berkshire,SL6 1PY,Tel: 01628 782880, - ,,,2 ratings Rate it yourself - /Services/opticians/LeaveReview/DefaultView.aspx?id=OP_5G3_2047__000004_SL61PY,,,
New Vision,OP_5K6_4098__000001_HA29SE,OPT,431 Alexandra Avenue,,Harrow,,,HA2 9SE,Tel: 0208 429 3641, - ,,,6 ratings Rate it yourself - /Services/opticians/LeaveReview/DefaultView.aspx?id=OP_5K6_4098__000001_HA29SE,,,
Insight Opticians,OP_SL61EF_34403,OPT,,91A High Street,,Maidenhead,,SL6 1JX,Tel: 01628 671908, - ,,,No ratings yet Rate it yourself - /Services/opticians/LeaveReview/DefaultView.aspx?id=OP_SL61EF_34403,0,0,
Specsavers Opticians,OP_5G3_7069__000002_SL61JX,OPT,85 High Street,Maidenhead,Berkshire,,,SL6 1JX,Tel: 01628 777 220, - ,,,No ratings yet Rate it yourself - /Services/opticians/LeaveReview/DefaultView.aspx?id=OP_5G3_7069__000002_SL61JX,0,0,
Scrivens Opticians,OP_5G3_13127__000001_SL61JX,OPT,Scrivens Opticians,79 High Street,,Maidenhead,,SL6 1JX,Tel: 01628 624632, - ,,,No ratings yet Rate it yourself - /Services/opticians/LeaveReview/DefaultView.aspx?id=OP_5G3_13127__000001_SL61JX,0,0,
David Clulow (Opticians) Ltd,OP_5GV_7325__000001_WD12TQ,OPT,172 The Harlequin,,Watford,,,WD17 2TQ,Tel: 01923 222395, - ,,,No ratings yet Rate it yourself - /Services/opticians/LeaveReview/DefaultView.aspx?id=OP_5GV_7325__000001_WD12TQ,0,0,