Organisation Name,NACS Code,Organisation Type,Address1,Address2,Address3,Address4,Address5,PostCode,Telephone Number,Opening time,Value  (Opening time),Banding Classification  (Opening time),NHS.UK users rating,Value  (NHS.UK users rating),Banding Classification  (NHS.UK users rating),Car parking (Is there car parking at this organisation?)
Allders Opticians,OP_5GH_3148__000001_SG76BG,OPT,31 High Street,,Baldock,,,SG7 6BG,Tel: 01462 893330, - ,,,No ratings yet Rate it yourself - /Services/opticians/LeaveReview/DefaultView.aspx?id=OP_5GH_3148__000001_SG76BG,0,0,
Tesco Opticians,SG7 6BN,OPT,,58 High St,,Baldock,,SG7 6BN,Tel: 0345 601 3479, - ,,,No ratings yet Rate it yourself - /Services/opticians/LeaveReview/DefaultView.aspx?id=SG7 6BN,0,0,
Paul Adler Optometrist,OP_5GE_9849__000001_SG54LL,OPT,50 High Street,,Stotfold,Herts,,SG5 4LL,Tel: 01462 732393, - ,,,No ratings yet Rate it yourself - /Services/opticians/LeaveReview/DefaultView.aspx?id=OP_5GE_9849__000001_SG54LL,0,0,
Andrew Merry ,OP_5GH_3629__000001_SG63ED,OPT,29 Leys Avenue,,Letchworth,,,SG6 3ED,Tel: 01462 486123, - ,,,No ratings yet Rate it yourself - /Services/opticians/LeaveReview/DefaultView.aspx?id=OP_5GH_3629__000001_SG63ED,0,0,
Vision Care,OP_5GH_9362__000001_SG63EA,OPT,1 Leys Avenue,,Letchworth,,,SG6 3EA,Tel: 01462 684338, - ,,,No ratings yet Rate it yourself - /Services/opticians/LeaveReview/DefaultView.aspx?id=OP_5GH_9362__000001_SG63EA,0,0,
Boots-Letchworth,CO-4090,OPT,19 Commerce Way,,,Letchworth Garden City,Hertfordshire,SG6 3DN,Tel: 01462 681805, - ,,,No ratings yet Rate it yourself - /Services/opticians/LeaveReview/DefaultView.aspx?id=CO-4090,0,0,
Allders Opticians,OP_5GK_10408__000001_SG90DX,OPT,15 Eastcheap,,Letchworth,,,SG6 3DA,Tel: 01462 673216, - ,,,No ratings yet Rate it yourself - /Services/opticians/LeaveReview/DefaultView.aspx?id=OP_5GK_10408__000001_SG90DX,0,0,
David Stern Opticians ,OP_5GH_8540__000001_SG63BY,OPT,10 Arena Parade,,Letchworth,,,SG6 3BY,Tel: 01462 683045, - ,,,No ratings yet Rate it yourself - /Services/opticians/LeaveReview/DefaultView.aspx?id=OP_5GH_8540__000001_SG63BY,0,0,
Boots Opticians,13102016HBNHSENGLAND,OPT,,Unit B Biggleswade Shopping Centre,london road,Biggleswade,Bedfordshire,SG18 8PS,Tel: 01767317910, - ,,,1 rating Rate it yourself - /Services/opticians/LeaveReview/DefaultView.aspx?id=13102016HBNHSENGLAND,,,
Scrivens Optical & Hearing Care,OP_5GK_5479__000001_SG89AW,OPT,,42A High Street,,Royston,Hertfordshire,SG8 9AW,Tel: 01763 243050, - ,,,1 rating Rate it yourself - /Services/opticians/LeaveReview/DefaultView.aspx?id=OP_5GK_5479__000001_SG89AW,,,
E.H. Howes Opticians,OP_5GK_10929__000001_SG89AA,OPT,33/35 High Street,,Royston,,,SG8 9AA,Tel: 01763 243132, - ,,,No ratings yet Rate it yourself - /Services/opticians/LeaveReview/DefaultView.aspx?id=OP_5GK_10929__000001_SG89AA,0,0,
Clear Vision Direct,OP_5GE_20__000001_SG18OLJ,OPT,,54-56 High Street,,Biggleswade,Bedfordshire,SG18 0LJ,Tel: 01767 313631, - ,,,No ratings yet Rate it yourself - /Services/opticians/LeaveReview/DefaultView.aspx?id=OP_5GE_20__000001_SG18OLJ,0,0,
Allders Opticians,OP_5GE_8894__000001_SG188AX,OPT,,39 High Street,,Biggleswade,Bedfordshire,SG18 0JH,Tel: 01767 313258, - ,,,No ratings yet Rate it yourself - /Services/opticians/LeaveReview/DefaultView.aspx?id=OP_5GE_8894__000001_SG188AX,0,0,
S H Harrold Ltd,OP_5GE_8920__000001_SG188AQ,OPT,29a Market Square,,Biggleswade,Beds,,SG18 8AQ,Tel: 01767 313490, - ,,,No ratings yet Rate it yourself - /Services/opticians/LeaveReview/DefaultView.aspx?id=OP_5GE_8920__000001_SG188AQ,0,0,
Biggleswade Bells Brook Specsavers Limited,Z2Y9Z,OPT,,Sainsbury's Bells Brook,Bells Brook,Biggleswade,Bedfordshire,SG18 0NA,Tel: 01767 669377, - ,,,No ratings yet Rate it yourself - /Services/opticians/LeaveReview/DefaultView.aspx?id=Z2Y9Z,0,0,
Allders Opticians ,OP_5GH_5128__000001_SG51BT,OPT,15 Hermitage Road,,Hitchin,,,SG5 1BT,Tel: 01462 450549, - ,,,No ratings yet Rate it yourself - /Services/opticians/LeaveReview/DefaultView.aspx?id=OP_5GH_5128__000001_SG51BT,0,0,
Vision Care,OP_5GH_700__000001_SG51JQ,OPT,3 Bancroft,Hitchin,Hertfordshire,,,SG5 1JQ,Tel: 01462 434888, - ,,,No ratings yet Rate it yourself - /Services/opticians/LeaveReview/DefaultView.aspx?id=OP_5GH_700__000001_SG51JQ,0,0,
Specsavers Opticians,OP_5GH_8355__000001_SG51DN,OPT,27 High Street,,Hitchin,,,SG5 1AT,Tel: 01462 422255, - ,,,No ratings yet Rate it yourself - /Services/opticians/LeaveReview/DefaultView.aspx?id=OP_5GH_8355__000001_SG51DN,0,0,
Boots-Hitchin,OP_5GH_6033__000001_SG51AT,OPT,22 High Street,,,Hitchin,Hertfordshire,SG5 1AT,Tel: 01462 432196, - ,,,5 ratings Rate it yourself - /Services/opticians/LeaveReview/DefaultView.aspx?id=OP_5GH_6033__000001_SG51AT,,,
Shephard & Akay Optometrists,OP_5GH_7550__000001_SG51HR,OPT,,5 Churchyard,,Hitchin,Hertfordshire,SG5 1HR,Tel: 01462 432088, - ,,,No ratings yet Rate it yourself - /Services/opticians/LeaveReview/DefaultView.aspx?id=OP_5GH_7550__000001_SG51HR,0,0,
Stephen Hing Opticians,OP_5GE_7326__000001_SG175AE,OPT,14a Clifton Road,,Shefford,Beds,,SG17 5AE,Tel: 01462 811852, - ,,,No ratings yet Rate it yourself - /Services/opticians/LeaveReview/DefaultView.aspx?id=OP_5GE_7326__000001_SG175AE,0,0,
Christopher's Opticians  ,OP_5GH_3618__000001_SG20DL,OPT,21 The Glebe,,Stevenage,,,SG2 0DL,Tel: 01438 314538, - ,,,No ratings yet Rate it yourself - /Services/opticians/LeaveReview/DefaultView.aspx?id=OP_5GH_3618__000001_SG20DL,0,0,
J.Oliver Radley Opticians Ltd,OP_5P3_11322__000001_SG99AQ,OPT,36 High Street,Buntingford,Hertfordshire,,,SG9 9AQ,Tel: 01763 273300, - ,,,11 ratings Rate it yourself - /Services/opticians/LeaveReview/DefaultView.aspx?id=OP_5P3_11322__000001_SG99AQ,,,
Dollond & Aitchison,OP_5GH_4998__000003_SG11ES,OPT,The Forum Centre,The Forum,Stevenage,Hertfordshire,,SG1 1ES,Tel: 01438 364656, - ,,,No ratings yet Rate it yourself - /Services/opticians/LeaveReview/DefaultView.aspx?id=OP_5GH_4998__000003_SG11ES,0,0,
GPC Opticians,OP_5GH_7785__000001_SG11EE,OPT,22 The Forum,,Stevenage,,,SG1 1EH,Tel: 01438 364168, - ,,,No ratings yet Rate it yourself - /Services/opticians/LeaveReview/DefaultView.aspx?id=OP_5GH_7785__000001_SG11EE,0,0,
Specsavers Opticians,OP_5GH_7474__000001_SG11EG,OPT,90 Queensway,,Stevenage,,,SG1 1EG,Tel: 01438 748900, - ,,,No ratings yet Rate it yourself - /Services/opticians/LeaveReview/DefaultView.aspx?id=OP_5GH_7474__000001_SG11EG,0,0,
Boots-Stevenage - Queenway,OP_5GH_6024__000001_SG11BS,OPT,35 Queensway,,,Stevenage,Hertfordshire,SG1 1DN,Tel: 01438 312263, - ,,,1 rating Rate it yourself - /Services/opticians/LeaveReview/DefaultView.aspx?id=OP_5GH_6024__000001_SG11BS,,,
Asda Opticians,OP_SG11LA_30695,OPT,,Monkswood Way,,Stevenage,,SG1 1LA,Tel: 01438 744912, - ,,,No ratings yet Rate it yourself - /Services/opticians/LeaveReview/DefaultView.aspx?id=OP_SG11LA_30695,0,0,
M&S Opticians,D7F2F,OPT,,5 Roaring Meg Retail Park,,Stevenage,,SG1 1XN,Tel: 01438576301, - ,,,No ratings yet Rate it yourself - /Services/opticians/LeaveReview/DefaultView.aspx?id=D7F2F,0,0,
Allders Opticians,OP_5GE_7300__000001_SG191JA,OPT,21 Market Square,,Sandy,Beds,,SG19 1JA,Tel: 01767 680675, - ,,,1 rating Rate it yourself - /Services/opticians/LeaveReview/DefaultView.aspx?id=OP_5GE_7300__000001_SG191JA,,,
Christopher's Opticians,5GH_02012006__000002_SG36AP,OPT,7a Station Road,,Knebworth,Hertfordshire,,SG3 6AP,Tel: 01438 816306, - ,,,No ratings yet Rate it yourself - /Services/opticians/LeaveReview/DefaultView.aspx?id=5GH_02012006__000002_SG36AP,0,0,
Allders Opticians,OP_5GE_5127__000003_MK454LL,OPT,79 Bedford Road,,Barton-le-Clay,Beds,,MK45 4LL,Tel: 01582 881478, - ,,,No ratings yet Rate it yourself - /Services/opticians/LeaveReview/DefaultView.aspx?id=OP_5GE_5127__000003_MK454LL,0,0,
A Domi Care,001 PE19,OPT,,53 Bevington Way,,Eynesbury St Neots,,PE19 2HQ,, - ,,,No ratings yet Rate it yourself - /Services/opticians/LeaveReview/DefaultView.aspx?id=001 PE19,0,0,
Allders Opticians,OP_5GE_23__000004_MK452PJ,OPT,17 Bedford Street,,Ampthill,Beds,,MK45 2LU,Tel: 01525 403647, - ,,,No ratings yet Rate it yourself - /Services/opticians/LeaveReview/DefaultView.aspx?id=OP_5GE_23__000004_MK452PJ,0,0,
Tesco Opticians St Neots,CO-1998_12082015,OPT,,"Barford Road, St. Neots",,Huntingdon,,PE19 2SA,Tel: 0345 601 3479, - ,,,No ratings yet Rate it yourself - /Services/opticians/LeaveReview/DefaultView.aspx?id=CO-1998_12082015,0,0,yes
Allders Opticians,OP_5GE_8382__000001_MK451DP,OPT,4a Station Square,,Flitwick,Beds,,MK45 1DP,Tel: 01525 712864, - ,,,No ratings yet Rate it yourself - /Services/opticians/LeaveReview/DefaultView.aspx?id=OP_5GE_8382__000001_MK451DP,0,0,
Ideal Eyewear Ltd,D-2705 ,OPT,,"Unit 3 Highfield House,",110 The Hawthorns,Flitwick,Bedfordshire,MK45 1FN,Tel: 01525715759, - ,,,No ratings yet Rate it yourself - /Services/opticians/LeaveReview/DefaultView.aspx?id=D-2705,0,0,
Kanzaria Opticians,OP_5GC_12944__000002_LU33SR,OPT,Purley Centre,Marsh Farm,Luton,Beds,,LU3 3SR,Tel: 01582 580310, - ,,,No ratings yet Rate it yourself - /Services/opticians/LeaveReview/DefaultView.aspx?id=OP_5GC_12944__000002_LU33SR,0,0,
S H Harrold Ltd,OP_5GE_22__000003_MK451AJ,OPT,2 Steppingley Road,,Flitwick,Beds,,MK45 1AJ,Tel: 01525 714767, - ,,,No ratings yet Rate it yourself - /Services/opticians/LeaveReview/DefaultView.aspx?id=OP_5GE_22__000003_MK451AJ,0,0,
Luton Optical Centre,OP_5GC_16__000001_LU12TA,OPT,32 Market Hall,The Arndale Centre,Luton,Beds,,LU1 2TA,Tel: 01582 402773, - ,,,1 rating Rate it yourself - /Services/opticians/LeaveReview/DefaultView.aspx?id=OP_5GC_16__000001_LU12TA,,,
iCareCentre Opticians,OP_5GC_489__000003_LU12TJ,OPT,Unit 16 The Mall,,,Luton,Bedfordshire,LU1 2TE,Tel: 01582 728731, - ,,,1 rating Rate it yourself - /Services/opticians/LeaveReview/DefaultView.aspx?id=OP_5GC_489__000003_LU12TJ,,,
Luton Vision Express,OP_5GC_12947__000004_LU12TJ,OPT,,94 The Mall,,Luton,Bedfordshire,LU1 2TQ,Tel: 01582 417417, - ,,,1 rating Rate it yourself - /Services/opticians/LeaveReview/DefaultView.aspx?id=OP_5GC_12947__000004_LU12TJ,,,
Boots-Luton - Arndale Centre (in Boots UK),OP_5GC_4768__000002_LU12BG,OPT,82-86 The Arndale Centre,,Luton,Beds,,LU1 2BG,Tel: 01582 424730, - ,,,3 ratings Rate it yourself - /Services/opticians/LeaveReview/DefaultView.aspx?id=OP_5GC_4768__000002_LU12BG,,,
Brown & White Opticians,OP_5GC_6142__000001_LU12RD,OPT,,172 The Mall,,Luton,Bedfordshire,LU1 2TL,Tel: 01582 720106, - ,,,No ratings yet Rate it yourself - /Services/opticians/LeaveReview/DefaultView.aspx?id=OP_5GC_6142__000001_LU12RD,0,0,
Specsavers Opticians,OP_5GC_12037__000001_LU12AX,OPT,26 George Street,,Luton,Beds,,LU1 2AX,Tel: 01582 484300, - ,,,No ratings yet Rate it yourself - /Services/opticians/LeaveReview/DefaultView.aspx?id=OP_5GC_12037__000001_LU12AX,0,0,
Direkt Optik,OP_5GC___000002_LU12AA,OPT,3-5 George Street,,Luton,Beds,,LU1 2AA,Tel: 01582 455513, - ,,,No ratings yet Rate it yourself - /Services/opticians/LeaveReview/DefaultView.aspx?id=OP_5GC___000002_LU12AA,0,0,
Elcott Opticians,OP_5GC__000001_LU12AF,OPT,Elcott Opticians,19 George Street,,Luton,Bedfordshire,LU1 2AF,Tel: 01582 415379, - ,,,No ratings yet Rate it yourself - /Services/opticians/LeaveReview/DefaultView.aspx?id=OP_5GC__000001_LU12AF,0,0,
Kanzaria Opticians,OP_5GC_2101__000003_LU11EH,OPT,104 Dunstable Road,,Luton,Beds,,LU1 1EW,Tel: 01582 480776, - ,,,No ratings yet Rate it yourself - /Services/opticians/LeaveReview/DefaultView.aspx?id=OP_5GC_2101__000003_LU11EH,0,0,
Allders Opticians,OP_5GC_10407__000002_LU11EH,OPT,88 Dunstable Road,,Luton,Beds,,LU1 1EH,Tel: 01582 725136, - ,,,No ratings yet Rate it yourself - /Services/opticians/LeaveReview/DefaultView.aspx?id=OP_5GC_10407__000002_LU11EH,0,0,
Kanzaria Opticians,OP_5GC_180__000001_LU32QL,OPT,180 Marsh Road,,Luton,Beds,,LU3 2QL,Tel: 01582 575886, - ,,,1 rating Rate it yourself - /Services/opticians/LeaveReview/DefaultView.aspx?id=OP_5GC_180__000001_LU32QL,,,
S Robinson,OP-5GC__000004_LU32NJ,OPT,70 Marsh Road,,Luton,Beds,,LU3 2NJ,Tel: 01582 503616, - ,,,No ratings yet Rate it yourself - /Services/opticians/LeaveReview/DefaultView.aspx?id=OP-5GC__000004_LU32NJ,0,0,
Adlam & Coomber,OP_5GF_12752__000001_PE192BP,OPT,14 Brook Street,,,St. Neots,Cambridgeshire,PE19 2BP,Tel: 01480 472051, - ,,,No ratings yet Rate it yourself - /Services/opticians/LeaveReview/DefaultView.aspx?id=OP_5GF_12752__000001_PE192BP,0,0,
P G Allder Opticians,OP_5GF_10406__000001_PE192BW,OPT,9 South Street,St. Neots,Cambridgeshire,,,PE19 2BW,Tel: 01480 477479, - ,,,No ratings yet Rate it yourself - /Services/opticians/LeaveReview/DefaultView.aspx?id=OP_5GF_10406__000001_PE192BW,0,0,
Boots-St Neots,OP_5GF_7174__000001_PE191BU,OPT,29-31 High Street,,,St Neots,Cambridgeshire,PE19 1BU,Tel: 01480 210699, - ,,,1 rating Rate it yourself - /Services/opticians/LeaveReview/DefaultView.aspx?id=OP_5GF_7174__000001_PE191BU,,,
Specsavers Opticians,OP_5GF_12755__000002_PE191BU,OPT,13 High Street,,St Neots,Cambridgeshire,,PE19 1BU,Tel: 01480 210820, - ,,,No ratings yet Rate it yourself - /Services/opticians/LeaveReview/DefaultView.aspx?id=OP_5GF_12755__000002_PE191BU,0,0,
Westgate Optical,OP_5GF_5868__000001_PE191BT,OPT,Westgate Department Store 57 High Street,St. Neots,Cambridgeshire,,,PE19 1BT,Tel: 01480 475308, - ,,,No ratings yet Rate it yourself - /Services/opticians/LeaveReview/DefaultView.aspx?id=OP_5GF_5868__000001_PE191BT,0,0,
John Kaye Optometrist,OP_5GD10215__000001_MK418HF,OPT,8 Library Walk,,Bedford,,,MK41 8HF,Tel: 01234 325060, - ,,,28 ratings Rate it yourself - /Services/opticians/LeaveReview/DefaultView.aspx?id=OP_5GD10215__000001_MK418HF,,,
I Kara,OP_5GC_12948__000001_LU33BH,OPT,8 The Parade,Sundon Park,,Luton,,LU3 3BH,Tel: 01582 571731, - ,,,No ratings yet Rate it yourself - /Services/opticians/LeaveReview/DefaultView.aspx?id=OP_5GC_12948__000001_LU33BH,0,0,
Allders Opticians,OP_5GD_10844__000001_MK401RY,OPT,49 High Street,,Bedford,,,MK40 1RY,Tel: 01234 344866, - ,,,No ratings yet Rate it yourself - /Services/opticians/LeaveReview/DefaultView.aspx?id=OP_5GD_10844__000001_MK401RY,0,0,
Humphriss & Burgess,OP_5GD_2276__000001_MK403HD,OPT,28a Mill Street,,,Bedford,,MK40 3HD,Tel: 01234 354343, - ,,,No ratings yet Rate it yourself - /Services/opticians/LeaveReview/DefaultView.aspx?id=OP_5GD_2276__000001_MK403HD,0,0,
C & A Hurst Opticians,OP_5GF_12754__000001_PE195HN,OPT,359 Great North Road Eaton Socon,St. Neots,Cambridgeshire,,,PE19 7HN,Tel: 01480 406002, - ,,,No ratings yet Rate it yourself - /Services/opticians/LeaveReview/DefaultView.aspx?id=OP_5GF_12754__000001_PE195HN,0,0,
Homesight,OP_5P2_42__000001_MK402PJ,OPT,1 Pemberley Lane,1 Pemberley Lane,Bedford,Bedford,Bedfordshire,MK40 2PJ,Tel: 07772 981725, - ,,,No ratings yet Rate it yourself - /Services/opticians/LeaveReview/DefaultView.aspx?id=OP_5P2_42__000001_MK402PJ,0,0,
Alan Brunker,OP_5GD_1__000001_MK402NP,OPT,25 St Peter's Street,,Bedford,,,MK40 2PN,Tel: 01234 353410, - ,,,No ratings yet Rate it yourself - /Services/opticians/LeaveReview/DefaultView.aspx?id=OP_5GD_1__000001_MK402NP,0,0,
Boots-Welwyn Garden City - Howard Gate,AL8 6PU_19283,OPT,,38-40 Howards Gate,,Welwyn Garden City,Hertfordshire,AL8 6PU,Tel: 01707 327 130, - ,,,No ratings yet Rate it yourself - /Services/opticians/LeaveReview/DefaultView.aspx?id=AL8 6PU_19283,0,0,
Scrivens Opticians,OP_5GG_11792__000001_AL86AP,OPT,,47 Howardsgate,,Welwyn Garden City,,AL8 6AP,Tel: 01707 330077, - ,,,No ratings yet Rate it yourself - /Services/opticians/LeaveReview/DefaultView.aspx?id=OP_5GG_11792__000001_AL86AP,0,0,
Vision Express Opticians Ltd - Welwyn Garden City,,OPT,, 61 Howardsgate ,,Welwyn Garden City,,AL8 6BB,, - ,,,N/A - Data not available,,,
Vision Express Welwyn Garden City,TP9K6,OPT,,61 Howardsgate,,Herts,,AL8 6BB,, - ,,,No ratings yet Rate it yourself - /Services/opticians/LeaveReview/DefaultView.aspx?id=TP9K6,0,0,
Boots-Bedford - Harper Centre,OP_5GD_2980__000002_MK401TN,OPT,33-37 Harpur Centre,,,Bedford,Bedfordshire,MK40 1TN,Tel: 01234 219153, - ,,,No ratings yet Rate it yourself - /Services/opticians/LeaveReview/DefaultView.aspx?id=OP_5GD_2980__000002_MK401TN,0,0,
Donne & Browning Opticians,OP_5GD_2__000001_MK401NS,OPT,,3-4 The Arcade,,Bedford,Bedfordshire,MK40 1NS,Tel: 01234 349933, - ,,,No ratings yet Rate it yourself - /Services/opticians/LeaveReview/DefaultView.aspx?id=OP_5GD_2__000001_MK401NS,0,0,
Specsavers Opticians,OP_5GD_4520__000001_MK401PS,OPT,Unit 1,47 -51 The Harpur Centre,,Bedford,,MK40 1TP,Tel: 01234 348944, - ,,,No ratings yet Rate it yourself - /Services/opticians/LeaveReview/DefaultView.aspx?id=OP_5GD_4520__000001_MK401PS,0,0,
Boots-Welwyn Garden City - Howard Centre,OP_5GG_1231__000002_AL86HA,OPT,15 The Howard Centre,Howardsgate,,Welwyn Garden City,Hertfordshire,AL8 6HA,Tel: 01707 322495, - ,,,1 rating Rate it yourself - /Services/opticians/LeaveReview/DefaultView.aspx?id=OP_5GG_1231__000002_AL86HA,,,
Bayfields Opticians,OP_5GG_6847__000001_AL86HA,OPT,39 The Howard Centre,Howardsgate,Welwyn Garden City,Hertfordshire,,AL8 6HA,Tel: 01707 392919, - ,,,7 ratings Rate it yourself - /Services/opticians/LeaveReview/DefaultView.aspx?id=OP_5GG_6847__000001_AL86HA,,,
Vision Express (UK) Ltd,OP_5GD_431__000001_MK401TG,OPT,26 The Harpur Centre,,Bedford,,,MK40 1TG,Tel: 01234 347344, - ,,,No ratings yet Rate it yourself - /Services/opticians/LeaveReview/DefaultView.aspx?id=OP_5GD_431__000001_MK401TG,0,0,
Jeremy Solomon Opticians,OP_5GG_11321__000001_AL86BP,OPT,,62 Howardsgate,,Welwyn Garden City,,AL8 6BP,Tel: 01707 334455, - ,,,1 rating Rate it yourself - /Services/opticians/LeaveReview/DefaultView.aspx?id=OP_5GG_11321__000001_AL86BP,,,
Dollond & Aitchison ,OP_5GG_8026__000001_AL86PW,OPT,24 Church Road,Welwyn Garden City,Hertfordshire,,,AL8 6PW,Tel: 01707 327130, - ,,,No ratings yet Rate it yourself - /Services/opticians/LeaveReview/DefaultView.aspx?id=OP_5GG_8026__000001_AL86PW,0,0,
Ernest Aves & Partners,OP_5GJ_10894__000002_SG129AD,OPT,61 High Street,,Ware,,,SG12 9AD,Tel: 01920 462751, - ,,,No ratings yet Rate it yourself - /Services/opticians/LeaveReview/DefaultView.aspx?id=OP_5GJ_10894__000002_SG129AD,0,0,
Eye Deal Opticians,OP_5GJ_10215__000001_SG129BP,OPT,5 High Street,,Ware,,,SG12 9BP,Tel: 01920 460866, - ,,,No ratings yet Rate it yourself - /Services/opticians/LeaveReview/DefaultView.aspx?id=OP_5GJ_10215__000001_SG129BP,0,0,
Chis Archbold Optometrist,OP_5GD_3122__000001_MK428BH,OPT,158 Bedford Road,Kempston,Bedford,,,MK42 8BH,Tel: 01234 855822, - ,,,No ratings yet Rate it yourself - /Services/opticians/LeaveReview/DefaultView.aspx?id=OP_5GD_3122__000001_MK428BH,0,0,
Valerie Curtis,OP_5GD_8192__000001_MK428HP,OPT,142 Bedford Road,Kempston,Bedford,,,MK42 8BH,Tel: 01234 851873, - ,,,No ratings yet Rate it yourself - /Services/opticians/LeaveReview/DefaultView.aspx?id=OP_5GD_8192__000001_MK428HP,0,0,
Billson Opticians,5PP CB22 3BG,OPT,,66 High Street Sawston,,Cambridge,Cambridgeshire,CB22 3BG,Tel: 01223 836656, - ,,,No ratings yet Rate it yourself - /Services/opticians/LeaveReview/DefaultView.aspx?id=5PP CB22 3BG,0,0,
Ware Eye Centre,OP_5GJ_79__000001_SG129HW,OPT,12 Amwell End,Ware,Hertfordshire,,,SG12 9HW,Tel: 01920 469978, - ,,,No ratings yet Rate it yourself - /Services/opticians/LeaveReview/DefaultView.aspx?id=OP_5GJ_79__000001_SG129HW,0,0,
Vision Call (DOM),-559 5LC__000006_CB114LB,OPT,Suite 1 Neville House,Wendens Ambo Saffron Walden,Essex,London,,CB11 4LB,Tel: 01799 543 561, - ,,,No ratings yet Rate it yourself - /Services/opticians/LeaveReview/DefaultView.aspx?id=-559 5LC__000006_CB114LB,0,0,
Hertford Opticians,OP_5GJ_3719__000001_SG137DZ,OPT,73 Railway Street,,Hertford,Hertfordshire,,SG14 1RP,Tel: 01992 551762, - ,,,No ratings yet Rate it yourself - /Services/opticians/LeaveReview/DefaultView.aspx?id=OP_5GJ_3719__000001_SG137DZ,0,0,
Stuart Davidson Opticians ,OP_5P3_1321__000002_SG141BN,OPT,22a Bircherley Green,Hertford,Herts,,,SG14 1BN,Tel: 01992 586 979, - ,,,No ratings yet Rate it yourself - /Services/opticians/LeaveReview/DefaultView.aspx?id=OP_5P3_1321__000002_SG141BN,0,0,
Boots-Hertford,OP_5GJ_4619__000001_SG141DW,OPT,27 Maidenhead Street,,,Hertford,Hertfordshire,SG14 1DW,Tel: 01992 583285, - ,,,No ratings yet Rate it yourself - /Services/opticians/LeaveReview/DefaultView.aspx?id=OP_5GJ_4619__000001_SG141DW,0,0,
Skye Opticians,OP_5GX_3131__000001_AL52SH,OPT,,1 Bowers Parade,,Harpenden,Hertfordshire,AL5 2SH,Tel: 01582 712845, - ,,,2 ratings Rate it yourself - /Services/opticians/LeaveReview/DefaultView.aspx?id=OP_5GX_3131__000001_AL52SH,,,
20/20 Eyecare,090220171022,OPT,,20 Station Road,,Harpenden,,AL5 4SE,Tel: 01582 766613, - ,,,No ratings yet Rate it yourself - /Services/opticians/LeaveReview/DefaultView.aspx?id=090220171022,0,0,
Allders Opticians,OP_5P2_1__000002_AL54SQ,OPT,17a Station Road,,Harpenden,Herts,,AL5 4SQ,Tel: 01582 767524, - ,,,No ratings yet Rate it yourself - /Services/opticians/LeaveReview/DefaultView.aspx?id=OP_5P2_1__000002_AL54SQ,0,0,
Harpenden Eye Centre,TPOGT,OPT,,1A Leyton Road,,Harpenden,,AL5 2TJ,Tel: 01582 766668, - ,,,2 ratings Rate it yourself - /Services/opticians/LeaveReview/DefaultView.aspx?id=TPOGT,,,yes
Tesco Opticians,OP_5P2_98__000001_LU54JU,OPT,,Skimpot Road,,Dunstable,,LU5 4JU,Tel: 0345 601 3479, - ,,,No ratings yet Rate it yourself - /Services/opticians/LeaveReview/DefaultView.aspx?id=OP_5P2_98__000001_LU54JU,0,0,
Punch Opticians,OP_5GE__000002_LU56BY,OPT,18 High Street,,Toddington,Beds,,LU5 6BY,Tel: 01525 875099, - ,,,2 ratings Rate it yourself - /Services/opticians/LeaveReview/DefaultView.aspx?id=OP_5GE__000002_LU56BY,,,
Loveday Opticians,OP_5GK_9877__000001_CM232QR,OPT,The Folly,18 Hadham Road,Bishops Stortford,,,CM23 2QR,Tel: 01279 54676, - ,,,No ratings yet Rate it yourself - /Services/opticians/LeaveReview/DefaultView.aspx?id=OP_5GK_9877__000001_CM232QR,0,0,
S J Williams,OP_5GN_13383__000001_CB101EU,OPT,21 King Street,,Saffron Walden,Essex,,CB10 1EU,Tel: 01799 523302, - ,,,1 rating Rate it yourself - /Services/opticians/LeaveReview/DefaultView.aspx?id=OP_5GN_13383__000001_CB101EU,,,
Boots-Saffron Walden,OP_5GN_10289__000001_CB101EE,OPT,44 High Street,,,Saffron Walden,Essex,CB10 1EE,Tel: 01799 522 175, - ,,,1 rating Rate it yourself - /Services/opticians/LeaveReview/DefaultView.aspx?id=OP_5GN_10289__000001_CB101EE,,,
D H Thomas,OP_5GN_10846__000001_CB101EJ,OPT,"Suite 2, Goldhill House",Gold Street,Saffron Walden,Essex,,CB10 1EJ,Tel: 01799 525957, - ,,,No ratings yet Rate it yourself - /Services/opticians/LeaveReview/DefaultView.aspx?id=OP_5GN_10846__000001_CB101EJ,0,0,
P S Mayo Opticians ,OP_5GK_8531__000002_CM233AL,OPT,34- 36 North Street,,Bishops Stortford,Hertfordshire,,CM23 2LW,Tel: 01279 654644, - ,,,No ratings yet Rate it yourself - /Services/opticians/LeaveReview/DefaultView.aspx?id=OP_5GK_8531__000002_CM233AL,0,0,
Ashwell & Barrie,OP_5GK_2223__000001_CM232LW,OPT,Ashwell and Barrie Optician Ltd,34-36 North Street,,Bishop's Stortford,Hertfordshire,CM23 2LW,Tel: 01279 652956, - ,,,No ratings yet Rate it yourself - /Services/opticians/LeaveReview/DefaultView.aspx?id=OP_5GK_2223__000001_CM232LW,0,0,yes
Martin Reynolds Opticians,5GK_27022006__000002_CM232LW,OPT,Martin Reynolds Opticians,24 North Street,,Bishop’s Stortford,Hertfordshire,CM23 2LW,Tel: 01279 757767, - ,,,No ratings yet Rate it yourself - /Services/opticians/LeaveReview/DefaultView.aspx?id=5GK_27022006__000002_CM232LW,0,0,yes
D H Thomas & Associates,OP_5JH_1242__000002_CB23JU,OPT,162 Hills Road,,Cambridge,Cambridgeshire,,CB2 8PB,Tel: 01223 245222, - ,,,No ratings yet Rate it yourself - /Services/opticians/LeaveReview/DefaultView.aspx?id=OP_5JH_1242__000002_CB23JU,0,0,
Tesco Opticians,AL9 5JY,OPT,,Great North Road,,Hatfield,,AL9 5JY,Tel: 0345 601 3479, - ,,,No ratings yet Rate it yourself - /Services/opticians/LeaveReview/DefaultView.aspx?id=AL9 5JY,0,0,