Organisation Name,NACS Code,Organisation Type,Address1,Address2,Address3,Address4,Address5,PostCode,Telephone Number,Opening time,Value  (Opening time),Banding Classification  (Opening time),NHS.UK users rating,Value  (NHS.UK users rating),Banding Classification  (NHS.UK users rating),Car parking (Is there car parking at this organisation?)
Allders Opticians,OP_5GE_7300__000001_SG191JA,OPT,21 Market Square,,Sandy,Beds,,SG19 1JA,Tel: 01767 680675, - ,,,1 rating Rate it yourself - /Services/opticians/LeaveReview/DefaultView.aspx?id=OP_5GE_7300__000001_SG191JA,,,
Biggleswade Bells Brook Specsavers Limited,Z2Y9Z,OPT,,Sainsbury's Bells Brook,Bells Brook,Biggleswade,Bedfordshire,SG18 0NA,Tel: 01767 669377, - ,,,No ratings yet Rate it yourself - /Services/opticians/LeaveReview/DefaultView.aspx?id=Z2Y9Z,0,0,
Clear Vision Direct,OP_5GE_20__000001_SG18OLJ,OPT,,54-56 High Street,,Biggleswade,Bedfordshire,SG18 0LJ,Tel: 01767 313631, - ,,,No ratings yet Rate it yourself - /Services/opticians/LeaveReview/DefaultView.aspx?id=OP_5GE_20__000001_SG18OLJ,0,0,
Allders Opticians,OP_5GE_8894__000001_SG188AX,OPT,,39 High Street,,Biggleswade,Bedfordshire,SG18 0JH,Tel: 01767 313258, - ,,,No ratings yet Rate it yourself - /Services/opticians/LeaveReview/DefaultView.aspx?id=OP_5GE_8894__000001_SG188AX,0,0,
S H Harrold Ltd,OP_5GE_8920__000001_SG188AQ,OPT,29a Market Square,,Biggleswade,Beds,,SG18 8AQ,Tel: 01767 313490, - ,,,No ratings yet Rate it yourself - /Services/opticians/LeaveReview/DefaultView.aspx?id=OP_5GE_8920__000001_SG188AQ,0,0,
A Domi Care,001 PE19,OPT,,53 Bevington Way,,Eynesbury St Neots,,PE19 2HQ,, - ,,,No ratings yet Rate it yourself - /Services/opticians/LeaveReview/DefaultView.aspx?id=001 PE19,0,0,
Tesco Opticians St Neots,CO-1998_12082015,OPT,,"Barford Road, St. Neots",,Huntingdon,,PE19 2SA,Tel: 0345 601 3479, - ,,,No ratings yet Rate it yourself - /Services/opticians/LeaveReview/DefaultView.aspx?id=CO-1998_12082015,0,0,yes
Boots Opticians,13102016HBNHSENGLAND,OPT,,Unit B Biggleswade Shopping Centre,london road,Biggleswade,Bedfordshire,SG18 8PS,Tel: 01767317910, - ,,,1 rating Rate it yourself - /Services/opticians/LeaveReview/DefaultView.aspx?id=13102016HBNHSENGLAND,,,
Adlam & Coomber,OP_5GF_12752__000001_PE192BP,OPT,14 Brook Street,,,St. Neots,Cambridgeshire,PE19 2BP,Tel: 01480 472051, - ,,,No ratings yet Rate it yourself - /Services/opticians/LeaveReview/DefaultView.aspx?id=OP_5GF_12752__000001_PE192BP,0,0,
P G Allder Opticians,OP_5GF_10406__000001_PE192BW,OPT,9 South Street,St. Neots,Cambridgeshire,,,PE19 2BW,Tel: 01480 477479, - ,,,No ratings yet Rate it yourself - /Services/opticians/LeaveReview/DefaultView.aspx?id=OP_5GF_10406__000001_PE192BW,0,0,
Boots-St Neots,OP_5GF_7174__000001_PE191BU,OPT,29-31 High Street,,,St Neots,Cambridgeshire,PE19 1BU,Tel: 01480 210699, - ,,,1 rating Rate it yourself - /Services/opticians/LeaveReview/DefaultView.aspx?id=OP_5GF_7174__000001_PE191BU,,,
Specsavers Opticians,OP_5GF_12755__000002_PE191BU,OPT,13 High Street,,St Neots,Cambridgeshire,,PE19 1BU,Tel: 01480 210820, - ,,,No ratings yet Rate it yourself - /Services/opticians/LeaveReview/DefaultView.aspx?id=OP_5GF_12755__000002_PE191BU,0,0,
Westgate Optical,OP_5GF_5868__000001_PE191BT,OPT,Westgate Department Store 57 High Street,St. Neots,Cambridgeshire,,,PE19 1BT,Tel: 01480 475308, - ,,,No ratings yet Rate it yourself - /Services/opticians/LeaveReview/DefaultView.aspx?id=OP_5GF_5868__000001_PE191BT,0,0,
C & A Hurst Opticians,OP_5GF_12754__000001_PE195HN,OPT,359 Great North Road Eaton Socon,St. Neots,Cambridgeshire,,,PE19 7HN,Tel: 01480 406002, - ,,,No ratings yet Rate it yourself - /Services/opticians/LeaveReview/DefaultView.aspx?id=OP_5GF_12754__000001_PE195HN,0,0,
Stephen Hing Opticians,OP_5GE_7326__000001_SG175AE,OPT,14a Clifton Road,,Shefford,Beds,,SG17 5AE,Tel: 01462 811852, - ,,,No ratings yet Rate it yourself - /Services/opticians/LeaveReview/DefaultView.aspx?id=OP_5GE_7326__000001_SG175AE,0,0,
Paul Adler Optometrist,OP_5GE_9849__000001_SG54LL,OPT,50 High Street,,Stotfold,Herts,,SG5 4LL,Tel: 01462 732393, - ,,,No ratings yet Rate it yourself - /Services/opticians/LeaveReview/DefaultView.aspx?id=OP_5GE_9849__000001_SG54LL,0,0,
John Kaye Optometrist,OP_5GD10215__000001_MK418HF,OPT,8 Library Walk,,Bedford,,,MK41 8HF,Tel: 01234 325060, - ,,,28 ratings Rate it yourself - /Services/opticians/LeaveReview/DefaultView.aspx?id=OP_5GD10215__000001_MK418HF,,,
Homesight,OP_5P2_42__000001_MK402PJ,OPT,1 Pemberley Lane,1 Pemberley Lane,Bedford,Bedford,Bedfordshire,MK40 2PJ,Tel: 07772 981725, - ,,,No ratings yet Rate it yourself - /Services/opticians/LeaveReview/DefaultView.aspx?id=OP_5P2_42__000001_MK402PJ,0,0,
Alan Brunker,OP_5GD_1__000001_MK402NP,OPT,25 St Peter's Street,,Bedford,,,MK40 2PN,Tel: 01234 353410, - ,,,No ratings yet Rate it yourself - /Services/opticians/LeaveReview/DefaultView.aspx?id=OP_5GD_1__000001_MK402NP,0,0,
Humphriss & Burgess,OP_5GD_2276__000001_MK403HD,OPT,28a Mill Street,,,Bedford,,MK40 3HD,Tel: 01234 354343, - ,,,No ratings yet Rate it yourself - /Services/opticians/LeaveReview/DefaultView.aspx?id=OP_5GD_2276__000001_MK403HD,0,0,
Allders Opticians,OP_5GD_10844__000001_MK401RY,OPT,49 High Street,,Bedford,,,MK40 1RY,Tel: 01234 344866, - ,,,No ratings yet Rate it yourself - /Services/opticians/LeaveReview/DefaultView.aspx?id=OP_5GD_10844__000001_MK401RY,0,0,
Donne & Browning Opticians,OP_5GD_2__000001_MK401NS,OPT,,3-4 The Arcade,,Bedford,Bedfordshire,MK40 1NS,Tel: 01234 349933, - ,,,No ratings yet Rate it yourself - /Services/opticians/LeaveReview/DefaultView.aspx?id=OP_5GD_2__000001_MK401NS,0,0,
Boots-Bedford - Harper Centre,OP_5GD_2980__000002_MK401TN,OPT,33-37 Harpur Centre,,,Bedford,Bedfordshire,MK40 1TN,Tel: 01234 219153, - ,,,No ratings yet Rate it yourself - /Services/opticians/LeaveReview/DefaultView.aspx?id=OP_5GD_2980__000002_MK401TN,0,0,
Vision Express (UK) Ltd,OP_5GD_431__000001_MK401TG,OPT,26 The Harpur Centre,,Bedford,,,MK40 1TG,Tel: 01234 347344, - ,,,No ratings yet Rate it yourself - /Services/opticians/LeaveReview/DefaultView.aspx?id=OP_5GD_431__000001_MK401TG,0,0,
Specsavers Opticians,OP_5GD_4520__000001_MK401PS,OPT,Unit 1,47 -51 The Harpur Centre,,Bedford,,MK40 1TP,Tel: 01234 348944, - ,,,No ratings yet Rate it yourself - /Services/opticians/LeaveReview/DefaultView.aspx?id=OP_5GD_4520__000001_MK401PS,0,0,
E.H. Howes Opticians,OP_5GK_10929__000001_SG89AA,OPT,33/35 High Street,,Royston,,,SG8 9AA,Tel: 01763 243132, - ,,,No ratings yet Rate it yourself - /Services/opticians/LeaveReview/DefaultView.aspx?id=OP_5GK_10929__000001_SG89AA,0,0,
Scrivens Optical & Hearing Care,OP_5GK_5479__000001_SG89AW,OPT,,42A High Street,,Royston,Hertfordshire,SG8 9AW,Tel: 01763 243050, - ,,,1 rating Rate it yourself - /Services/opticians/LeaveReview/DefaultView.aspx?id=OP_5GK_5479__000001_SG89AW,,,
Allders Opticians,OP_5GH_3148__000001_SG76BG,OPT,31 High Street,,Baldock,,,SG7 6BG,Tel: 01462 893330, - ,,,No ratings yet Rate it yourself - /Services/opticians/LeaveReview/DefaultView.aspx?id=OP_5GH_3148__000001_SG76BG,0,0,
Tesco Opticians,SG7 6BN,OPT,,58 High St,,Baldock,,SG7 6BN,Tel: 0345 601 3479, - ,,,No ratings yet Rate it yourself - /Services/opticians/LeaveReview/DefaultView.aspx?id=SG7 6BN,0,0,
Valerie Curtis,OP_5GD_8192__000001_MK428HP,OPT,142 Bedford Road,Kempston,Bedford,,,MK42 8BH,Tel: 01234 851873, - ,,,No ratings yet Rate it yourself - /Services/opticians/LeaveReview/DefaultView.aspx?id=OP_5GD_8192__000001_MK428HP,0,0,
Chis Archbold Optometrist,OP_5GD_3122__000001_MK428BH,OPT,158 Bedford Road,Kempston,Bedford,,,MK42 8BH,Tel: 01234 855822, - ,,,No ratings yet Rate it yourself - /Services/opticians/LeaveReview/DefaultView.aspx?id=OP_5GD_3122__000001_MK428BH,0,0,
Vision Care,OP_5GH_9362__000001_SG63EA,OPT,1 Leys Avenue,,Letchworth,,,SG6 3EA,Tel: 01462 684338, - ,,,No ratings yet Rate it yourself - /Services/opticians/LeaveReview/DefaultView.aspx?id=OP_5GH_9362__000001_SG63EA,0,0,
Andrew Merry ,OP_5GH_3629__000001_SG63ED,OPT,29 Leys Avenue,,Letchworth,,,SG6 3ED,Tel: 01462 486123, - ,,,No ratings yet Rate it yourself - /Services/opticians/LeaveReview/DefaultView.aspx?id=OP_5GH_3629__000001_SG63ED,0,0,
Boots-Letchworth,CO-4090,OPT,19 Commerce Way,,,Letchworth Garden City,Hertfordshire,SG6 3DN,Tel: 01462 681805, - ,,,No ratings yet Rate it yourself - /Services/opticians/LeaveReview/DefaultView.aspx?id=CO-4090,0,0,
Allders Opticians,OP_5GK_10408__000001_SG90DX,OPT,15 Eastcheap,,Letchworth,,,SG6 3DA,Tel: 01462 673216, - ,,,No ratings yet Rate it yourself - /Services/opticians/LeaveReview/DefaultView.aspx?id=OP_5GK_10408__000001_SG90DX,0,0,
David Stern Opticians ,OP_5GH_8540__000001_SG63BY,OPT,10 Arena Parade,,Letchworth,,,SG6 3BY,Tel: 01462 683045, - ,,,No ratings yet Rate it yourself - /Services/opticians/LeaveReview/DefaultView.aspx?id=OP_5GH_8540__000001_SG63BY,0,0,
Tesco Opticians,OP_5JJ_727__000002_CB38EL,OPT,15-18 Viking Way Bar Hill,,,Cambridge,Cambridgeshire,CB3 8EL,Tel: 01954 240138, - ,,,1 rating Rate it yourself - /Services/opticians/LeaveReview/DefaultView.aspx?id=OP_5JJ_727__000002_CB38EL,,,
Umesh K. Solanki Optometrist,OP_5GF_9606__000001_PE293NF,OPT,Solanki Optometrist,136 High Street,,Huntingdon,Cambridgeshire,PE29 3NF,Tel: 01480412746, - ,,,No ratings yet Rate it yourself - /Services/opticians/LeaveReview/DefaultView.aspx?id=OP_5GF_9606__000001_PE293NF,0,0,
Gathercole & Ward Optometrists,5PP PE29 3AQ,OPT,,36 High Street,,Huntingdon,Cambridgeshire,PE29 3AQ,Tel: 01480 453208, - ,,,No ratings yet Rate it yourself - /Services/opticians/LeaveReview/DefaultView.aspx?id=5PP PE29 3AQ,0,0,
S H Harrold (1937) Ltd,5PP PE29 3PN,OPT,,4 St Benedict's Court,,Huntingdon,Cambridgeshire,PE29 3PN,Tel: 01480 454000, - ,,,No ratings yet Rate it yourself - /Services/opticians/LeaveReview/DefaultView.aspx?id=5PP PE29 3PN,0,0,
Specsavers Opticians,OP_5GF_12758__000001_PE293NE,OPT,128 High Street,,Huntingdon,Cambridgshire,,PE29 3NE,Tel: 01480 457800, - ,,,No ratings yet Rate it yourself - /Services/opticians/LeaveReview/DefaultView.aspx?id=OP_5GF_12758__000001_PE293NE,0,0,no
Vision Express (UK) Ltd,CO-1881.__000001_PE293NB,OPT,9-11 Chequers Court,Huntingdon,Huntingdon,Cambridgeshire,,PE29 3NB,Tel: 01480 417055, - ,,,No ratings yet Rate it yourself - /Services/opticians/LeaveReview/DefaultView.aspx?id=CO-1881.__000001_PE293NB,0,0,
S H Harrold (1937) Ltd,OP_5GF_3899__000001_PE275EG,OPT,8 Bridge Street,,,St. Ives,Cambridgeshire,PE27 5EG,Tel: 01480 463655, - ,,,No ratings yet Rate it yourself - /Services/opticians/LeaveReview/DefaultView.aspx?id=OP_5GF_3899__000001_PE275EG,0,0,
Umesh Solanki Optometrist,OP_5GF_12759__000001_PE275PD,OPT,,Umesh K. Solanki Optometrist,Currently trading from Huntingdon branch,St Ives,Cambridgeshire,PE27 5EG,Tel: 01480412746, - ,,,No ratings yet Rate it yourself - /Services/opticians/LeaveReview/DefaultView.aspx?id=OP_5GF_12759__000001_PE275PD,0,0,
Gathercole & Ward,OP_5GF_9508__000001_PE174BX,OPT,13 The Broadway,,St Ives,Cambridgeshire,,PE27 5BX,Tel: 01480 462433, - ,,,No ratings yet Rate it yourself - /Services/opticians/LeaveReview/DefaultView.aspx?id=OP_5GF_9508__000001_PE174BX,0,0,
Specsavers St Ives,,OPT,,23 Crown Way,,St Ives,Cambridgeshire,PE27 5AB,Tel: 01480409800, - ,,,N/A - Data not available,,,
Scrivens Ltd,OP_5GF_10150__000001_PE275PA,OPT,1 Crown Place,,St. Ives,St Ives,Cambridgeshire,PE27 5PA,Tel: 01480 301337, - ,,,No ratings yet Rate it yourself - /Services/opticians/LeaveReview/DefaultView.aspx?id=OP_5GF_10150__000001_PE275PA,0,0,
Allders Opticians ,OP_5GH_5128__000001_SG51BT,OPT,15 Hermitage Road,,Hitchin,,,SG5 1BT,Tel: 01462 450549, - ,,,No ratings yet Rate it yourself - /Services/opticians/LeaveReview/DefaultView.aspx?id=OP_5GH_5128__000001_SG51BT,0,0,
Vision Care,OP_5GH_700__000001_SG51JQ,OPT,3 Bancroft,Hitchin,Hertfordshire,,,SG5 1JQ,Tel: 01462 434888, - ,,,No ratings yet Rate it yourself - /Services/opticians/LeaveReview/DefaultView.aspx?id=OP_5GH_700__000001_SG51JQ,0,0,
Eyes of Swavesey,OP_5JJ_7821__000001_CB45QJ,OPT,,2 Station Road,Swavesey,Cambridge,Cambridgeshire,CB24 4QJ,Tel: 01954 231158, - ,,,3 ratings Rate it yourself - /Services/opticians/LeaveReview/DefaultView.aspx?id=OP_5JJ_7821__000001_CB45QJ,,,
Specsavers Opticians,OP_5GH_8355__000001_SG51DN,OPT,27 High Street,,Hitchin,,,SG5 1AT,Tel: 01462 422255, - ,,,No ratings yet Rate it yourself - /Services/opticians/LeaveReview/DefaultView.aspx?id=OP_5GH_8355__000001_SG51DN,0,0,
Boots-Hitchin,OP_5GH_6033__000001_SG51AT,OPT,22 High Street,,,Hitchin,Hertfordshire,SG5 1AT,Tel: 01462 432196, - ,,,5 ratings Rate it yourself - /Services/opticians/LeaveReview/DefaultView.aspx?id=OP_5GH_6033__000001_SG51AT,,,
Shephard & Akay Optometrists,OP_5GH_7550__000001_SG51HR,OPT,,5 Churchyard,,Hitchin,Hertfordshire,SG5 1HR,Tel: 01462 432088, - ,,,No ratings yet Rate it yourself - /Services/opticians/LeaveReview/DefaultView.aspx?id=OP_5GH_7550__000001_SG51HR,0,0,
Allders Opticians,OP_5GE_23__000004_MK452PJ,OPT,17 Bedford Street,,Ampthill,Beds,,MK45 2LU,Tel: 01525 403647, - ,,,No ratings yet Rate it yourself - /Services/opticians/LeaveReview/DefaultView.aspx?id=OP_5GE_23__000004_MK452PJ,0,0,
Tesco Opticians,CO-1998__000001_PE282LA,OPT,Abbots Ripton Road,Sapley,Huntingdon,Cambridgeshire,,PE28 2LA,Tel: 01480 277 779, - ,,,No ratings yet Rate it yourself - /Services/opticians/LeaveReview/DefaultView.aspx?id=CO-1998__000001_PE282LA,0,0,
Optical Express,145PP__000001_CB23NB,OPT,39-41 Petty Cury,,,Cambridge,Cambridgeshire,CB2 3NB,Tel: 0800 023 2020, - ,,,No ratings yet Rate it yourself - /Services/opticians/LeaveReview/DefaultView.aspx?id=145PP__000001_CB23NB,0,0,
David Clulow Opticians,OP_5JH_6632__000002_CB23HX,OPT,59 Sidney Street,,Cambridge,Cambridgeshire,,CB2 3HX,Tel: 01223 362267, - ,,,No ratings yet Rate it yourself - /Services/opticians/LeaveReview/DefaultView.aspx?id=OP_5JH_6632__000002_CB23HX,0,0,
Boots-Cambridge - Lion Yard,OP_5JH_12355__000001_CB23NA,OPT,20/21 Lion Yard,,Cambridge,Cambridgeshire,,CB2 3NA,Tel: 01223 324120, - ,,,1 rating Rate it yourself - /Services/opticians/LeaveReview/DefaultView.aspx?id=OP_5JH_12355__000001_CB23NA,,,
Boots-Cambridge - Petty Cury,OP_5JH_288__000002_CB23ND,OPT,28 Petty Cury,,Cambridge,Cambridgeshire,,CB2 3ND,Tel: 01223 366104, - ,,,3 ratings Rate it yourself - /Services/opticians/LeaveReview/DefaultView.aspx?id=OP_5JH_288__000002_CB23ND,,,
Vision Express,CO-1881__000001_CB23BZ,OPT,,Unit Su20 Grand Arcade,,Cambridge,Cambridgeshire,CB2 3BJ,Tel: 01223 304826, - ,,,No ratings yet Rate it yourself - /Services/opticians/LeaveReview/DefaultView.aspx?id=CO-1881__000001_CB23BZ,0,0,
Vision Express (UK) Ltd,OP_5JH_6475__000002_CB11PS,OPT,Lion Yard Shopping Centre,St Tibbs Row,,Cambridge,Cambridgeshire,CB2 3ET,Tel: 01223 300555, - ,,,No ratings yet Rate it yourself - /Services/opticians/LeaveReview/DefaultView.aspx?id=OP_5JH_6475__000002_CB11PS,0,0,
Clamp Optometrists,OP_5JH_9838__000001_CB23AX,OPT,7 St Andrews Street,,,Cambridge,Cambridgeshire,CB2 3AX,Tel: 01223 350043, - ,,,5 ratings Rate it yourself - /Services/opticians/LeaveReview/DefaultView.aspx?id=OP_5JH_9838__000001_CB23AX,,,
Specsavers Opticians,OP_5JH_4951__000001_CB11NH,OPT,30 Lion Yard,,Cambridge,Cambridgeshire,,CB1 1NH,Tel: 01223 366805, - ,,,1 rating Rate it yourself - /Services/opticians/LeaveReview/DefaultView.aspx?id=OP_5JH_4951__000001_CB11NH,,,
Eyelink,OP_5JH_7053__000001_CB21NW,OPT,23 Hills Road,,Cambridge,Cambridgeshire,,CB2 1NW,Tel: 01223 315226, - ,,,No ratings yet Rate it yourself - /Services/opticians/LeaveReview/DefaultView.aspx?id=OP_5JH_7053__000001_CB21NW,0,0,
Ideal Eyewear Ltd,D-2705 ,OPT,,"Unit 3 Highfield House,",110 The Hawthorns,Flitwick,Bedfordshire,MK45 1FN,Tel: 01525715759, - ,,,No ratings yet Rate it yourself - /Services/opticians/LeaveReview/DefaultView.aspx?id=D-2705,0,0,
Allders Opticians,OP_5GE_5127__000003_MK454LL,OPT,79 Bedford Road,,Barton-le-Clay,Beds,,MK45 4LL,Tel: 01582 881478, - ,,,No ratings yet Rate it yourself - /Services/opticians/LeaveReview/DefaultView.aspx?id=OP_5GE_5127__000003_MK454LL,0,0,
Allders Opticians,OP_5GE_8382__000001_MK451DP,OPT,4a Station Square,,Flitwick,Beds,,MK45 1DP,Tel: 01525 712864, - ,,,No ratings yet Rate it yourself - /Services/opticians/LeaveReview/DefaultView.aspx?id=OP_5GE_8382__000001_MK451DP,0,0,
D H Thomas & Associates,OP_5JH_1242__000002_CB23JU,OPT,162 Hills Road,,Cambridge,Cambridgeshire,,CB2 8PB,Tel: 01223 245222, - ,,,No ratings yet Rate it yourself - /Services/opticians/LeaveReview/DefaultView.aspx?id=OP_5JH_1242__000002_CB23JU,0,0,
Specsavers Opticians,OP_5JH_2545__000002_CB11ER,OPT,13 Fitzroy Street,,Cambridge,Cambridgeshire,,CB1 1ER,Tel: 01223 305241, - ,,,No ratings yet Rate it yourself - /Services/opticians/LeaveReview/DefaultView.aspx?id=OP_5JH_2545__000002_CB11ER,0,0,
S H Harrold Ltd,OP_5GE_22__000003_MK451AJ,OPT,2 Steppingley Road,,Flitwick,Beds,,MK45 1AJ,Tel: 01525 714767, - ,,,No ratings yet Rate it yourself - /Services/opticians/LeaveReview/DefaultView.aspx?id=OP_5GE_22__000003_MK451AJ,0,0,
Anglia Ruskin University,OP_5JH_12610__000001_CB11PT,OPT,University Eye Clinic,East Road,Cambridge,Cambridgeshire,,CB1 1PT,Tel: 01223 698070, - ,,,2 ratings Rate it yourself - /Services/opticians/LeaveReview/DefaultView.aspx?id=OP_5JH_12610__000001_CB11PT,,,Data not available
Histon Opthalmic Opticians,OP_5JJ_9517__000001_CB44JD,OPT,Histon Opticians,8 School Hill,Histon,Cambridge,Cambridgeshire,CB24 9JE,Tel: 01223 237438, - ,,,No ratings yet Rate it yourself - /Services/opticians/LeaveReview/DefaultView.aspx?id=OP_5JJ_9517__000001_CB44JD,0,0,
D W Murphy Optician,OP_5JH_12818__000001_CB58DT,OPT,34 Newmarket Road,,Cambridge,Cambridgeshire,,CB5 8DT,Tel: 01223 351819, - ,,,11 ratings Rate it yourself - /Services/opticians/LeaveReview/DefaultView.aspx?id=OP_5JH_12818__000001_CB58DT,,,
Taank Optometrists,OP_5JH_12815__000001_CB12BD,OPT,92a Mill Road,,Cambridge,Cambridgeshire,,CB1 2BD,Tel: 01223 350071, - ,,,No ratings yet Rate it yourself - /Services/opticians/LeaveReview/DefaultView.aspx?id=OP_5JH_12815__000001_CB12BD,0,0,
J.Oliver Radley Opticians Ltd,OP_5P3_11322__000001_SG99AQ,OPT,36 High Street,Buntingford,Hertfordshire,,,SG9 9AQ,Tel: 01763 273300, - ,,,11 ratings Rate it yourself - /Services/opticians/LeaveReview/DefaultView.aspx?id=OP_5P3_11322__000001_SG99AQ,,,
Billson Opticians,5PP CB22 3BG,OPT,,66 High Street Sawston,,Cambridge,Cambridgeshire,CB22 3BG,Tel: 01223 836656, - ,,,No ratings yet Rate it yourself - /Services/opticians/LeaveReview/DefaultView.aspx?id=5PP CB22 3BG,0,0,
Christopher's Opticians  ,OP_5GH_3618__000001_SG20DL,OPT,21 The Glebe,,Stevenage,,,SG2 0DL,Tel: 01438 314538, - ,,,No ratings yet Rate it yourself - /Services/opticians/LeaveReview/DefaultView.aspx?id=OP_5GH_3618__000001_SG20DL,0,0,
Dollond & Aitchison,OP_5GH_4998__000003_SG11ES,OPT,The Forum Centre,The Forum,Stevenage,Hertfordshire,,SG1 1ES,Tel: 01438 364656, - ,,,No ratings yet Rate it yourself - /Services/opticians/LeaveReview/DefaultView.aspx?id=OP_5GH_4998__000003_SG11ES,0,0,
GPC Opticians,OP_5GH_7785__000001_SG11EE,OPT,22 The Forum,,Stevenage,,,SG1 1EH,Tel: 01438 364168, - ,,,No ratings yet Rate it yourself - /Services/opticians/LeaveReview/DefaultView.aspx?id=OP_5GH_7785__000001_SG11EE,0,0,
Specsavers Opticians,OP_5GH_7474__000001_SG11EG,OPT,90 Queensway,,Stevenage,,,SG1 1EG,Tel: 01438 748900, - ,,,No ratings yet Rate it yourself - /Services/opticians/LeaveReview/DefaultView.aspx?id=OP_5GH_7474__000001_SG11EG,0,0,
Boots-Stevenage - Queenway,OP_5GH_6024__000001_SG11BS,OPT,35 Queensway,,,Stevenage,Hertfordshire,SG1 1DN,Tel: 01438 312263, - ,,,1 rating Rate it yourself - /Services/opticians/LeaveReview/DefaultView.aspx?id=OP_5GH_6024__000001_SG11BS,,,
Asda Opticians,OP_SG11LA_30695,OPT,,Monkswood Way,,Stevenage,,SG1 1LA,Tel: 01438 744912, - ,,,No ratings yet Rate it yourself - /Services/opticians/LeaveReview/DefaultView.aspx?id=OP_SG11LA_30695,0,0,
M&S Opticians,D7F2F,OPT,,5 Roaring Meg Retail Park,,Stevenage,,SG1 1XN,Tel: 01438576301, - ,,,No ratings yet Rate it yourself - /Services/opticians/LeaveReview/DefaultView.aspx?id=D7F2F,0,0,
Scrivens Ltd,OP_5LV_3326__000002_NN100QE,OPT,55 High Street,,,Rushden,Northamptonshire,NN10 0QE,Tel: 01933 410554, - ,,,No ratings yet Rate it yourself - /Services/opticians/LeaveReview/DefaultView.aspx?id=OP_5LV_3326__000002_NN100QE,0,0,
J.B. Noble Opticians,OP_5LV_1555__000001_NN109YU,OPT,37 Church Street,,Rushden,,,NN10 9YU,Tel: 01933 312551, - ,,,No ratings yet Rate it yourself - /Services/opticians/LeaveReview/DefaultView.aspx?id=OP_5LV_1555__000001_NN109YU,0,0,
I-Care Opticians,OP_5LV_2360__000001_NN100PQ,OPT,104 High Street,,Rushden,,,NN10 0PQ,Tel: 01933 312632, - ,,,No ratings yet Rate it yourself - /Services/opticians/LeaveReview/DefaultView.aspx?id=OP_5LV_2360__000001_NN100PQ,0,0,
ZMP; Lee Walker (Domiciliary),5PC^20850__000001_PE282TD,OPT,2 Station Road,Warboys,Cambs,,,PE28 2TD,, - ,,,No ratings yet Rate it yourself - /Services/opticians/LeaveReview/DefaultView.aspx?id=5PC^20850__000001_PE282TD,0,0,
Kanzaria Opticians,OP_5GC_12944__000002_LU33SR,OPT,Purley Centre,Marsh Farm,Luton,Beds,,LU3 3SR,Tel: 01582 580310, - ,,,No ratings yet Rate it yourself - /Services/opticians/LeaveReview/DefaultView.aspx?id=OP_5GC_12944__000002_LU33SR,0,0,
Krog & Whitehead,OP_5LV_8937__000001_NN96HS,OPT,21 High Street,Raunds,Northamptonshire,,,NN9 6HS,Tel: 01933 460035, - ,,,No ratings yet Rate it yourself - /Services/opticians/LeaveReview/DefaultView.aspx?id=OP_5LV_8937__000001_NN96HS,0,0,
Higham Eye Care,OP_5LV_NN98BP__000001_NN98BP,OPT,6 High Street,,Higham Ferrers,Northamptonshire,Northamptonshire,NN10 8BN,Tel: 01933 317000, - ,,,No ratings yet Rate it yourself - /Services/opticians/LeaveReview/DefaultView.aspx?id=OP_5LV_NN98BP__000001_NN98BP,0,0,yes
Punch Opticians,OP_5GE__000002_LU56BY,OPT,18 High Street,,Toddington,Beds,,LU5 6BY,Tel: 01525 875099, - ,,,2 ratings Rate it yourself - /Services/opticians/LeaveReview/DefaultView.aspx?id=OP_5GE__000002_LU56BY,,,
I Kara,OP_5GC_12948__000001_LU33BH,OPT,8 The Parade,Sundon Park,,Luton,,LU3 3BH,Tel: 01582 571731, - ,,,No ratings yet Rate it yourself - /Services/opticians/LeaveReview/DefaultView.aspx?id=OP_5GC_12948__000001_LU33BH,0,0,
Spectacular Opticians,TP98A,OPT,,13 High Street,,Waterbeach,,CB25 9JU,Tel: 01223 967479, - ,,,No ratings yet Rate it yourself - /Services/opticians/LeaveReview/DefaultView.aspx?id=TP98A,0,0,
Kanzaria Opticians,OP_5GC_180__000001_LU32QL,OPT,180 Marsh Road,,Luton,Beds,,LU3 2QL,Tel: 01582 575886, - ,,,1 rating Rate it yourself - /Services/opticians/LeaveReview/DefaultView.aspx?id=OP_5GC_180__000001_LU32QL,,,
Christopher's Opticians,5GH_02012006__000002_SG36AP,OPT,7a Station Road,,Knebworth,Hertfordshire,,SG3 6AP,Tel: 01438 816306, - ,,,No ratings yet Rate it yourself - /Services/opticians/LeaveReview/DefaultView.aspx?id=5GH_02012006__000002_SG36AP,0,0,
S Robinson,OP-5GC__000004_LU32NJ,OPT,70 Marsh Road,,Luton,Beds,,LU3 2NJ,Tel: 01582 503616, - ,,,No ratings yet Rate it yourself - /Services/opticians/LeaveReview/DefaultView.aspx?id=OP-5GC__000004_LU32NJ,0,0,
Kanzaria Opticians,OP_5GC_2101__000003_LU11EH,OPT,104 Dunstable Road,,Luton,Beds,,LU1 1EW,Tel: 01582 480776, - ,,,No ratings yet Rate it yourself - /Services/opticians/LeaveReview/DefaultView.aspx?id=OP_5GC_2101__000003_LU11EH,0,0,
Allders Opticians,OP_5GC_10407__000002_LU11EH,OPT,88 Dunstable Road,,Luton,Beds,,LU1 1EH,Tel: 01582 725136, - ,,,No ratings yet Rate it yourself - /Services/opticians/LeaveReview/DefaultView.aspx?id=OP_5GC_10407__000002_LU11EH,0,0,
Luton Optical Centre,OP_5GC_16__000001_LU12TA,OPT,32 Market Hall,The Arndale Centre,Luton,Beds,,LU1 2TA,Tel: 01582 402773, - ,,,1 rating Rate it yourself - /Services/opticians/LeaveReview/DefaultView.aspx?id=OP_5GC_16__000001_LU12TA,,,