Organisation Name,NACS Code,Organisation Type,Address1,Address2,Address3,Address4,Address5,PostCode,Telephone Number,Opening time,Value  (Opening time),Banding Classification  (Opening time),NHS.UK users rating,Value  (NHS.UK users rating),Banding Classification  (NHS.UK users rating),Car parking (Is there car parking at this organisation?)
K A Rowland ,OP_5A8_986__000002_SE181PP,OPT,2 Lakedale Road,,Plumstead,London,,SE18 1PP,Tel: 0208 854 2406, - ,,,No ratings yet Rate it yourself - /Services/opticians/LeaveReview/DefaultView.aspx?id=OP_5A8_986__000002_SE181PP,0,0,
L Dollay,OP_5A8_766__000001_SE288RA,OPT,4a Joyce Dawson Way,,Thamesmead,London,,SE28 8RA,Tel: 020 8311 8711, - ,,,No ratings yet Rate it yourself - /Services/opticians/LeaveReview/DefaultView.aspx?id=OP_5A8_766__000001_SE288RA,0,0,
Thamesmead Eye Care,S6U6P,OPT,,Wm Morrison Supermarkets,Twin Tumps Way,London,,SE28 8RD,Tel: 0208 310 0420, - ,,,No ratings yet Rate it yourself - /Services/opticians/LeaveReview/DefaultView.aspx?id=S6U6P,0,0,
W Johnston,OP_5AX_14680__000001_DA175JN,OPT,63 Nuxley Road,,Upper Belvedere,Kent,,DA17 5JN,Tel: 01322 432868, - ,,,1 rating Rate it yourself - /Services/opticians/LeaveReview/DefaultView.aspx?id=OP_5AX_14680__000001_DA175JN,,,
Paine & Hunter Optometrists,OP_5A8_10__000002_SE182NB,OPT,1 The Slade,Plumstead,London,,,SE18 2NB,Tel: 0208 3161040, - ,,,No ratings yet Rate it yourself - /Services/opticians/LeaveReview/DefaultView.aspx?id=OP_5A8_10__000002_SE182NB,0,0,
Second Sight,OP_5AX_2062__000002_DA163PG,OPT,81 Welling High Street,,Welling,Kent,,DA16 1TY,Tel: 0208 301 4586, - ,,,1 rating Rate it yourself - /Services/opticians/LeaveReview/DefaultView.aspx?id=OP_5AX_2062__000002_DA163PG,,,
R F Linklater & Partners,OP_5AX_8989__000001_DA161TG,OPT,136 High Street,,Welling,Kent,,DA16 1TJ,Tel: 0208 303 4963, - ,,,1 rating Rate it yourself - /Services/opticians/LeaveReview/DefaultView.aspx?id=OP_5AX_8989__000001_DA161TG,,,
Steven Harris Opticians,OP_5AX_14681__000001_DA163PG,OPT,101 Bellegrove Road,,Welling,Kent,,DA16 3PG,Tel: 0208 304 2423, - ,,,No ratings yet Rate it yourself - /Services/opticians/LeaveReview/DefaultView.aspx?id=OP_5AX_14681__000001_DA163PG,0,0,
John Lewis Opticians ,OP_5A8_14710__000001_SE187BZ,OPT,13 Plumstead,,Woolwich,London,,SE18 7BZ,Tel: 0208 316 1121, - ,,,12 ratings Rate it yourself - /Services/opticians/LeaveReview/DefaultView.aspx?id=OP_5A8_14710__000001_SE187BZ,,,
KA Rowland ,OP_5A8_10593__000001_SE186LF,OPT,8 Powis Street,,Woolwich,London,,SE18 6LF,Tel: 020 8854 8750, - ,,,No ratings yet Rate it yourself - /Services/opticians/LeaveReview/DefaultView.aspx?id=OP_5A8_10593__000001_SE186LF,0,0,
Virtue Specs,V2H8A,OPT,,53 Powis Street,Woolwich,London,Greater London,SE18 6HZ,Tel: 02033027460, - ,,,No ratings yet Rate it yourself - /Services/opticians/LeaveReview/DefaultView.aspx?id=V2H8A,0,0,
L Dollay ,OP_5AX_14678__000003_DA83EX,OPT,259 Bexley Road,Northumberland Heath,Erith,Kent,,DA8 3EX,Tel: 01322 359 507, - ,,,1 rating Rate it yourself - /Services/opticians/LeaveReview/DefaultView.aspx?id=OP_5AX_14678__000003_DA83EX,,,
Paine & Hunter,OP_5A8_2738__000003_SE183SH,OPT,50 Herbert Road,,Plumstead,London,,SE18 3SH,Tel: 020 8316 1040, - ,,,No ratings yet Rate it yourself - /Services/opticians/LeaveReview/DefaultView.aspx?id=OP_5A8_2738__000003_SE183SH,0,0,
Tesco Opticians,OP_SE186JR_85036,OPT,,13 Old Stable Row,,London,,SE18 6JR,Tel: 020 8787 5538, - ,,,No ratings yet Rate it yourself - /Services/opticians/LeaveReview/DefaultView.aspx?id=OP_SE186JR_85036,0,0,
Coton & Hamblin Ltd,OP_5A8_1772__000001_SE186PQ,OPT,11 Wellington Street,Woolwich,London,,,SE18 6PQ,Tel: 020 8854 1491, - ,,,2 ratings Rate it yourself - /Services/opticians/LeaveReview/DefaultView.aspx?id=OP_5A8_1772__000001_SE186PQ,,,
Specsavers Opticians,OP_5A8_5021__000001_SE186LQ,OPT,66 Powis Street,,Woolwich,London,,SE18 6LQ,Tel: 0208 316 1663, - ,,,2 ratings Rate it yourself - /Services/opticians/LeaveReview/DefaultView.aspx?id=OP_5A8_5021__000001_SE186LQ,,,
The Chemist,OP_5A8_800__000001_SE186HZ,OPT,Boots the Chemist,12-16 Hare Street,Woolwich,London,,SE18 6NB,Tel: 02088542602, - ,,,1 rating Rate it yourself - /Services/opticians/LeaveReview/DefaultView.aspx?id=OP_5A8_800__000001_SE186HZ,,,
Linklater Optometrists,OP_5AX_10048__000002_DA67DQ,OPT,Linklaters Optometrists,120 Broadway,Bexleyheath,Kent,,DA6 7DQ,Tel: 0208 303 4014, - ,,,3 ratings Rate it yourself - /Services/opticians/LeaveReview/DefaultView.aspx?id=OP_5AX_10048__000002_DA67DQ,,,no
Specsavers Opticians,OP_5AX_227__000001_DA67DQ,OPT,116a Broadway,Bexleyheath,Kent,,,DA6 7DQ,Tel: 0208 298 9920, - ,,,No ratings yet Rate it yourself - /Services/opticians/LeaveReview/DefaultView.aspx?id=OP_5AX_227__000001_DA67DQ,0,0,
BOOTS,OP_5C5_14664__000001_E67SD,OPT,Unit 15,Galleons Reach,Becton,,,E6 7FD,Tel: 020 7474 9674, - ,,,No ratings yet Rate it yourself - /Services/opticians/LeaveReview/DefaultView.aspx?id=OP_5C5_14664__000001_E67SD,0,0,
Vision Express Ltd,OP_5AX_5408__000003_DA67JJ,OPT,5 The Mall,Broadway Shopping Centre,Bexleyheath,Kent,,DA6 7JJ,Tel: 0208 298 9629, - ,,,No ratings yet Rate it yourself - /Services/opticians/LeaveReview/DefaultView.aspx?id=OP_5AX_5408__000003_DA67JJ,0,0,
Boots-Bexleyheath,OP_5AX_10393__000002_DA67JJ,OPT,25 The Mall,Broadway Shopping Centre,Bexleyheath,Kent,,DA6 7JJ,Tel: 020 8301 5656, - ,,,1 rating Rate it yourself - /Services/opticians/LeaveReview/DefaultView.aspx?id=OP_5AX_10393__000002_DA67JJ,,,
Care Optics,OPT_IG110NY_4,OPT,,3 Farr Avenue,,London,,IG11 0NY,, - ,,,1 rating Rate it yourself - /Services/opticians/LeaveReview/DefaultView.aspx?id=OPT_IG110NY_4,,,
M M Beg Opticians,OP_5AX_14694__000001_DA81RG,OPT,115 Erith High Street,,Erith,Kent,,DA8 1RG,Tel: 01322 342620, - ,,,2 ratings Rate it yourself - /Services/opticians/LeaveReview/DefaultView.aspx?id=OP_5AX_14694__000001_DA81RG,,,
S Gothelf & Associates,OP_5AX_10318__000001_DA159NB,OPT,10 Wellington Parade,,Sidcup,Kent,,DA15 9NB,Tel: 0208 303 3935, - ,,,2 ratings Rate it yourself - /Services/opticians/LeaveReview/DefaultView.aspx?id=OP_5AX_10318__000001_DA159NB,,,
Asda Opticians,OP_5C2__000002_RM96SJ,OPT,Merrielands Crescent,*,,Dagenham,Essex,RM9 6SJ,Tel: 0208 5965372, - ,,,1 rating Rate it yourself - /Services/opticians/LeaveReview/DefaultView.aspx?id=OP_5C2__000002_RM96SJ,,,
Asda Vision,OP_5C5_14665__000002_E64JP,OPT,Asda Store,Tollgate Road,,London,,E6 4JP,Tel: 0207 5402952, - ,,,No ratings yet Rate it yourself - /Services/opticians/LeaveReview/DefaultView.aspx?id=OP_5C5_14665__000002_E64JP,0,0,
Care Optics,OPT_RM94TR_1,OPT,,527a Gale Street,,London,,RM9 4TR,, - ,,,No ratings yet Rate it yourself - /Services/opticians/LeaveReview/DefaultView.aspx?id=OPT_RM94TR_1,0,0,
Aves Opticians,OP_5C2_4090__000001_IG117PG,OPT,50 Ripple Road,,Barking,,,IG11 7PG,Tel: 020 8594 2714, - ,,,No ratings yet Rate it yourself - /Services/opticians/LeaveReview/DefaultView.aspx?id=OP_5C2_4090__000001_IG117PG,0,0,
iCare Optical,OPT_SE78UD_1,OPT,,"16 The Village, Charlton",,London,,SE7 8UD,Tel: 020 8856 6034, - ,,,No ratings yet Rate it yourself - /Services/opticians/LeaveReview/DefaultView.aspx?id=OPT_SE78UD_1,0,0,
Aves Opticians,OP_5A4_13772__000001_RM139Y,OPT,24 The Broadway,Rainham,Essex,,,RM13 9YW,Tel: 01708 555606, - ,,,No ratings yet Rate it yourself - /Services/opticians/LeaveReview/DefaultView.aspx?id=OP_5A4_13772__000001_RM139Y,0,0,
Spectacle World,OP_5C2_13780__000001_IG118D,OPT,30 Vicarage  Field Shopping Centre,Ripple Road,Barking,,,IG11 8DQ,Tel: 020 8591 4555, - ,,,7 ratings Rate it yourself - /Services/opticians/LeaveReview/DefaultView.aspx?id=OP_5C2_13780__000001_IG118D,,,
Specsavers ,OP_5C2_13799__000001_RM95AN,OPT,249 Heathway,,Dagenham,Essex,,RM9 5AN,Tel: 020 8596 9998, - ,,,No ratings yet Rate it yourself - /Services/opticians/LeaveReview/DefaultView.aspx?id=OP_5C2_13799__000001_RM95AN,0,0,
Crayford Opticial Centre,OP_5AX_1701__000001_DA14ES,OPT,11a Crayford High Street,,Crayford,Kent,,DA1 4HH,Tel: 01322557700, - ,,,No ratings yet Rate it yourself - /Services/opticians/LeaveReview/DefaultView.aspx?id=OP_5AX_1701__000001_DA14ES,0,0,
SPECSAVERS,OPT_IG118EJ_1,OPT,,45 East Street,,Barking,,IG11 8EJ,Tel: 0208 591 9611, - ,,,No ratings yet Rate it yourself - /Services/opticians/LeaveReview/DefaultView.aspx?id=OPT_IG118EJ_1,0,0,
Aquila Revolution,OP_5C2_13250__000001_IG118EJ,OPT,65 East Street,,,Barking,,IG11 8EJ,Tel: 020 8594 4692, - ,,,No ratings yet Rate it yourself - /Services/opticians/LeaveReview/DefaultView.aspx?id=OP_5C2_13250__000001_IG118EJ,0,0,
Asda Opticians,OPT_IG11 8AA,OPT,,"London Road, Barking",,Essex,,IG11 8AA,Tel: 0203 770 1902, - ,,,No ratings yet Rate it yourself - /Services/opticians/LeaveReview/DefaultView.aspx?id=OPT_IG11 8AA,0,0,
Tesco Opticians Rainham,RM13 9YZ,OPT,,"Bridge Road, Rainham",,Essex,,RM13 9YZ,, - ,,,No ratings yet Rate it yourself - /Services/opticians/LeaveReview/DefaultView.aspx?id=RM13 9YZ,0,0,
Heathway Eyecare,OP_5C2_9798__000002_RM95AQ,OPT,295 Heathway,,Dagenham,,,RM9 5AQ,Tel: 020 8592 2309, - ,,,2 ratings Rate it yourself - /Services/opticians/LeaveReview/DefaultView.aspx?id=OP_5C2_9798__000002_RM95AQ,,,
"Morgan, Henry",OP_5C2_12068__000001_RM108QU,OPT,276 Heathway,,Dagenham,Essex,,RM10 8QU,Tel: 020 8592 1033, - ,,,No ratings yet Rate it yourself - /Services/opticians/LeaveReview/DefaultView.aspx?id=OP_5C2_12068__000001_RM108QU,0,0,
Page & Small Opticians,OP_5A8_14683__000002_SE77ED,OPT,213 Charlton Road,,Charlton,London,,SE7 7ED,Tel: 0208 293 9493, - ,,,9 ratings Rate it yourself - /Services/opticians/LeaveReview/DefaultView.aspx?id=OP_5A8_14683__000002_SE77ED,,,yes
Specsavers Crayford,G1O1G,OPT,Sainsbury's,Stadium Way,,Dartford,Kent,DA1 4HW,Tel: 01322 470662, - ,,,1 rating Rate it yourself - /Services/opticians/LeaveReview/DefaultView.aspx?id=G1O1G,,,
Specsavers Opticians,OP_5A8_9996__000001_SE91BJ,OPT,126 Eltham High Street,,Eltham,London,,SE9 1BJ,Tel: 020 8850 8800, - ,,,2 ratings Rate it yourself - /Services/opticians/LeaveReview/DefaultView.aspx?id=OP_5A8_9996__000001_SE91BJ,,,
Boots-London - Eltham,OP_5A8_14685__000001_SE91TD,OPT,93 Eltham High Street,,Eltham,London,,SE9 1TD,Tel: 0208 850 1783, - ,,,No ratings yet Rate it yourself - /Services/opticians/LeaveReview/DefaultView.aspx?id=OP_5A8_14685__000001_SE91TD,0,0,
Specsavers Charlton Riverside,OLC007115A8,OPT,,7-11 Gallions Road,,London,,SE7 7SA,, - ,,,1 rating Rate it yourself - /Services/opticians/LeaveReview/DefaultView.aspx?id=OLC007115A8,,,
Colletts Opticians Ltd,OP_5A8_5844__000001_SE95DA,OPT,43 Passey Place,Eltham,London,,,SE9 5DA,Tel: 020 8850 3415, - ,,,No ratings yet Rate it yourself - /Services/opticians/LeaveReview/DefaultView.aspx?id=OP_5A8_5844__000001_SE95DA,0,0,
NEIL GORDON OPTICIANS,OP_5C5_2626__000001_E62HP,OPT,113 High Street North,Eastham,London,,,E6 2HP,Tel: 0208 4717707, - ,,,2 ratings Rate it yourself - /Services/opticians/LeaveReview/DefaultView.aspx?id=OP_5C5_2626__000001_E62HP,,,
Eye Clinic Opticians,5C5-20074,OPT,,62 High Street North,,East Ham,,E6 2HJ,Tel: 020 85860200, - ,,,No ratings yet Rate it yourself - /Services/opticians/LeaveReview/DefaultView.aspx?id=5C5-20074,0,0,
The Outside Opticians ,OP_E62DZ_30657,OPT,,160 Lathom Road,,"East Ham, London",,E6 2DZ,Tel: 020 8177 5877, - ,,,No ratings yet Rate it yourself - /Services/opticians/LeaveReview/DefaultView.aspx?id=OP_E62DZ_30657,0,0,
NEIL GORDON OPTICIANS,OP_5C5_14593__000001_E138RU,OPT,Newham University NHS Trust,Glen Road,Plaistow,,,E13 8SL,Tel: 020 7476 4000, - ,,,No ratings yet Rate it yourself - /Services/opticians/LeaveReview/DefaultView.aspx?id=OP_5C5_14593__000001_E138RU,0,0,
Optical World,OP_5C5_14555__000003_E62HT,OPT,62 High Street North,Eastham,London,London,,E6 2HT,Tel: 020 8586 0200, - ,,,No ratings yet Rate it yourself - /Services/opticians/LeaveReview/DefaultView.aspx?id=OP_5C5_14555__000003_E62HT,0,0,
Boots-London - East Ham,OP_5C5_1761__000004_E62HT,OPT,114 High Street North,,,London,,E6 2HT,Tel: 0208 472 3720, - ,,,No ratings yet Rate it yourself - /Services/opticians/LeaveReview/DefaultView.aspx?id=OP_5C5_1761__000004_E62HT,0,0,
Blackheath Eyecare,OP_5A8_14675__000002_SE37BT,OPT,Blackheath Eyecare Opticians,16 Old Dover Road,Blackheath,London,,SE3 7BT,Tel: 0208 305 1060, - ,,,1 rating Rate it yourself - /Services/opticians/LeaveReview/DefaultView.aspx?id=OP_5A8_14675__000002_SE37BT,,,yes
BOLEYN EYE CENTRE,OP_5C5_1991__000002_E63BP,OPT,18 Barking Road,London,,,,E6 3BP,Tel: 020 8552 9077, - ,,,No ratings yet Rate it yourself - /Services/opticians/LeaveReview/DefaultView.aspx?id=OP_5C5_1991__000002_E63BP,0,0,
SPECSAVERS OPTICIANS,OP_5C5_378__000002_E61HS,OPT,43 High Street North,Eastham,London,,,E6 2JD,Tel: 020 8470 0800, - ,,,No ratings yet Rate it yourself - /Services/opticians/LeaveReview/DefaultView.aspx?id=OP_5C5_378__000002_E61HS,0,0,
Coton & Hamblin Ltd,OP_5A8_14673__000002_SE37DH,OPT,178 Westcombe Hill,Blackheath,London,,,SE3 7DH,Tel: 0208 858 1858, - ,,,No ratings yet Rate it yourself - /Services/opticians/LeaveReview/DefaultView.aspx?id=OP_5A8_14673__000002_SE37DH,0,0,
VISITING OPTICIAN (MR J SINGH),10040__000001_IG12TF,OPT,295 Mortlake Road,Ilford,Essex,,,IG1 2TF,, - ,,,No ratings yet Rate it yourself - /Services/opticians/LeaveReview/DefaultView.aspx?id=10040__000001_IG12TF,0,0,
Colletts Opticians Ltd,OP_5AX_2176__000001_DA146ND,OPT,103 Main Road,Sidcup,Kent,,,DA14 6ND,Tel: 0208 300 3222, - ,,,No ratings yet Rate it yourself - /Services/opticians/LeaveReview/DefaultView.aspx?id=OP_5AX_2176__000001_DA146ND,0,0,
Specsavers Opticians,OP_5AX_14708__000001_DA146ED,OPT,53 High Street,Sidcup,Kent,,,DA14 6ED,Tel: 0208 308 3500, - ,,,No ratings yet Rate it yourself - /Services/opticians/LeaveReview/DefaultView.aspx?id=OP_5AX_14708__000001_DA146ED,0,0,
ELITE VISION LTD,OL29145C5__000003_E126SA,OPT,230 High Street North,Manor Park,London,,,E12 6SA,Tel: 020 8471 2277, - ,,,No ratings yet Rate it yourself - /Services/opticians/LeaveReview/DefaultView.aspx?id=OL29145C5__000003_E126SA,0,0,
IAB Eyecare Ltd,OL231805NA,OPT,,388 Barking Road,"Plaistow,",London,,E13 8HJ,Tel: 020 7476 6615, - ,,,No ratings yet Rate it yourself - /Services/opticians/LeaveReview/DefaultView.aspx?id=OL231805NA,0,0,
EYES-RITE OPTICIANS,OP_5NA45702__000001_IG12RU,OPT,207 Ilford Lane,Ilford Essex,London,,,IG1 2RU,Tel: 0208 478  5799, - ,,,No ratings yet Rate it yourself - /Services/opticians/LeaveReview/DefaultView.aspx?id=OP_5NA45702__000001_IG12RU,0,0,
Eyeland Vision Care,OP_5C5_8384__000001_E139JJ,OPT,428 Green Street,Upton Park,London,London,,E13 9JJ,Tel: 020 8472 0593, - ,,,No ratings yet Rate it yourself - /Services/opticians/LeaveReview/DefaultView.aspx?id=OP_5C5_8384__000001_E139JJ,0,0,
RONALD BROWN OPTICANS,OP_5C5_2538__000002_E138EB,OPT,39 Balaam Street,,London,,,E13 8EB,Tel: 020 7476 5229, - ,,,No ratings yet Rate it yourself - /Services/opticians/LeaveReview/DefaultView.aspx?id=OP_5C5_2538__000002_E138EB,0,0,
Shiva Optician Ltd,TP4CT,OPT,,433 Becontree Avenue,,Dagenham,,RM8 3UH,, - ,,,No ratings yet Rate it yourself - /Services/opticians/LeaveReview/DefaultView.aspx?id=TP4CT,0,0,
"BANSAL, MR BHANO COLOURED CONTACT LENS",10092__000003_E61AD,OPT,25 Plashet Grove,East Ham,London,,,E6 1AD,, - ,,,No ratings yet Rate it yourself - /Services/opticians/LeaveReview/DefaultView.aspx?id=10092__000003_E61AD,0,0,
B Bansal,53342__000005_E61AD,OPT,23 Plashet Grove,,East Ham,London,,E6 1AD,Tel: 020 8470 1133, - ,,,No ratings yet Rate it yourself - /Services/opticians/LeaveReview/DefaultView.aspx?id=53342__000005_E61AD,0,0,
BEG OPTICIANS,OP_5C5_1668__000001_E61AD,OPT,13 Plashet Grove,London,,,,E6 1AD,Tel: 020 8472 8028, - ,,,3 ratings Rate it yourself - /Services/opticians/LeaveReview/DefaultView.aspx?id=OP_5C5_1668__000001_E61AD,,,
UPTON PARK EYECARE,OP_5C5_14666__000004_E139AP,OPT,"386-388harold Road, Off Green Street",Upton Park,London,,,E13 9AP,Tel: 020 8552 3001, - ,,,No ratings yet Rate it yourself - /Services/opticians/LeaveReview/DefaultView.aspx?id=OP_5C5_14666__000004_E139AP,0,0,
Brian Ashby Opticians Ltd,TP425,OPT,,"24 West Park, Mottingham",,London,,SE9 4RQ,Tel: 020 8851 7422, - ,,,No ratings yet Rate it yourself - /Services/opticians/LeaveReview/DefaultView.aspx?id=TP425,0,0,
Freeman Of Greenwich,OP_5A8_14682__000002_SE109EQ,OPT,205 Trafalgar Road,,Greenwich,London,,SE10 9EQ,Tel: 0208 858 2481, - ,,,3 ratings Rate it yourself - /Services/opticians/LeaveReview/DefaultView.aspx?id=OP_5A8_14682__000002_SE109EQ,,,
Super Optical,10091__000002_E78LQ,OPT,5 St. Stephens Parade,Green Street,London,London,,E7 8LQ,Tel: 020 8472 0949, - ,,,1 rating Rate it yourself - /Services/opticians/LeaveReview/DefaultView.aspx?id=10091__000002_E78LQ,,,
Creed Optics Ltd,B9P6Z,OPT,,474 Katherine Road,,London,,E7 8PD,Tel: 02085481155, - ,,,No ratings yet Rate it yourself - /Services/opticians/LeaveReview/DefaultView.aspx?id=B9P6Z,0,0,
COHEN OPTICIANS,OP_5C5_12840__000001_E161EN,OPT,124 Barking Road,,London,,,E16 1EN,Tel: 020 7476 4951, - ,,,No ratings yet Rate it yourself - /Services/opticians/LeaveReview/DefaultView.aspx?id=OP_5C5_12840__000001_E161EN,0,0,
OPT A VISION,OP_5NA45713__000005_RM81XU,OPT,14 Rowallen Parade,Dagenham,London,,,RM8 1XU,Tel: 020 8590 1333, - ,,,No ratings yet Rate it yourself - /Services/opticians/LeaveReview/DefaultView.aspx?id=OP_5NA45713__000005_RM81XU,0,0,
Infocus,Q4T1O,OPT,,13 Montpelier Vale,,Blackheath,,SE3 0TA,Tel: 020 8852 4406, - ,,,No ratings yet Rate it yourself - /Services/opticians/LeaveReview/DefaultView.aspx?id=Q4T1O,0,0,
Butcher Curnow Ophthalmic Opticians,OP_5LF_12480__000001_SE30BU,OPT,19 Tranquil Vale,,London,,,SE3 0BU,Tel: 020 8318 1732, - ,,,No ratings yet Rate it yourself - /Services/opticians/LeaveReview/DefaultView.aspx?id=OP_5LF_12480__000001_SE30BU,0,0,
SPECSAVERS,OP_5NA45717__000001_IG11DS,OPT,92 High Road,Ilford,London,,,IG1 1DS,Tel: 020 8553 1122, - ,,,No ratings yet Rate it yourself - /Services/opticians/LeaveReview/DefaultView.aspx?id=OP_5NA45717__000001_IG11DS,0,0,
Elite Vision,OP_5NA45696__000001_IG11LX,OPT,221 High Road,221 High Road,London,Ilford,,IG1 1LX,Tel: 0208 9118885, - ,,,No ratings yet Rate it yourself - /Services/opticians/LeaveReview/DefaultView.aspx?id=OP_5NA45696__000001_IG11LX,0,0,
Downes Eyecare,5NA 6080,OPT,,608 High Road,Seven Kings,Ilford,Essex,IG3 8RF,Tel: 020 8590 2710, - ,,,3 ratings Rate it yourself - /Services/opticians/LeaveReview/DefaultView.aspx?id=5NA 6080,,,
Boots-Ilford - High Rd (in Boots UK),OP_5NA45688__000002_IG11DE,OPT,177-185 High Road,,,Ilford,Essex,IG1 1DE,Tel: 0208 553 5776, - ,,,2 ratings Rate it yourself - /Services/opticians/LeaveReview/DefaultView.aspx?id=OP_5NA45688__000002_IG11DE,,,
Lais Opticians,OP_5C5_14558__000001_E125AQ,OPT,622 Romford Road,Manor Park,London,London,,E12 5AQ,Tel: 020 8478 1631, - ,,,No ratings yet Rate it yourself - /Services/opticians/LeaveReview/DefaultView.aspx?id=OP_5C5_14558__000001_E125AQ,0,0,
RAJ OPTICIANS ,OP_5NA45714__000001_IG39UR,OPT,1 RAVENINGS PARADE,39 GOODMAYES ROAD,GOODMAYES,ILFORD,Essex,IG3 9NR,Tel: 0208 590 2739, - ,,,No ratings yet Rate it yourself - /Services/opticians/LeaveReview/DefaultView.aspx?id=OP_5NA45714__000001_IG39UR,0,0,
EYE CARE (LEWIS JACOBS),OP_5NA45699__000001_IG14DU,OPT,13 Cranbrook Road,Ilford,London,,,IG1 4DU,Tel: 020 8478 3767, - ,,,No ratings yet Rate it yourself - /Services/opticians/LeaveReview/DefaultView.aspx?id=OP_5NA45699__000001_IG14DU,0,0,
EYEWEAR CLINIC,OP_5NA45703__000001_IG11AS,OPT,Unit 49,"The Exchange, Ilford",London,,,IG1 1AS,Tel: 020 8478 2971, - ,,,No ratings yet Rate it yourself - /Services/opticians/LeaveReview/DefaultView.aspx?id=OP_5NA45703__000001_IG11AS,0,0,
VISION EXPRESS,OP_5NA45722__000002_IG11AS,OPT,The Exchange,Ilford,London,,,IG1 1AS,Tel: 0208 553 0505, - ,,,No ratings yet Rate it yourself - /Services/opticians/LeaveReview/DefaultView.aspx?id=OP_5NA45722__000002_IG11AS,0,0,
EYE GEE LTD,OP_5NA45700__000002_IG38RA,OPT,651 High Street,Seven Kings,London,,,IG3 8RA,Tel: 0208 599 0033, - ,,,No ratings yet Rate it yourself - /Services/opticians/LeaveReview/DefaultView.aspx?id=OP_5NA45700__000002_IG38RA,0,0,
Home Eye Care (DOM),5LA_OPT_17__000007_IG38RG,OPT,627d  Southend Road,Ilford,Essex,,,IG3 8RG,Tel: 0208 590 6666, - ,,,No ratings yet Rate it yourself - /Services/opticians/LeaveReview/DefaultView.aspx?id=5LA_OPT_17__000007_IG38RG,0,0,
Specialeyes Eyecare Opticians,V2N2P,OPT,,Address  	100 GREEN ST,Shepherd’s Bush,London,,E7 8JG,Tel: 02087437552, - ,,,No ratings yet Rate it yourself - /Services/opticians/LeaveReview/DefaultView.aspx?id=V2N2P,0,0,
Nasir Opticians,OP_5C2_13777__000001_RM109R,OPT,2-3 Station Parade,Elm Park,,Hornchurch,Essex,RM12 5AB,Tel: 020 8593 0328, - ,,,No ratings yet Rate it yourself - /Services/opticians/LeaveReview/DefaultView.aspx?id=OP_5C2_13777__000001_RM109R,0,0,
Boots-Dartford - High St,OP_5CM_1268__000002_DA11BY,OPT,20 High Street,,,Dartford,Kent,DA1 1BY,Tel: 01322 223 007, - ,,,No ratings yet Rate it yourself - /Services/opticians/LeaveReview/DefaultView.aspx?id=OP_5CM_1268__000002_DA11BY,0,0,
AVES OPTICIANS,OP_5NA45684__000002_IG14JT,OPT,17 Wellesley Road,Ilford,London,,,IG1 4JT,Tel: 020 8551 1088, - ,,,No ratings yet Rate it yourself - /Services/opticians/LeaveReview/DefaultView.aspx?id=OP_5NA45684__000002_IG14JT,0,0,
"GUPTA, MRS NP",10073__000004_IG14JT,OPT,17 Wellesley Road,,Ilford,,,IG1 4JT,Tel: 020 8554 1088, - ,,,No ratings yet Rate it yourself - /Services/opticians/LeaveReview/DefaultView.aspx?id=10073__000004_IG14JT,0,0,
Linklater Opticians ,OP_5CM_3977__000001_DA11HD,OPT,22 Lowfield Street,,Dartford,Dartford,,DA1 1HD,Tel: 01322 223113, - ,,,No ratings yet Rate it yourself - /Services/opticians/LeaveReview/DefaultView.aspx?id=OP_5CM_3977__000001_DA11HD,0,0,
Forest Gate Eye Clinic,OP_5PV_3711__000001_IG13PD,OPT,47 Woodford Road,,Forest Gate,London,,E7 8AB,Tel: 0208 181 9171, - ,,,4 ratings Rate it yourself - /Services/opticians/LeaveReview/DefaultView.aspx?id=OP_5PV_3711__000001_IG13PD,,,
Eye Clinic,OP_5A4_13123__000001_RM124RN,OPT,35 The Broadway,Elm Park,,Hornchurch,Essex,RM12 4RN,Tel: 01708 447012, - ,,,1 rating Rate it yourself - /Services/opticians/LeaveReview/DefaultView.aspx?id=OP_5A4_13123__000001_RM124RN,,,
Boots-Dartford - High St (in Boots UK),OP_5P9_3123__000003_DA11DE,OPT,48-52 High Street,,,Dartford,Kent,DA1 1DE,Tel: 01322 223935, - ,,,No ratings yet Rate it yourself - /Services/opticians/LeaveReview/DefaultView.aspx?id=OP_5P9_3123__000003_DA11DE,0,0,
Specsavers (Dartford),OP_5CM_11606__000002_DA11DE,OPT,54 High Street,,Dartford,Kent,,DA1 1DE,Tel: 01322 294040, - ,,,5 ratings Rate it yourself - /Services/opticians/LeaveReview/DefaultView.aspx?id=OP_5CM_11606__000002_DA11DE,,,
Linklater & Warren Opticians,RL_04122014_CO-4763,OPT,,30a High Street,,Chislehurst,Kent,BR7 5AN,Tel: 020 8295 5131, - ,,,2 ratings Rate it yourself - /Services/opticians/LeaveReview/DefaultView.aspx?id=RL_04122014_CO-4763,,,no
Dawsons Opticians (R Stewart),OP_5C2_7675__000001_RM64BE,OPT,1 Station Road,Chadwell Heath,Romford,,,RM6 4BE,Tel: 020 8590 1748, - ,,,No ratings yet Rate it yourself - /Services/opticians/LeaveReview/DefaultView.aspx?id=OP_5C2_7675__000001_RM64BE,0,0,
J I PARTRIDGE,OP_5NA45708__000001_RM64AD,OPT,1106 High Road,Chadwell Heath,London,,,RM6 4AD,Tel: 020 8590 1762, - ,,,No ratings yet Rate it yourself - /Services/opticians/LeaveReview/DefaultView.aspx?id=OP_5NA45708__000001_RM64AD,0,0,
Peters J H,OP_52C__000001_RM64LU,OPT,192 High Road,Chadwell Heath,Dagenham,Essex,,RM6 4LU,, - ,,,No ratings yet Rate it yourself - /Services/opticians/LeaveReview/DefaultView.aspx?id=OP_52C__000001_RM64LU,0,0,
Eye Deal Spectacles Limited,CO-3845,OPT,,108 De Vere Gardens,,Ilford,,IG1 3EE,, - ,,,No ratings yet Rate it yourself - /Services/opticians/LeaveReview/DefaultView.aspx?id=CO-3845,0,0,