Organisation Name,NACS Code,Organisation Type,Address1,Address2,Address3,Address4,Address5,PostCode,Telephone Number,Opening time,Value  (Opening time),Banding Classification  (Opening time),NHS.UK users rating,Value  (NHS.UK users rating),Banding Classification  (NHS.UK users rating),Car parking (Is there car parking at this organisation?)
R & J Optical,OP_5LE_13042__000001_SE172DJ,OPT,39-41 East Street,,London,,,SE17 2DJ,Tel: 020 7252 4544, - ,,,No ratings yet Rate it yourself - /Services/opticians/LeaveReview/DefaultView.aspx?id=OP_5LE_13042__000001_SE172DJ,0,0,
East Street Eye Clinic,D4K5V,OPT,,40 East Street,,London,,SE17 2DN,, - ,,,3 ratings Rate it yourself - /Services/opticians/LeaveReview/DefaultView.aspx?id=D4K5V,,,
Boots-London - Walworth Rd,OP_5LE_13044__000002_SE172TG,OPT,297 Walworth Road,,,London,,SE17 2TG,Tel: 0207 703 3814, - ,,,No ratings yet Rate it yourself - /Services/opticians/LeaveReview/DefaultView.aspx?id=OP_5LE_13044__000002_SE172TG,0,0,
Churchills of London Ltd,OP_5LE_7985__000001_SE171JE,OPT,220-222 Walworth Road,,London,,,SE17 1JE,Tel: 020 7703 0405, - ,,,No ratings yet Rate it yourself - /Services/opticians/LeaveReview/DefaultView.aspx?id=OP_5LE_7985__000001_SE171JE,0,0,
Pro-Vision Opticians,OP_5LE_6921__000002_SE15LU,OPT,204 Southwark Park Road,,,London,,SE16 3RW,Tel: 020 7237 8246, - ,,,No ratings yet Rate it yourself - /Services/opticians/LeaveReview/DefaultView.aspx?id=OP_5LE_6921__000002_SE15LU,0,0,yes
South London Resource Centre,OP_5LE_13045__000002_SE19RT,OPT,Department Of Ophthalmology,Guys Hospital,St Thomas Street,,,SE1 9RT,Tel: 020 7955 4307, - ,,,No ratings yet Rate it yourself - /Services/opticians/LeaveReview/DefaultView.aspx?id=OP_5LE_13045__000002_SE19RT,0,0,
Nash Opticians,OP_5LE_9940__000001_SE163RN,OPT,254 Southwark Park Road,,London,,,SE16 3RN,Tel: 020 7237 3230, - ,,,No ratings yet Rate it yourself - /Services/opticians/LeaveReview/DefaultView.aspx?id=OP_5LE_9940__000001_SE163RN,0,0,
Optical Express,EC3M 1BU_11111,OPT,17 Eastcheap,,,London,,EC3M 1BU,Tel: 0800 023 2020, - ,,,230 ratings Rate it yourself - /Services/opticians/LeaveReview/DefaultView.aspx?id=EC3M 1BU_11111,,,
DCM OPTICIAL CLINIC PLC,OP_5C3_14476__000001_EC3M1JU,OPT,17 Eastcheap,,London,,,EC3M 1BU,Tel: 0800 783 5555, - ,,,No ratings yet Rate it yourself - /Services/opticians/LeaveReview/DefaultView.aspx?id=OP_5C3_14476__000001_EC3M1JU,0,0,
Rodney Opticians,OP_5LE_7527__000002_SE57AF,OPT,7 Camberwell Green,,,London,,SE5 7AF,Tel: 020 7703 3615, - ,,,1 rating Rate it yourself - /Services/opticians/LeaveReview/DefaultView.aspx?id=OP_5LE_7527__000002_SE57AF,,,
CHATOO & SONS,OP_5C3_14490__000001_EC3,OPT,50b Fenchurch Street,London,London,,,EC3M 3JY,Tel: 020 7283 0280, - ,,,No ratings yet Rate it yourself - /Services/opticians/LeaveReview/DefaultView.aspx?id=OP_5C3_14490__000001_EC3,0,0,
HAWKES & WAINER,OP_5C3_14468__000001_EC3V1LT,OPT,57 Leadenhall Market,London,,,,EC3V 1LT,Tel: 020 7623 7300, - ,,,No ratings yet Rate it yourself - /Services/opticians/LeaveReview/DefaultView.aspx?id=OP_5C3_14468__000001_EC3V1LT,0,0,
S Squared Ltd,OP_5LD_12856__000001_SE17RG,OPT,33 Lower Marsh,Waterloo,London,,,SE1 7RG,Tel: 020 7633 0680, - ,,,No ratings yet Rate it yourself - /Services/opticians/LeaveReview/DefaultView.aspx?id=OP_5LD_12856__000001_SE17RG,0,0,
David Clulow Cornhill,OP_EC3V3PD_30659,OPT,,59-60 Cornhill,,London,,EC3V 3PD,Tel: 020 7929 3403, - ,,,No ratings yet Rate it yourself - /Services/opticians/LeaveReview/DefaultView.aspx?id=OP_EC3V3PD_30659,0,0,
Leightons Opticians & Hearing Care,10014__000001_EC3A3DL,OPT,,79 Leadenhall Street,,London,Greater London,EC3A 3DL,Tel: 020 7283 4538, - ,,,No ratings yet Rate it yourself - /Services/opticians/LeaveReview/DefaultView.aspx?id=10014__000001_EC3A3DL,0,0,
Specsavers Opticians,OP_5LE_1790__000003_SE155EW,OPT,Unit 3 Aylesham Centre,3 Rye Lane,Peckham,London,,SE15 5EW,Tel: 020 7277 7222, - ,,,No ratings yet Rate it yourself - /Services/opticians/LeaveReview/DefaultView.aspx?id=OP_5LE_1790__000003_SE155EW,0,0,
Eyecloud Opticians,,OPT,,45 Rye Lane,,Peckham,Greater London,SE15 5ER,Tel: 0208 732 0008, - ,,,N/A - Data not available,,,
"Optika, 44",OP_5LE_1775__000003_SE167LL,OPT,Surrey Quays Shopping Centre,Redriff Road,London,,,SE16 7LL,Tel: 020 7394 9818, - ,,,No ratings yet Rate it yourself - /Services/opticians/LeaveReview/DefaultView.aspx?id=OP_5LE_1775__000003_SE167LL,0,0,
Boots-London - Surrey Quays,OP_5LE_11830__000002_SE167LL,OPT,49/51 Surrey Quays Shopping Centre,,Redriff Road,London,,SE16 1LL,Tel: 0207 252 3115, - ,,,1 rating Rate it yourself - /Services/opticians/LeaveReview/DefaultView.aspx?id=OP_5LE_11830__000002_SE167LL,,,
Hattons Opticians,OP_5LD_190__000002_SE116EE,OPT,157 Lambeth Walk,,London,,,SE11 6EE,Tel: 020 7582 8877, - ,,,No ratings yet Rate it yourself - /Services/opticians/LeaveReview/DefaultView.aspx?id=OP_5LD_190__000002_SE116EE,0,0,
Boots-London - Poultry,10015__000001_EC2R8EJ,OPT,,36 Poultry,,London,,EC2R 8AJ,Tel: 0207 600 0087, - ,,,No ratings yet Rate it yourself - /Services/opticians/LeaveReview/DefaultView.aspx?id=10015__000001_EC2R8EJ,0,0,
Boots-Peckham,OP_5LE_157__000001_SE155BY,OPT,60-62 Rye Lane,,Peckham,London,,SE15 5BY,Tel: 0207 639 0924, - ,,,No ratings yet Rate it yourself - /Services/opticians/LeaveReview/DefaultView.aspx?id=OP_5LE_157__000001_SE155BY,0,0,
A & I Lask,OP_5LD_4638__000001_SW96BS,OPT,60a Brixton Road,,London,,,SW9 6BS,Tel: 020 7735 5309, - ,,,No ratings yet Rate it yourself - /Services/opticians/LeaveReview/DefaultView.aspx?id=OP_5LD_4638__000001_SW96BS,0,0,
Boots-London - Bishopsgate,OP_5C3_14475__000001_EC2M3UE,OPT,105-107 Bishopsgate,,,London,,EC2M 3UE,Tel: 020 7588 1840, - ,,,No ratings yet Rate it yourself - /Services/opticians/LeaveReview/DefaultView.aspx?id=OP_5C3_14475__000001_EC2M3UE,0,0,
UNIVERSITY VISION LTD,OP_5C3_14489__000001_EC2R7NJ,OPT,1d Copthall Avenue,Angel Court,London,,,EC2R 7NJ,Tel: 020 7726 4979, - ,,,No ratings yet Rate it yourself - /Services/opticians/LeaveReview/DefaultView.aspx?id=OP_5C3_14489__000001_EC2R7NJ,0,0,
OPTIKA,OP_5C3_14519__000002_EC2V5BT,OPT,David Clulow,99 Cheapside,London,,,EC2V 5BT,Tel: 020 7638 9554, - ,,,No ratings yet Rate it yourself - /Services/opticians/LeaveReview/DefaultView.aspx?id=OP_5C3_14519__000002_EC2V5BT,0,0,
HODD BARNES & DICKENS,OP_5C3_14480__000001_EC2V5BT,OPT,11 Masons Avenue,,,London,,EC2V 5HR,Tel: 02076009861, - ,,,1 rating Rate it yourself - /Services/opticians/LeaveReview/DefaultView.aspx?id=OP_5C3_14480__000001_EC2V5BT,,,
INFOCUS OPTICS (MR ZAMAN),10068__000002_E12LX,OPT,149 Cannon Street Road,,London,,,E1 2LX,Tel: 020 7488 4523, - ,,,5 ratings Rate it yourself - /Services/opticians/LeaveReview/DefaultView.aspx?id=10068__000002_E12LX,,,
CITY EYES OPTICIANS,OP_5C3_14461__000001_EC2M5TU,OPT,"Suite 91, 3rd Floor",65 London Wall,,London,,EC2M 5TU,Tel: 020 7638 6192, - ,,,No ratings yet Rate it yourself - /Services/opticians/LeaveReview/DefaultView.aspx?id=OP_5C3_14461__000001_EC2M5TU,0,0,
Boots-London - Cheapside,OP_5C3_14483__000001_EC26AT,OPT,Unit 7,12 Paternoster Square,Cheapside,London,,EC4M 7DX,Tel: 0207 248 2820, - ,,,2 ratings Rate it yourself - /Services/opticians/LeaveReview/DefaultView.aspx?id=OP_5C3_14483__000001_EC26AT,,,
Specsavers Opticians,OP_EC2M4LN_30666,OPT,,14 New Street,,London,,EC2M 4TR,Tel: 020 7377 4970, - ,,,No ratings yet Rate it yourself - /Services/opticians/LeaveReview/DefaultView.aspx?id=OP_EC2M4LN_30666,0,0,
EYE CONTACT,OP_5C3_14495__000001_EC27PN,OPT,Unit 2,The Arcade,Liverpool Street,London,,EC2M 7PN,Tel: 020 7626 7232, - ,,,No ratings yet Rate it yourself - /Services/opticians/LeaveReview/DefaultView.aspx?id=OP_5C3_14495__000001_EC27PN,0,0,
EYELINK (SECOND SIGHT LTD),10024__000001_EC4V6DU,OPT,11 Ludgate,Broadgate,London,,,EC4V 6DU,Tel: 020 7329 4462, - ,,,No ratings yet Rate it yourself - /Services/opticians/LeaveReview/DefaultView.aspx?id=10024__000001_EC4V6DU,0,0,
DAVID CLULOW,OP_5C3_14487__000001_EC25TT,OPT,43 London Wall,,London,,,EC2M 5TF,Tel: 020 7638 8167, - ,,,No ratings yet Rate it yourself - /Services/opticians/LeaveReview/DefaultView.aspx?id=OP_5C3_14487__000001_EC25TT,0,0,
Boots-London Wall,OP_5C3_14463__000001_EC2Y5ET,OPT,160-161 Salisbury House,,London Wall,London,,EC2M 5QD,Tel: 0207 628 8721, - ,,,No ratings yet Rate it yourself - /Services/opticians/LeaveReview/DefaultView.aspx?id=OP_5C3_14463__000001_EC2Y5ET,0,0,
SPECSAVERS (MRS HANIF),10019__000001_EC2M5QD,OPT,165 - 166 London Wall,,London,,,EC2M 5QD,Tel: 020 7330 1130, - ,,,No ratings yet Rate it yourself - /Services/opticians/LeaveReview/DefaultView.aspx?id=10019__000001_EC2M5QD,0,0,
VISION CARE FOR HOMELESS PEOPLE,10065__000001_E16LT,OPT,Crisis Skylight,64 Commercial Street,London,LONDON,,E1 6LT,Tel: 020 7426 5650, - ,,,No ratings yet Rate it yourself - /Services/opticians/LeaveReview/DefaultView.aspx?id=10065__000001_E16LT,0,0,
EYEDIOLOGY OPTICIANS,EYEDIOLOGY OPTICIANS__000003_E16BD,OPT,Eyediology Opticians London,79 Commercial Street,Spitalfields Market,London,,E1 6BD,Tel: 020 7377 2020, - ,,,1 rating Rate it yourself - /Services/opticians/LeaveReview/DefaultView.aspx?id=EYEDIOLOGY OPTICIANS__000003_E16BD,,,
WATNEY EYECARE,OP_5C4_12260__000001_E12PP,OPT,31 Watney Market,Off Commercial Road,London,,,E1 2PP,Tel: 020 7702 8256, - ,,,1 rating Rate it yourself - /Services/opticians/LeaveReview/DefaultView.aspx?id=OP_5C4_12260__000001_E12PP,,,
Vision Express,OP_EC4A2AX_30661,OPT,,108 Fleet St,,London,,EC4A 2AX,, - ,,,No ratings yet Rate it yourself - /Services/opticians/LeaveReview/DefaultView.aspx?id=OP_EC4A2AX_30661,0,0,
R Woodfall,OP_5LE_10117__000001_SE154TP,OPT,183 Rye Lane,,London,,,SE15 4TP,Tel: 020 7639 4520, - ,,,No ratings yet Rate it yourself - /Services/opticians/LeaveReview/DefaultView.aspx?id=OP_5LE_10117__000001_SE154TP,0,0,
OPTIX,OP_5C3_14494__000001_EC2,OPT,2 Exchange Arcade,Broadgate,London,,,EC2M 3WA,Tel: 020 7628 0330, - ,,,No ratings yet Rate it yourself - /Services/opticians/LeaveReview/DefaultView.aspx?id=OP_5C3_14494__000001_EC2,0,0,
GREGORY SEELEY,OP_5C3_14465__000001_EC4Y1HT,OPT,63 Fleet Street,City,,London,,EC4Y 1HT,Tel: 020 7353 1408, - ,,,No ratings yet Rate it yourself - /Services/opticians/LeaveReview/DefaultView.aspx?id=OP_5C3_14465__000001_EC4Y1HT,0,0,
BOWINGS,OP_5C3_14477__000001_EC4Y1JU,OPT,58 Fleet Street,London,London,,,EC4Y 1JU,Tel: 020 7353 7801, - ,,,No ratings yet Rate it yourself - /Services/opticians/LeaveReview/DefaultView.aspx?id=OP_5C3_14477__000001_EC4Y1JU,0,0,
"SACKWILD, MR L",OP_5C4_5384__000002_E11DB,OPT,237 Whitechapel Road,,London,,,E1 1DB,Tel: 020 7247 4442, - ,,,No ratings yet Rate it yourself - /Services/opticians/LeaveReview/DefaultView.aspx?id=OP_5C4_5384__000002_E11DB,0,0,
Obhrai & Son Ltd,OP_5LC_913__000001_WC2R1JA,OPT,146 Strand,,London,,,WC2R 1JA,Tel: 020 7379 5226, - ,,,No ratings yet Rate it yourself - /Services/opticians/LeaveReview/DefaultView.aspx?id=OP_5LC_913__000001_WC2R1JA,0,0,
London Eye Optique,OP_5K8_1865__000002_EC1Y8NX,OPT,2a Cherry Tree Walk,Whitecross Street,London,,,EC1Y 8NX,Tel: 020 7256 9778, - ,,,1 rating Rate it yourself - /Services/opticians/LeaveReview/DefaultView.aspx?id=OP_5K8_1865__000002_EC1Y8NX,,,
THE ROYAL LONDON HOSPITAL,OP_5C4_10238__000001_E11BB,OPT,Whitechapel Road,,London,,,E1 1BB,Tel: 020 7377 7000, - ,,,No ratings yet Rate it yourself - /Services/opticians/LeaveReview/DefaultView.aspx?id=OP_5C4_10238__000001_E11BB,0,0,
Strand Specsavers Ltd ,OP_WC2R0AG_29378,OPT,,114 Strand,,London,,WC2R 0AG,Tel: 020 3077 4950, - ,,,6 ratings Rate it yourself - /Services/opticians/LeaveReview/DefaultView.aspx?id=OP_WC2R0AG_29378,,,
Medirex Opticans,OP_5LD_12859__000002_SW82UX,OPT,28-29 Wilcox Close,Lambeth,London,,,SW8 2UD,Tel: 020 76221893, - ,,,No ratings yet Rate it yourself - /Services/opticians/LeaveReview/DefaultView.aspx?id=OP_5LD_12859__000002_SW82UX,0,0,
R Woodfall,OP_5LE_10118__000001_SE153QF,OPT,32 Nunhead Green,,London,,,SE15 3QF,Tel: 020 7732 5658, - ,,,No ratings yet Rate it yourself - /Services/opticians/LeaveReview/DefaultView.aspx?id=OP_5LE_10118__000001_SE153QF,0,0,
Boots-Holborn,OP_5K8_284__000002_EC1N2TD,OPT,122 Holborn,,,London,,EC1N 2TD,Tel: 0207 831 6467, - ,,,1 rating Rate it yourself - /Services/opticians/LeaveReview/DefaultView.aspx?id=OP_5K8_284__000002_EC1N2TD,,,
Anthoney Austin Opticians,OP_5K8_732__000001_,OPT,32-33 Cowcross Street,,London,,,EC1M 6DF,Tel: 020 7253 5570, - ,,,No ratings yet Rate it yourself - /Services/opticians/LeaveReview/DefaultView.aspx?id=OP_5K8_732__000001_,0,0,
Boots-London - Strand,OP_5LC_2028__000001_WC2R0QE,OPT,428 Strand,,,London,,WC2R 0QE,Tel: 0207 240 2049, - ,,,No ratings yet Rate it yourself - /Services/opticians/LeaveReview/DefaultView.aspx?id=OP_5LC_2028__000001_WC2R0QE,0,0,
Cult Vision,OP_EC1M7AA_071014,OPT,,14 Goswell Road,,London,,EC1M 7AA,Tel: 020 7251 1268, - ,,,No ratings yet Rate it yourself - /Services/opticians/LeaveReview/DefaultView.aspx?id=OP_EC1M7AA_071014,0,0,
KITE Eyewear,OPT_E27DJ_1,OPT,KITE Eyewear,25 Redchurch Street,,London,,E2 7DJ,Tel: 02037287777, - ,,,1 rating Rate it yourself - /Services/opticians/LeaveReview/DefaultView.aspx?id=OPT_E27DJ_1,,,no
Monoptics Ltd,OP_5LD_12861__000002_SW99AU,OPT,11 Stockwell Road,Stockwell,London,,,SW9 9AU,Tel: 020 7274 6636, - ,,,No ratings yet Rate it yourself - /Services/opticians/LeaveReview/DefaultView.aspx?id=OP_5LD_12861__000002_SW99AU,0,0,
Specsavers Opticians,OP 932__000001_WC1V7PU,OPT,"Unit 4, 311-318 High Holborn",Camden,London,,,WC1V 7PU,Tel: 020 7404 4432, - ,,,No ratings yet Rate it yourself - /Services/opticians/LeaveReview/DefaultView.aspx?id=OP 932__000001_WC1V7PU,0,0,
City Opticians,OP_5K7_8810__000001_WC2A1AA,OPT,75 Chancery Lane,,London,,,WC2A 1AA,Tel: 020 7405 4875, - ,,,No ratings yet Rate it yourself - /Services/opticians/LeaveReview/DefaultView.aspx?id=OP_5K7_8810__000001_WC2A1AA,0,0,
Unia Opticians,OP_5LC_7309__000002_SW1P2HY,OPT,9 Strutton Ground,,St James’s Park,London,,SW1P 2HY,Tel: 020 7222 0066, - ,,,No ratings yet Rate it yourself - /Services/opticians/LeaveReview/DefaultView.aspx?id=OP_5LC_7309__000002_SW1P2HY,0,0,
Vision Express Optical Lab,OP_5K7_6012__000001_WC1V6BG,OPT,37-39 High Holborn,,London,,,WC1V 6BG,Tel: 020 7831 2670, - ,,,No ratings yet Rate it yourself - /Services/opticians/LeaveReview/DefaultView.aspx?id=OP_5K7_6012__000001_WC1V6BG,0,0,
Opticians2u,OPT_EC2A4NE_1,OPT,,86-90 Paul Street,,London,,EC2A 4NE,Tel: 0207 887 2268, - ,,,No ratings yet Rate it yourself - /Services/opticians/LeaveReview/DefaultView.aspx?id=OPT_EC2A4NE_1,0,0,
New Era Optical,OP_5K8_103__000001_EC1N7TR,OPT,54 Leather Lane,,London,,,EC1N 7TP,Tel: 020 7405 0618, - ,,,No ratings yet Rate it yourself - /Services/opticians/LeaveReview/DefaultView.aspx?id=OP_5K8_103__000001_EC1N7TR,0,0,
David Clulow Opticians,OP_5LC_1840__000001_SW1H0HW,OPT,61-71 Victoria Street,,London,,,SW1H 0HW,Tel: 020 7233 2339, - ,,,2 ratings Rate it yourself - /Services/opticians/LeaveReview/DefaultView.aspx?id=OP_5LC_1840__000001_SW1H0HW,,,
R Woodfall Opticians,OP_5LD_6631__000002_SW97AW,OPT,396 Brixton Road,,London,,,SW9 7AW,Tel: 020 7274 4356, - ,,,No ratings yet Rate it yourself - /Services/opticians/LeaveReview/DefaultView.aspx?id=OP_5LD_6631__000002_SW97AW,0,0,
Paine & Hunter,OP_5LE_6817__000001_SE228EP,OPT,55 Lordship Lane,,London,,,SE22 8EP,Tel: 020 8299 1464, - ,,,2 ratings Rate it yourself - /Services/opticians/LeaveReview/DefaultView.aspx?id=OP_5LE_6817__000001_SE228EP,,,
David Clulow Opticians,OP_5LC_11207__000001_WC2E9JR,OPT,6 Neal Street,,London,,,WC2H 9LY,Tel: 020 7240 8284, - ,,,No ratings yet Rate it yourself - /Services/opticians/LeaveReview/DefaultView.aspx?id=OP_5LC_11207__000001_WC2E9JR,0,0,
Hodd Barnes Dickins,OP_5K7_4265__000001_WC1V6LF,OPT,94 High Holborn,,London,,,WC1V 6LF,Tel: 020 7242 3492, - ,,,No ratings yet Rate it yourself - /Services/opticians/LeaveReview/DefaultView.aspx?id=OP_5K7_4265__000001_WC1V6LF,0,0,
Quinlans Opticians,647000__000001_SW1V2PD,OPT,,34 Moreton Street,,London,,SW1V 2PD,Tel: 02072337770, - ,,,No ratings yet Rate it yourself - /Services/opticians/LeaveReview/DefaultView.aspx?id=647000__000001_SW1V2PD,0,0,
PC Shah,OP_5K7_066__000002_EC1V2NE,OPT,152 City Road,,London,,,EC1V 2NP,Tel: 0207 253 1309, - ,,,No ratings yet Rate it yourself - /Services/opticians/LeaveReview/DefaultView.aspx?id=OP_5K7_066__000002_EC1V2NE,0,0,
Eyecare Clinic,OP_5LC_8884__000001_WC2H7JS,OPT,19a Newport Court,,London,,,WC2H 7JS,Tel: 020 7734 3688, - ,,,No ratings yet Rate it yourself - /Services/opticians/LeaveReview/DefaultView.aspx?id=OP_5LC_8884__000001_WC2H7JS,0,0,
Clive Kay Opticians,OP_5LC_13369__000001_SW1V1RU,OPT,4 Warwick Way,,London,,,SW1V 1RU,Tel: 020 7834 7296, - ,,,No ratings yet Rate it yourself - /Services/opticians/LeaveReview/DefaultView.aspx?id=OP_5LC_13369__000001_SW1V1RU,0,0,
Clear Vision,OP_5LD_10787__000001_SW98LF,OPT,428 Coldharbour Lane,,London,,,SW9 8LF,Tel: 020 7737 3660, - ,,,No ratings yet Rate it yourself - /Services/opticians/LeaveReview/DefaultView.aspx?id=OP_5LD_10787__000001_SW98LF,0,0,
G BLEETMAN OPTICIANS,OP_5C4_10235__000001_E26LG,OPT,347 Bethnal Green Road,,London,,,E2 6LG,Tel: 020 7739 2356, - ,,,2 ratings Rate it yourself - /Services/opticians/LeaveReview/DefaultView.aspx?id=OP_5C4_10235__000001_E26LG,,,
In Focus Optics ,10049__000003_E15LU,OPT,White Horse Lane opticians,94 White Horse Lane,,London,,E1 4LR,Tel: 020 7791 0692, - ,,,7 ratings Rate it yourself - /Services/opticians/LeaveReview/DefaultView.aspx?id=10049__000003_E15LU,,,
Boots-London - Victoria,OP_5LC_5034__000003_SW1E5JL,OPT,145 Victoria Street,,London,London,,SW1E 5NH,Tel: 020 7834 4017, - ,,,No ratings yet Rate it yourself - /Services/opticians/LeaveReview/DefaultView.aspx?id=OP_5LC_5034__000003_SW1E5JL,0,0,
Washin Optical London,OP_5LC_2084__000001_W1R5PJ,OPT,14-20 Regent Street,,London,,,SW1Y 4PH,Tel: 020 7839 2091, - ,,,No ratings yet Rate it yourself - /Services/opticians/LeaveReview/DefaultView.aspx?id=OP_5LC_2084__000001_W1R5PJ,0,0,
South Bank Eye Centre,OP_5LD_10161__000001_SW82JL,OPT,395 Wandsworth Road,,London,,,SW8 2JL,Tel: 020 7720 0938, - ,,,No ratings yet Rate it yourself - /Services/opticians/LeaveReview/DefaultView.aspx?id=OP_5LD_10161__000001_SW82JL,0,0,
Optical Express,OP_5K7_5009__000002_WC2H8EL,OPT,219-229 Shaftesbury Avenue,,,London,,WC2H 8EL,Tel: 0800 023 2020, - ,,,No ratings yet Rate it yourself - /Services/opticians/LeaveReview/DefaultView.aspx?id=OP_5K7_5009__000002_WC2H8EL,0,0,
Schuller Opticians,OP_5K7_6010__000001_WC1N3LJ,OPT,44 Lambs Conduit Street,,London,,,WC1N 3LJ,Tel: 020 7404 2002, - ,,,No ratings yet Rate it yourself - /Services/opticians/LeaveReview/DefaultView.aspx?id=OP_5K7_6010__000001_WC1N3LJ,0,0,
Specsavers Opticians,OP_5LD_10155__000001_SW98EQ,OPT,492 Brixton Road,Brixton,London,,,SW9 8EQ,Tel: 020 7738 5999, - ,,,1 rating Rate it yourself - /Services/opticians/LeaveReview/DefaultView.aspx?id=OP_5LD_10155__000001_SW98EQ,,,
In-Focus Opticians,P7W6U,OPT,431-433 Bethnal Green Road,431-433 Bethnal Green Road,London,London,,E2 0AN,Tel: 020 7613 3553, - ,,,No ratings yet Rate it yourself - /Services/opticians/LeaveReview/DefaultView.aspx?id=P7W6U,0,0,
SPECSAVERS (MR HALAI),10051__000003_E20AN,OPT,409-417 Bethnal Green Road,,London,,,E2 0AN,Tel: 020 7324 7520, - ,,,No ratings yet Rate it yourself - /Services/opticians/LeaveReview/DefaultView.aspx?id=10051__000003_E20AN,0,0,
OPTIX AT BROADGATE (MR KARBARON),10021__000001_EC2M2WA,OPT,175 Bishops Gate 2 Exchange Arcade,,London,,,EC2M 2WA,Tel: 020 7628 0330, - ,,,No ratings yet Rate it yourself - /Services/opticians/LeaveReview/DefaultView.aspx?id=10021__000001_EC2M2WA,0,0,
Specsavers Opticians,OLO1192205LC__000001_SW1E5JH,OPT,1 Cathedral Walk,Cardinal Place Victoria,London,,,SW1E 5JH,Tel: 020 7976 4250, - ,,,No ratings yet Rate it yourself - /Services/opticians/LeaveReview/DefaultView.aspx?id=OLO1192205LC__000001_SW1E5JH,0,0,
My Eyes Opticians,OP_5K8_779__000001_EC1R4RA,OPT,68 Exmouth Market,,London,,,EC1R 4QP,Tel: 0207 278 8480, - ,,,No ratings yet Rate it yourself - /Services/opticians/LeaveReview/DefaultView.aspx?id=OP_5K8_779__000001_EC1R4RA,0,0,
Boots,OP_5HL_325__000001_W1B 5RA,OPT,Boots Opticians,44-46 regent street London,,Piccadilly,,W1B 5RA,Tel: 020 7287 2261, - ,,,No ratings yet Rate it yourself - /Services/opticians/LeaveReview/DefaultView.aspx?id=OP_5HL_325__000001_W1B 5RA,0,0,
Pimlico Eyecare ,OP_5LC_13402__000002_SW1V3EN,OPT,109 Lupus Street,,London,,,SW1V 3EN,Tel: 020 7233 8398, - ,,,No ratings yet Rate it yourself - /Services/opticians/LeaveReview/DefaultView.aspx?id=OP_5LC_13402__000002_SW1V3EN,0,0,
City University City Sight,OP_5K8_3701__000001_EC1V0HB,OPT,Tait Building,Northampton Square,London,London,,EC1V 0HB,Tel: 020 7040 8338, - ,,,No ratings yet Rate it yourself - /Services/opticians/LeaveReview/DefaultView.aspx?id=OP_5K8_3701__000001_EC1V0HB,0,0,
The Sight Centre,OP_5LF_7254__000001_SE84RT,OPT,78 Deptford High Street,,London,,,SE8 4RT,Tel: 020 8691 5500, - ,,,4 ratings Rate it yourself - /Services/opticians/LeaveReview/DefaultView.aspx?id=OP_5LF_7254__000001_SE84RT,,,
David Clulow Opticians,OP_5LC_9805__000001_W1V5PA,OPT,70 Old Compton Street,,London,,,W1D 4UL,Tel: 020 7437 4177, - ,,,No ratings yet Rate it yourself - /Services/opticians/LeaveReview/DefaultView.aspx?id=OP_5LC_9805__000001_W1V5PA,0,0,
EYE EMPORIUM,OP_5C4_9797__000001_E29QW,OPT,459 Bethnal Green Road,,London,,,E2 9QH,Tel: 020 7729 1900, - ,,,1 rating Rate it yourself - /Services/opticians/LeaveReview/DefaultView.aspx?id=OP_5C4_9797__000001_E29QW,,,
Eyecloud Opticians,V9X3R,OPT,,1-3 Deptford High Street,,Deptford,,SE8 4AD,Tel: 0208 694 1942, - ,,,2 ratings Rate it yourself - /Services/opticians/LeaveReview/DefaultView.aspx?id=V9X3R,,,
Banks Optometrists,OP_5LD_12858__000002_SW25SG,OPT,8 Acre Lane,Brixton,London,,,SW2 5SG,Tel: 020 7274 4414, - ,,,No ratings yet Rate it yourself - /Services/opticians/LeaveReview/DefaultView.aspx?id=OP_5LD_12858__000002_SW25SG,0,0,
BELSON & SONS,OP_5C4_10270__000001_E147DL,OPT,320 Burdett Road,,,London,,E14 7DL,Tel: 0800 980 3464, - ,,,2 ratings Rate it yourself - /Services/opticians/LeaveReview/DefaultView.aspx?id=OP_5C4_10270__000001_E147DL,,,
Globe Opticians,OP_N17QP_30664,OPT,,100 Murray Grove,,London,,N1 7QP,Tel: 020 7253 6769, - ,,,No ratings yet Rate it yourself - /Services/opticians/LeaveReview/DefaultView.aspx?id=OP_N17QP_30664,0,0,
Sight Care ,OP_5LC_1023__000001_W1D2DZ,OPT,45 Oxford Street,,London,,,W1D 2DZ,Tel: 020 7434 2385, - ,,,No ratings yet Rate it yourself - /Services/opticians/LeaveReview/DefaultView.aspx?id=OP_5LC_1023__000001_W1D2DZ,0,0,
DAVID CLULOW,10059__000002_E144QT,OPT,Promenade Level Cabot Place,Canary Wharf,London,London,,E14 4QT,Tel: 020 7345 9181, - ,,,No ratings yet Rate it yourself - /Services/opticians/LeaveReview/DefaultView.aspx?id=10059__000002_E144QT,0,0,
Specsavers Opticians,OP_5K7_729__000002_W1P9DP,OPT,"Unit 6, 6-17 Tottenham Court Road",,London,,,W1T 1BG,Tel: 020 7580 5115, - ,,,1 rating Rate it yourself - /Services/opticians/LeaveReview/DefaultView.aspx?id=OP_5K7_729__000002_W1P9DP,,,
Boots-London - Tottenham Court Road,OP_5K7_5005__000001_W1T2BE,OPT,16-17 Tottenham Court Road,,,London,,W1T 1BE,Tel: 0207 580 6510, - ,,,No ratings yet Rate it yourself - /Services/opticians/LeaveReview/DefaultView.aspx?id=OP_5K7_5005__000001_W1T2BE,0,0,
David Clulow Opticians,OP_5LC_12150__000001_SW1W9SJ,OPT,Victoria Place Shopping Centre,115 Buckingham Palace Road,London,,,SW1W 9SJ,Tel: 020 7233 8848, - ,,,No ratings yet Rate it yourself - /Services/opticians/LeaveReview/DefaultView.aspx?id=OP_5LC_12150__000001_SW1W9SJ,0,0,
DAVID CLULOW,OL/2307/01/5C4__000001_E145NY,OPT,45 Bank Street,Canary Wharf,London,London,,E14 5NY,Tel: 020 7519 6284, - ,,,No ratings yet Rate it yourself - /Services/opticians/LeaveReview/DefaultView.aspx?id=OL/2307/01/5C4__000001_E145NY,0,0,