Organisation Name,NACS Code,Organisation Type,Address1,Address2,Address3,Address4,Address5,PostCode,Telephone Number,Opening time,Value  (Opening time),Banding Classification  (Opening time),NHS.UK users rating,Value  (NHS.UK users rating),Banding Classification  (NHS.UK users rating),Car parking (Is there car parking at this organisation?)
Brian Ashby Opticians Ltd,TP425,OPT,,"24 West Park, Mottingham",,London,,SE9 4RQ,Tel: 020 8851 7422, - ,,,No ratings yet Rate it yourself - /Services/opticians/LeaveReview/DefaultView.aspx?id=TP425,0,0,
Grove Park opticians,OP_5LF__000003_SE120EF,OPT,384 Baring Road,Grove Park,London,,,SE12 0EF,, - ,,,No ratings yet Rate it yourself - /Services/opticians/LeaveReview/DefaultView.aspx?id=OP_5LF__000003_SE120EF,0,0,
Boots-London - Eltham,OP_5A8_14685__000001_SE91TD,OPT,93 Eltham High Street,,Eltham,London,,SE9 1TD,Tel: 0208 850 1783, - ,,,No ratings yet Rate it yourself - /Services/opticians/LeaveReview/DefaultView.aspx?id=OP_5A8_14685__000001_SE91TD,0,0,
Colletts Opticians Ltd,OP_5A8_5844__000001_SE95DA,OPT,43 Passey Place,Eltham,London,,,SE9 5DA,Tel: 020 8850 3415, - ,,,No ratings yet Rate it yourself - /Services/opticians/LeaveReview/DefaultView.aspx?id=OP_5A8_5844__000001_SE95DA,0,0,
Specsavers Opticians,OP_5A8_9996__000001_SE91BJ,OPT,126 Eltham High Street,,Eltham,London,,SE9 1BJ,Tel: 020 8850 8800, - ,,,No ratings yet Rate it yourself - /Services/opticians/LeaveReview/DefaultView.aspx?id=OP_5A8_9996__000001_SE91BJ,0,0,
Points Of View Opticians,OP_5LF_10152__000002_BR14PQ,OPT,495a Bromley Road,,Bromley,Kent,,BR1 4PQ,Tel: 020 8697 2321, - ,,,No ratings yet Rate it yourself - /Services/opticians/LeaveReview/DefaultView.aspx?id=OP_5LF_10152__000002_BR14PQ,0,0,
Butcher Curnow Ophthalmic Opticians,OP_5LF_12480__000001_SE30BU,OPT,19 Tranquil Vale,,London,,,SE3 0BU,Tel: 020 8318 1732, - ,,,No ratings yet Rate it yourself - /Services/opticians/LeaveReview/DefaultView.aspx?id=OP_5LF_12480__000001_SE30BU,0,0,
Infocus,Q4T1O,OPT,,13 Montpelier Vale,,Blackheath,,SE3 0TA,Tel: 020 8852 4406, - ,,,No ratings yet Rate it yourself - /Services/opticians/LeaveReview/DefaultView.aspx?id=Q4T1O,0,0,
K Rowland Ltd,OP_5LF_8908__000003_SE64HW,OPT,112 Rushey Green,,London,Catford,,SE6 4HW,Tel: 020 8690 7734, - ,,,No ratings yet Rate it yourself - /Services/opticians/LeaveReview/DefaultView.aspx?id=OP_5LF_8908__000003_SE64HW,0,0,
Catford Specsavers,5LF 41__000003_SE64HQ,OPT,,130-134 Rushey Green,Catford,London,,SE6 4HQ,Tel: 02083142370, - ,,,No ratings yet Rate it yourself - /Services/opticians/LeaveReview/DefaultView.aspx?id=5LF 41__000003_SE64HQ,0,0,
Ronald Brown Opticians,OP_5LF_1993__000002_SE64HQ,OPT,154 Rushey Green,,Catford,London,,SE6 4HQ,Tel: 020 8690 6788, - ,,,No ratings yet Rate it yourself - /Services/opticians/LeaveReview/DefaultView.aspx?id=OP_5LF_1993__000002_SE64HQ,0,0,
Eyeland Visioncare,OP_5LF_7832__000001_SE136AA,OPT,195 Lewisham High Street,,London,,,SE13 6AA,Tel: 020 8852 0761, - ,,,No ratings yet Rate it yourself - /Services/opticians/LeaveReview/DefaultView.aspx?id=OP_5LF_7832__000001_SE136AA,0,0,
Specsavers Opticians,OP_5LF_8691__000001_SE136JL,OPT,174 Lewisham High Street,Lewisham,London,,,SE13 6JL,Tel: 020 8297 2777, - ,,,No ratings yet Rate it yourself - /Services/opticians/LeaveReview/DefaultView.aspx?id=OP_5LF_8691__000001_SE136JL,0,0,
Vision Express (UK) Ltd,OP_5LF_12228__000001_SE137EP,OPT,Unit 39,The Lewisham Centre,Lewisham,,,SE13 7EP,Tel: 0208 318 7147, - ,,,No ratings yet Rate it yourself - /Services/opticians/LeaveReview/DefaultView.aspx?id=OP_5LF_12228__000001_SE137EP,0,0,
Linklater & Warren Opticians,RL_04122014_CO-4763,OPT,,30a High Street,,Chislehurst,Kent,BR7 5AN,Tel: 020 8295 5131, - ,,,No ratings yet Rate it yourself - /Services/opticians/LeaveReview/DefaultView.aspx?id=RL_04122014_CO-4763,0,0,no
Blackheath Eyecare,OP_5A8_14675__000002_SE37BT,OPT,Blackheath Eyecare Opticians,16 Old Dover Road,Blackheath,London,,SE3 7BT,Tel: 0208 305 1060, - ,,,No ratings yet Rate it yourself - /Services/opticians/LeaveReview/DefaultView.aspx?id=OP_5A8_14675__000002_SE37BT,0,0,yes
Coton & Hamblin Ltd,OP_5A8_14673__000002_SE37DH,OPT,178 Westcombe Hill,Blackheath,London,,,SE3 7DH,Tel: 0208 858 1858, - ,,,No ratings yet Rate it yourself - /Services/opticians/LeaveReview/DefaultView.aspx?id=OP_5A8_14673__000002_SE37DH,0,0,
Oakmead Opticians,02991__000002_BR75LX,OPT,Sunnyways,Prince Imperial Way,Chislehurst,Kent,,BR7 5LX,, - ,,,No ratings yet Rate it yourself - /Services/opticians/LeaveReview/DefaultView.aspx?id=02991__000002_BR75LX,0,0,
Page & Small Opticians,OP_5A8_14683__000002_SE77ED,OPT,213 Charlton Road,,Charlton,London,,SE7 7ED,Tel: 0208 293 9493, - ,,,No ratings yet Rate it yourself - /Services/opticians/LeaveReview/DefaultView.aspx?id=OP_5A8_14683__000002_SE77ED,0,0,yes
Specsavers Opticians,OP_5A7_1174__000003_BR11EY,OPT,146 High Street,,Bromley,,,BR1 1EZ,Tel: 020 8466 9666, - ,,,No ratings yet Rate it yourself - /Services/opticians/LeaveReview/DefaultView.aspx?id=OP_5A7_1174__000003_BR11EY,0,0,
Boots-Bromley - The Glades,OP_5A7_7470__000001_BR11DD,OPT,40 The Glades,,,Bromley,Kent,BR1 2QG,Tel: 0208 460 4944, - ,,,No ratings yet Rate it yourself - /Services/opticians/LeaveReview/DefaultView.aspx?id=OP_5A7_7470__000001_BR11DD,0,0,
The Bromley Eye Centre,2BR1 1DD__000003_BR11DD,OPT,"Unit 48, The Glades",,Bromley,Kent,,BR1 1DD,Tel: 020 8466 8333, - ,,,No ratings yet Rate it yourself - /Services/opticians/LeaveReview/DefaultView.aspx?id=2BR1 1DD__000003_BR11DD,0,0,
Vision Express (UK) Limited,OP_5A7_11781__000002_BR11DN,OPT,29 Glades Shopping Centre,High Street,Bromley,,,BR1 1DN,Tel: 020 8313 1545, - ,,,No ratings yet Rate it yourself - /Services/opticians/LeaveReview/DefaultView.aspx?id=OP_5A7_11781__000002_BR11DN,0,0,
M&S Opticians,,OPT,,123 High Street,,Bromley,,BR1 1JL,Tel: 0203 0054415, - ,,,N/A - Data not available,,,
iCare Optical,OPT_SE78UD_1,OPT,,"16 The Village, Charlton",,London,,SE7 8UD,Tel: 020 8856 6034, - ,,,No ratings yet Rate it yourself - /Services/opticians/LeaveReview/DefaultView.aspx?id=OPT_SE78UD_1,0,0,
Glasses Lab,01-19725,OPT,,62 High Street,,Bromley,,BR1 1EG,Tel: 0208 466 1315, - ,,,No ratings yet Rate it yourself - /Services/opticians/LeaveReview/DefaultView.aspx?id=01-19725,0,0,
William J Wilkinson Limited,OP_5A7_4486__000001_BR11EA,OPT,42 High Street,,Bromley,,,BR1 1EA,Tel: 020 8464 5347, - ,,,No ratings yet Rate it yourself - /Services/opticians/LeaveReview/DefaultView.aspx?id=OP_5A7_4486__000001_BR11EA,0,0,
Crofton Park Opticians,OP_5LF_2739__000002_SE42BY,OPT,384 Brockley Road,,London,,,SE4 2BY,Tel: 020 8692 8335, - ,,,No ratings yet Rate it yourself - /Services/opticians/LeaveReview/DefaultView.aspx?id=OP_5LF_2739__000002_SE42BY,0,0,
Freeman Of Greenwich,OP_5A8_14682__000002_SE109EQ,OPT,205 Trafalgar Road,,Greenwich,London,,SE10 9EQ,Tel: 0208 858 2481, - ,,,No ratings yet Rate it yourself - /Services/opticians/LeaveReview/DefaultView.aspx?id=OP_5A8_14682__000002_SE109EQ,0,0,
Paine & Hunter,OP_5A8_2738__000003_SE183SH,OPT,50 Herbert Road,,Plumstead,London,,SE18 3SH,Tel: 020 8316 1040, - ,,,No ratings yet Rate it yourself - /Services/opticians/LeaveReview/DefaultView.aspx?id=OP_5A8_2738__000003_SE183SH,0,0,
Specsavers Charlton Riverside,OLC007115A8,OPT,,7-11 Gallions Road,,London,,SE7 7SA,, - ,,,No ratings yet Rate it yourself - /Services/opticians/LeaveReview/DefaultView.aspx?id=OLC007115A8,0,0,
Eyecloud Opticians,V9X3R,OPT,,1-3 Deptford High Street,,Deptford,,SE8 4AD,Tel: 0208 694 1942, - ,,,No ratings yet Rate it yourself - /Services/opticians/LeaveReview/DefaultView.aspx?id=V9X3R,0,0,
Colletts Opticians Ltd,OP_5AX_2176__000001_DA146ND,OPT,103 Main Road,Sidcup,Kent,,,DA14 6ND,Tel: 0208 300 3222, - ,,,No ratings yet Rate it yourself - /Services/opticians/LeaveReview/DefaultView.aspx?id=OP_5AX_2176__000001_DA146ND,0,0,
The Sight Centre,OP_5LF_7254__000001_SE84RT,OPT,78 Deptford High Street,,London,,,SE8 4RT,Tel: 020 8691 5500, - ,,,No ratings yet Rate it yourself - /Services/opticians/LeaveReview/DefaultView.aspx?id=OP_5LF_7254__000001_SE84RT,0,0,
Specsavers Opticians,BR3 1EW__000002_BR31EW,OPT,176 High Street,,Beckenham,Kent,,BR3 1EW,Tel: 020 8658 5252, - ,,,No ratings yet Rate it yourself - /Services/opticians/LeaveReview/DefaultView.aspx?id=BR3 1EW__000002_BR31EW,0,0,
S Gothelf & Associates,OP_5AX_10318__000001_DA159NB,OPT,10 Wellington Parade,,Sidcup,Kent,,DA15 9NB,Tel: 0208 303 3935, - ,,,No ratings yet Rate it yourself - /Services/opticians/LeaveReview/DefaultView.aspx?id=OP_5AX_10318__000001_DA159NB,0,0,
Hatton Opticians,OP_5LF_234__000001_SE232ND,OPT,4 Westbourne Terrace,,London,,,SE23 2ND,Tel: 020 8699 5575, - ,,,No ratings yet Rate it yourself - /Services/opticians/LeaveReview/DefaultView.aspx?id=OP_5LF_234__000001_SE232ND,0,0,
Boots Opticians,OP_5A7_112__000002_BR31ED,OPT,64 High Street,,Beckenham,Beckenham,,BR3 1EN,Tel: 020 8650 0033, - ,,,No ratings yet Rate it yourself - /Services/opticians/LeaveReview/DefaultView.aspx?id=OP_5A7_112__000002_BR31ED,0,0,
Boots-Beckenham,BR3 1EN_98721,OPT,,64 High Street,,Beckenham,Kent,BR3 1EN,Tel: 0208 650 0033, - ,,,No ratings yet Rate it yourself - /Services/opticians/LeaveReview/DefaultView.aspx?id=BR3 1EN_98721,0,0,
Specsavers Opticians,OP_5AX_14708__000001_DA146ED,OPT,53 High Street,Sidcup,Kent,,,DA14 6ED,Tel: 0208 308 3500, - ,,,No ratings yet Rate it yourself - /Services/opticians/LeaveReview/DefaultView.aspx?id=OP_5AX_14708__000001_DA146ED,0,0,
Ellis & Edwards Opticians,BR3 1DZ__000001_BR31DZ,OPT,254 High Street,,Beckenham,Kent,,BR3 1DZ,Tel: 020 8658 2313, - ,,,No ratings yet Rate it yourself - /Services/opticians/LeaveReview/DefaultView.aspx?id=BR3 1DZ__000001_BR31DZ,0,0,
Steven Harris Opticians,OP_5AX_14681__000001_DA163PG,OPT,101 Bellegrove Road,,Welling,Kent,,DA16 3PG,Tel: 0208 304 2423, - ,,,No ratings yet Rate it yourself - /Services/opticians/LeaveReview/DefaultView.aspx?id=OP_5AX_14681__000001_DA163PG,0,0,
Steven Harris Opticians,OP_5A7_2625__000001_BR33NP,OPT,2-6 Village Way,,Beckenham,,,BR3 3NP,Tel: 020 8650 6172, - ,,,No ratings yet Rate it yourself - /Services/opticians/LeaveReview/DefaultView.aspx?id=OP_5A7_2625__000001_BR33NP,0,0,
Marratt & Ellis,OP_5LF_10028__000001_SE233HF,OPT,50 London Road,,London,,,SE23 3HF,Tel: 020 8699 3196, - ,,,No ratings yet Rate it yourself - /Services/opticians/LeaveReview/DefaultView.aspx?id=OP_5LF_10028__000001_SE233HF,0,0,
Jay Opticians,OP_5LF_10821__000002_SE265EX,OPT,23 Sydenham Road,,London,,,SE26 5EX,Tel: 020 8778 7956, - ,,,No ratings yet Rate it yourself - /Services/opticians/LeaveReview/DefaultView.aspx?id=OP_5LF_10821__000002_SE265EX,0,0,
Tesco Opticians,OP_SE186JR_85036,OPT,,13 Old Stable Row,,London,,SE18 6JR,Tel: 020 8787 5538, - ,,,No ratings yet Rate it yourself - /Services/opticians/LeaveReview/DefaultView.aspx?id=OP_SE186JR_85036,0,0,
R Woodfall Opticians,OP_5LF_6203__000003_SE265QW,OPT,6 Sydenham Road,,London,,,SE26 5QW,Tel: 020 8778 4557, - ,,,No ratings yet Rate it yourself - /Services/opticians/LeaveReview/DefaultView.aspx?id=OP_5LF_6203__000003_SE265QW,0,0,
Coton & Hamblin Ltd,OP_5A8_1772__000001_SE186PQ,OPT,11 Wellington Street,Woolwich,London,,,SE18 6PQ,Tel: 020 8854 1491, - ,,,No ratings yet Rate it yourself - /Services/opticians/LeaveReview/DefaultView.aspx?id=OP_5A8_1772__000001_SE186PQ,0,0,
Paine & Hunter Optometrists,OP_5A8_10__000002_SE182NB,OPT,1 The Slade,Plumstead,London,,,SE18 2NB,Tel: 0208 3161040, - ,,,No ratings yet Rate it yourself - /Services/opticians/LeaveReview/DefaultView.aspx?id=OP_5A8_10__000002_SE182NB,0,0,
R F Linklater & Partners,OP_5AX_8989__000001_DA161TG,OPT,136 High Street,,Welling,Kent,,DA16 1TJ,Tel: 0208 303 4963, - ,,,No ratings yet Rate it yourself - /Services/opticians/LeaveReview/DefaultView.aspx?id=OP_5AX_8989__000001_DA161TG,0,0,
Second Sight,OP_5AX_2062__000002_DA163PG,OPT,81 Welling High Street,,Welling,Kent,,DA16 1TY,Tel: 0208 301 4586, - ,,,No ratings yet Rate it yourself - /Services/opticians/LeaveReview/DefaultView.aspx?id=OP_5AX_2062__000002_DA163PG,0,0,
Virtue Specs,V2H8A,OPT,,53 Powis Street,Woolwich,London,Greater London,SE18 6HZ,Tel: 02033027460, - ,,,No ratings yet Rate it yourself - /Services/opticians/LeaveReview/DefaultView.aspx?id=V2H8A,0,0,
KA Rowland ,OP_5A8_10593__000001_SE186LF,OPT,8 Powis Street,,Woolwich,London,,SE18 6LF,Tel: 020 8854 8750, - ,,,No ratings yet Rate it yourself - /Services/opticians/LeaveReview/DefaultView.aspx?id=OP_5A8_10593__000001_SE186LF,0,0,
Specsavers Opticians,OP_5A8_5021__000001_SE186LQ,OPT,66 Powis Street,,Woolwich,London,,SE18 6LQ,Tel: 0208 316 1663, - ,,,No ratings yet Rate it yourself - /Services/opticians/LeaveReview/DefaultView.aspx?id=OP_5A8_5021__000001_SE186LQ,0,0,
The Chemist,OP_5A8_800__000001_SE186HZ,OPT,Boots the Chemist,12-16 Hare Street,Woolwich,London,,SE18 6NB,Tel: 02088542602, - ,,,No ratings yet Rate it yourself - /Services/opticians/LeaveReview/DefaultView.aspx?id=OP_5A8_800__000001_SE186HZ,0,0,
John Lewis Opticians ,OP_5A8_14710__000001_SE187BZ,OPT,13 Plumstead,,Woolwich,London,,SE18 7BZ,Tel: 0208 316 1121, - ,,,No ratings yet Rate it yourself - /Services/opticians/LeaveReview/DefaultView.aspx?id=OP_5A8_14710__000001_SE187BZ,0,0,
Specsavers Opticians,16797__000002_SE207PF,OPT,191 High Street,,Penge,London,,SE20 7PF,Tel: 020 8659 4040, - ,,,No ratings yet Rate it yourself - /Services/opticians/LeaveReview/DefaultView.aspx?id=16797__000002_SE207PF,0,0,
Maxivise Eyecare Centre,OP_5A7_1649__000001_SE207HB,OPT,,88 High Street,London,Penge,,SE20 7HB,Tel: 020 8659 4342, - ,,,No ratings yet Rate it yourself - /Services/opticians/LeaveReview/DefaultView.aspx?id=OP_5A7_1649__000001_SE207HB,0,0,
ASDA OPTICIANS,OP_5C4_14551__000003_E143BT,OPT,151 East Ferry Road,151 East Ferry Road,Isle of dogs,London,,E14 3BT,Tel: 0207 0687412, - ,,,No ratings yet Rate it yourself - /Services/opticians/LeaveReview/DefaultView.aspx?id=OP_5C4_14551__000003_E143BT,0,0,
R Woodfall,OP_5LE_10118__000001_SE153QF,OPT,32 Nunhead Green,,London,,,SE15 3QF,Tel: 020 7732 5658, - ,,,No ratings yet Rate it yourself - /Services/opticians/LeaveReview/DefaultView.aspx?id=OP_5LE_10118__000001_SE153QF,0,0,
Steven Harris Opticians,OP_5A7_831__000002_BR51NA,OPT,16 Station Square,Petts Wood,Orpington,Kent,,BR5 1NA,Tel: 01689 831726, - ,,,No ratings yet Rate it yourself - /Services/opticians/LeaveReview/DefaultView.aspx?id=OP_5A7_831__000002_BR51NA,0,0,
K A Rowland ,OP_5A8_986__000002_SE181PP,OPT,2 Lakedale Road,,Plumstead,London,,SE18 1PP,Tel: 0208 854 2406, - ,,,No ratings yet Rate it yourself - /Services/opticians/LeaveReview/DefaultView.aspx?id=OP_5A8_986__000002_SE181PP,0,0,
Boots-Petts Wood,BR5 1DE__000001_BR51DE,OPT,12 Chatsworth Parade,,,Petts Wood,Kent,BR5 1DF,Tel: 01689 823 250, - ,,,No ratings yet Rate it yourself - /Services/opticians/LeaveReview/DefaultView.aspx?id=BR5 1DE__000001_BR51DE,0,0,
Dermott Optical Limited,5A7:20__000001_BR33RB,OPT,147 Croydon Road,,Beckenham,Kent,,BR3 3RB,Tel: 020 8663 3323, - ,,,No ratings yet Rate it yourself - /Services/opticians/LeaveReview/DefaultView.aspx?id=5A7:20__000001_BR33RB,0,0,
R Woodfall,OP_5LE_10117__000001_SE154TP,OPT,183 Rye Lane,,London,,,SE15 4TP,Tel: 020 7639 4520, - ,,,No ratings yet Rate it yourself - /Services/opticians/LeaveReview/DefaultView.aspx?id=OP_5LE_10117__000001_SE154TP,0,0,
Paine & Hunter,OP_5LE_6817__000001_SE228EP,OPT,55 Lordship Lane,,London,,,SE22 8EP,Tel: 020 8299 1464, - ,,,No ratings yet Rate it yourself - /Services/opticians/LeaveReview/DefaultView.aspx?id=OP_5LE_6817__000001_SE228EP,0,0,
Boots-Hayes,BR2 7EH__000001_BR27EH,OPT,2 Station Buildings,Station Approach,Hayes,Kent,,BR2 7EN,Tel: 020 8462 5332, - ,,,No ratings yet Rate it yourself - /Services/opticians/LeaveReview/DefaultView.aspx?id=BR2 7EH__000001_BR27EH,0,0,
Boots-Peckham,OP_5LE_157__000001_SE155BY,OPT,60-62 Rye Lane,,Peckham,London,,SE15 5BY,Tel: 0207 639 0924, - ,,,No ratings yet Rate it yourself - /Services/opticians/LeaveReview/DefaultView.aspx?id=OP_5LE_157__000001_SE155BY,0,0,
Specsavers Opticians,OP_5LE_1790__000003_SE155EW,OPT,Unit 3 Aylesham Centre,3 Rye Lane,Peckham,London,,SE15 5EW,Tel: 020 7277 7222, - ,,,No ratings yet Rate it yourself - /Services/opticians/LeaveReview/DefaultView.aspx?id=OP_5LE_1790__000003_SE155EW,0,0,
DAVID CLULOW,OL/2307/01/5C4__000001_E145NY,OPT,45 Bank Street,Canary Wharf,London,London,,E14 5NY,Tel: 020 7519 6284, - ,,,No ratings yet Rate it yourself - /Services/opticians/LeaveReview/DefaultView.aspx?id=OL/2307/01/5C4__000001_E145NY,0,0,
Eyecloud Opticians,,OPT,,45 Rye Lane,,Peckham,Greater London,SE15 5ER,Tel: 0208 732 0008, - ,,,N/A - Data not available,,,
VISION EXPRESS,OP_5C4_11071__000001_E145AH,OPT,Canada Place,Canary Wharf,London,,,E14 5AH,Tel: 020 7513 2408, - ,,,No ratings yet Rate it yourself - /Services/opticians/LeaveReview/DefaultView.aspx?id=OP_5C4_11071__000001_E145AH,0,0,
DAVID CLULOW,10059__000002_E144QT,OPT,Promenade Level Cabot Place,Canary Wharf,London,London,,E14 4QT,Tel: 020 7345 9181, - ,,,No ratings yet Rate it yourself - /Services/opticians/LeaveReview/DefaultView.aspx?id=10059__000002_E144QT,0,0,
Miller & Son (Opticians) Ltd,OP_5K9_9904__000001_SE192ET,OPT,28-30 Church Road,,London,,,SE19 2ET,Tel: 020 8653 1366, - ,,,No ratings yet Rate it yourself - /Services/opticians/LeaveReview/DefaultView.aspx?id=OP_5K9_9904__000001_SE192ET,0,0,
Boots-West Wickham,OP_5A7__000002_BR40PX,OPT,115 Station Road,,,West Wickham,Kent,BR4 0PX,Tel: 0208 777 2211, - ,,,No ratings yet Rate it yourself - /Services/opticians/LeaveReview/DefaultView.aspx?id=OP_5A7__000002_BR40PX,0,0,
"Optika, 44",OP_5LE_1775__000003_SE167LL,OPT,Surrey Quays Shopping Centre,Redriff Road,London,,,SE16 7LL,Tel: 020 7394 9818, - ,,,No ratings yet Rate it yourself - /Services/opticians/LeaveReview/DefaultView.aspx?id=OP_5LE_1775__000003_SE167LL,0,0,
Boots-London - Surrey Quays,OP_5LE_11830__000002_SE167LL,OPT,49/51 Surrey Quays Shopping Centre,,Redriff Road,London,,SE16 1LL,Tel: 0207 252 3115, - ,,,No ratings yet Rate it yourself - /Services/opticians/LeaveReview/DefaultView.aspx?id=OP_5LE_11830__000002_SE167LL,0,0,
J C Setton Opticians,OP_5A7_1927__000001_BR40NH,OPT,58 High Street,,West Wickham,,,BR4 0NH,Tel: 020 8777 1106, - ,,,No ratings yet Rate it yourself - /Services/opticians/LeaveReview/DefaultView.aspx?id=OP_5A7_1927__000001_BR40NH,0,0,
Specsavers Opticians,19223__000002_BR40NH,OPT,15 High Street,,West Wickham,Kent,,BR4 0LP,Tel: 020 8916 8280, - ,,,No ratings yet Rate it yourself - /Services/opticians/LeaveReview/DefaultView.aspx?id=19223__000002_BR40NH,0,0,
Crystal Eye Centre,OP_5K9_14393__000002_SE191XX,OPT,20 Westow Hill,Upper Norwood,,London,,SE19 1RX,Tel: 0208 766 7476, - ,,,No ratings yet Rate it yourself - /Services/opticians/LeaveReview/DefaultView.aspx?id=OP_5K9_14393__000002_SE191XX,0,0,
AK Bennett Opticians,OP_5A7_1909__000001_BR40LS,OPT,65 High Street,65 High Street,West Wickham,Bromley,Kent,BR4 0LS,Tel: 020 8777 1337, - ,,,No ratings yet Rate it yourself - /Services/opticians/LeaveReview/DefaultView.aspx?id=OP_5A7_1909__000001_BR40LS,0,0,
Broadgreen Eye Centre,OP - 5N5__000001_CR07TH,OPT,254 London Road,,West Croydon,Surrey,,CR0 7TH,, - ,,,No ratings yet Rate it yourself - /Services/opticians/LeaveReview/DefaultView.aspx?id=OP - 5N5__000001_CR07TH,0,0,
Vision Express (UK) Limited,BR5 3RP__000001_BR53RP,OPT,"Unit 9,",Nugent Shopping Park,Orpington,Kent,,BR5 3RP,Tel: 01689 875737, - ,,,No ratings yet Rate it yourself - /Services/opticians/LeaveReview/DefaultView.aspx?id=BR5 3RP__000001_BR53RP,0,0,
Roger Pope & Partners,OP_5LE_4217__000002_SE217BN,OPT,96 Park Hall Road,,,London,,SE21 8BW,Tel: 020 8299 0230, - ,,,No ratings yet Rate it yourself - /Services/opticians/LeaveReview/DefaultView.aspx?id=OP_5LE_4217__000002_SE217BN,0,0,
Specsavers Opticians,OP_5AX_227__000001_DA67DQ,OPT,116a Broadway,Bexleyheath,Kent,,,DA6 7DQ,Tel: 0208 298 9920, - ,,,No ratings yet Rate it yourself - /Services/opticians/LeaveReview/DefaultView.aspx?id=OP_5AX_227__000001_DA67DQ,0,0,
Linklater Optometrists,OP_5AX_10048__000002_DA67DQ,OPT,Linklaters Optometrists,120 Broadway,Bexleyheath,Kent,,DA6 7DQ,Tel: 0208 303 4014, - ,,,No ratings yet Rate it yourself - /Services/opticians/LeaveReview/DefaultView.aspx?id=OP_5AX_10048__000002_DA67DQ,0,0,no
Nash Opticians,OP_5LE_9940__000001_SE163RN,OPT,254 Southwark Park Road,,London,,,SE16 3RN,Tel: 020 7237 3230, - ,,,No ratings yet Rate it yourself - /Services/opticians/LeaveReview/DefaultView.aspx?id=OP_5LE_9940__000001_SE163RN,0,0,
Asda Vision,OP_5C5_14665__000002_E64JP,OPT,Asda Store,Tollgate Road,,London,,E6 4JP,Tel: 0207 5402952, - ,,,No ratings yet Rate it yourself - /Services/opticians/LeaveReview/DefaultView.aspx?id=OP_5C5_14665__000002_E64JP,0,0,
Vision Express Ltd,OP_5AX_5408__000003_DA67JJ,OPT,5 The Mall,Broadway Shopping Centre,Bexleyheath,Kent,,DA6 7JJ,Tel: 0208 298 9629, - ,,,No ratings yet Rate it yourself - /Services/opticians/LeaveReview/DefaultView.aspx?id=OP_5AX_5408__000003_DA67JJ,0,0,
Boots-Bexleyheath,OP_5AX_10393__000002_DA67JJ,OPT,25 The Mall,Broadway Shopping Centre,Bexleyheath,Kent,,DA6 7JJ,Tel: 020 8301 5656, - ,,,No ratings yet Rate it yourself - /Services/opticians/LeaveReview/DefaultView.aspx?id=OP_5AX_10393__000002_DA67JJ,0,0,
EYEWORLD OPTICS,OP_5C4_14550__000001_E146AH,OPT,1 Market Way,Chrisp Street,London,London,,E14 6AH,Tel: 020 7987 0977, - ,,,No ratings yet Rate it yourself - /Services/opticians/LeaveReview/DefaultView.aspx?id=OP_5C4_14550__000001_E146AH,0,0,
COHEN OPTICIANS,OP_5C5_12840__000001_E161EN,OPT,124 Barking Road,,London,,,E16 1EN,Tel: 020 7476 4951, - ,,,No ratings yet Rate it yourself - /Services/opticians/LeaveReview/DefaultView.aspx?id=OP_5C5_12840__000001_E161EN,0,0,
Pro-Vision Opticians,OP_5LE_6921__000002_SE15LU,OPT,204 Southwark Park Road,,,London,,SE16 3RW,Tel: 020 7237 8246, - ,,,No ratings yet Rate it yourself - /Services/opticians/LeaveReview/DefaultView.aspx?id=OP_5LE_6921__000002_SE15LU,0,0,yes
R.W.H. Clements,OP_5K9_5641__000001_SE254UG,OPT,1 Portland Road,,,London,,SE25 4UG,Tel: 020 8654 4171, - ,,,No ratings yet Rate it yourself - /Services/opticians/LeaveReview/DefaultView.aspx?id=OP_5K9_5641__000001_SE254UG,0,0,
Lambrou Eye Studio,OP_5A7_5488__000002_BR68NN,OPT,350 Crofton Road,,Orpington,Bromley,,BR6 8NN,Tel: 01689 850 593, - ,,,No ratings yet Rate it yourself - /Services/opticians/LeaveReview/DefaultView.aspx?id=OP_5A7_5488__000002_BR68NN,0,0,
BELSON & SONS,OP_5C4_10270__000001_E147DL,OPT,320 Burdett Road,,,London,,E14 7DL,Tel: 0800 980 3464, - ,,,No ratings yet Rate it yourself - /Services/opticians/LeaveReview/DefaultView.aspx?id=OP_5C4_10270__000001_E147DL,0,0,
Boots Opticians ,OP_5A7_6080__000002_BR60JN,OPT,194 High Street,,Orpington,,,BR6 0JN,Tel: 01689 891303, - ,,,No ratings yet Rate it yourself - /Services/opticians/LeaveReview/DefaultView.aspx?id=OP_5A7_6080__000002_BR60JN,0,0,
Specsavers Opticians,BR6 0TW__000001_BR60TW,OPT,,175 High Street,,Orpington,Kent,BR6 0LW,Tel: 01689 890 168, - ,,,No ratings yet Rate it yourself - /Services/opticians/LeaveReview/DefaultView.aspx?id=BR6 0TW__000001_BR60TW,0,0,
Boots-Orpington - High St,OP_5A7_10401__000002_BR60LS,OPT,232 High Street,,,Orpington,Kent,BR6 0LS,Tel: 01689 820 848, - ,,,No ratings yet Rate it yourself - /Services/opticians/LeaveReview/DefaultView.aspx?id=OP_5A7_10401__000002_BR60LS,0,0,
Thamesmead Eye Care,S6U6P,OPT,,Wm Morrison Supermarkets,Twin Tumps Way,London,,SE28 8RD,Tel: 0208 310 0420, - ,,,No ratings yet Rate it yourself - /Services/opticians/LeaveReview/DefaultView.aspx?id=S6U6P,0,0,
IAB Eyecare Ltd,OL231805NA,OPT,,388 Barking Road,"Plaistow,",London,,E13 8HJ,Tel: 020 7476 6615, - ,,,No ratings yet Rate it yourself - /Services/opticians/LeaveReview/DefaultView.aspx?id=OL231805NA,0,0,