Organisation Name,NACS Code,Organisation Type,Address1,Address2,Address3,Address4,Address5,PostCode,Telephone Number,Opening time,Value  (Opening time),Banding Classification  (Opening time),NHS.UK users rating,Value  (NHS.UK users rating),Banding Classification  (NHS.UK users rating),Car parking (Is there car parking at this organisation?)
Medical Eye Centre,00314__000001_DA122EB,OPT,14 King Street,,Gravesend,Kent,,DA12 2EB,Tel: 01474 321553, - ,,,No ratings yet Rate it yourself - /Services/opticians/LeaveReview/DefaultView.aspx?id=00314__000001_DA122EB,0,0,
Specsavers (Gravesend),OP_5CM_2356__000001_DA110AU,OPT,19-20 Thamesgate Shopping Centre,,Kent,Gravesend,,DA11 0AU,Tel: 01474 537 878, - ,,,1 rating Rate it yourself - /Services/opticians/LeaveReview/DefaultView.aspx?id=OP_5CM_2356__000001_DA110AU,,,
Boots-Gravesend - Kempthorne St,OP_5CM_416__000002_DA110TA,OPT,9 Kempthorne Street,St Georges Shopping Centre,,Gravsend,Kent,DA11 0TA,Tel: 01474 352911, - ,,,No ratings yet Rate it yourself - /Services/opticians/LeaveReview/DefaultView.aspx?id=OP_5CM_416__000002_DA110TA,0,0,
Asda Opticans (Gravesend),00306__000001_DA110DQ,OPT,Thames Way,,Gravesend,Kent,,DA11 0DQ,Tel: 01474 543 412, - ,,,No ratings yet Rate it yourself - /Services/opticians/LeaveReview/DefaultView.aspx?id=00306__000001_DA110DQ,0,0,
Ewoma Aibangbee,OPT_DA118BZ_1,OPT,,"Gateway Medical Practice, Fleet Health Campus, Vale Road",Northfleet,Gravesend,Kent,DA11 8BZ,Tel: 07591 246595, - ,,,No ratings yet Rate it yourself - /Services/opticians/LeaveReview/DefaultView.aspx?id=OPT_DA118BZ_1,0,0,
K Lewis & Partners,OP_5GQ_9847__000001_RM187QT,OPT,39 - 41 Calcutta Road,,Tilbury,Essex,,RM18 7QT,Tel: 01375 843074, - ,,,No ratings yet Rate it yourself - /Services/opticians/LeaveReview/DefaultView.aspx?id=OP_5GQ_9847__000001_RM187QT,0,0,
Rowland Opticians,OP_5CM_2066__000002_DA37QA,OPT,,79 Station Road,Kent,Longfield,,DA3 7QA,Tel: 01474 702125, - ,,,No ratings yet Rate it yourself - /Services/opticians/LeaveReview/DefaultView.aspx?id=OP_5CM_2066__000002_DA37QA,0,0,
Boots-Strood,OP_5L3_1926__000001_ME24TJ,OPT,117 High Street,,,Strood,Kent,ME2 4TJ,Tel: 01634 718676, - ,,,No ratings yet Rate it yourself - /Services/opticians/LeaveReview/DefaultView.aspx?id=OP_5L3_1926__000001_ME24TJ,0,0,
Specsavers Opticians,OPT_ME24AR_1,OPT,,58 High Street,,"Strood, Rochester",Kent,ME2 4AR,Tel: 01634 540399, - ,,,No ratings yet Rate it yourself - /Services/opticians/LeaveReview/DefaultView.aspx?id=OPT_ME24AR_1,0,0,
Niall O'Kane Optometrists,OP_5L3_10355__000001_ME24AR,OPT,78 - 80 High Street,Strood,Rochester,Kent,,ME2 4AR,Tel: 01634 290178, - ,,,7 ratings Rate it yourself - /Services/opticians/LeaveReview/DefaultView.aspx?id=OP_5L3_10355__000001_ME24AR,,,
Chandler Clarke Opticians,OP_5GQ_4880__000001_RM164BD,OPT,83 Riverview,Chadwell St. Mary,Grays,Essex,,RM16 4BD,Tel: 01375 842103, - ,,,No ratings yet Rate it yourself - /Services/opticians/LeaveReview/DefaultView.aspx?id=OP_5GQ_4880__000001_RM164BD,0,0,
Specsavers,RM17 6QF__000001_RM176QF,OPT,3 The Mall,Grays Shopping Centre,Grays,Essex,,RM17 6QF,Tel: 01375 389740, - ,,,No ratings yet Rate it yourself - /Services/opticians/LeaveReview/DefaultView.aspx?id=RM17 6QF__000001_RM176QF,0,0,
Kennedy Rath Opticians,0111910__000002_RM176QE,OPT,32 The Mall,,Grays,Essex,,RM17 6QE,Tel: 01375 372444, - ,,,No ratings yet Rate it yourself - /Services/opticians/LeaveReview/DefaultView.aspx?id=0111910__000002_RM176QE,0,0,
Euin Steele & Partners,OP_5GQ_587__000001_RM175EH,OPT,58 Orsett Road,,,Grays,,RM17 5EH,Tel: 01375 373000, - ,,,No ratings yet Rate it yourself - /Services/opticians/LeaveReview/DefaultView.aspx?id=OP_5GQ_587__000001_RM175EH,0,0,
Asda Opticians (Greenhithe),00276__000002_DA99RE,OPT,Station Road,,Greenhithe,Kent,,DA9 9RE,Tel: 01322 374162, - ,,,4 ratings Rate it yourself - /Services/opticians/LeaveReview/DefaultView.aspx?id=00276__000002_DA99RE,,,
Vision Express (Bluewater),OP_5CM_1771__000001_DA99SP,OPT,Unit 14 Upper Rose Gallery,Bluewater,Greenhithe,Kent,,DA9 9SP,Tel: 01322 624814, - ,,,4 ratings Rate it yourself - /Services/opticians/LeaveReview/DefaultView.aspx?id=OP_5CM_1771__000001_DA99SP,,,
Boots Opticians (Bluewater),OP_5CM_972__000002_DA99BA,OPT,South Mall,Bluewater Shopping Centre,Greenhithe,Kent,,DA9 9BA,Tel: 01322 623854, - ,,,1 rating Rate it yourself - /Services/opticians/LeaveReview/DefaultView.aspx?id=OP_5CM_972__000002_DA99BA,,,
Boots-Bluewater Dartford,DA9 9SJ_98372,OPT,,"Unit MSU02, Lower Thames Walk",Bluewater Shopping Centre,Greenhithe,,DA9 9SJ,Tel: 01322624780, - ,,,No ratings yet Rate it yourself - /Services/opticians/LeaveReview/DefaultView.aspx?id=DA9 9SJ_98372,0,0,
John Lewis Opticians,OPT_DA99SA_1,OPT,,Bluewater,,Greenhithe,,DA9 9SA,, - ,,,No ratings yet Rate it yourself - /Services/opticians/LeaveReview/DefaultView.aspx?id=OPT_DA99SA_1,0,0,
David Clulow (Bluewater),OP_5CM_10603__000001_DA99SS,OPT,Unit 110 Upper Guild Hall,Bluewater,Greenhithe,Kent,,DA9 9SS,Tel: 01322 624915, - ,,,No ratings yet Rate it yourself - /Services/opticians/LeaveReview/DefaultView.aspx?id=OP_5CM_10603__000001_DA99SS,0,0,
Specsavvy Opticians Ltd,TP8FC,OPT,Unit 42,Dockside Shopping Centre,"Maritime Way, St Mary's Island",Chatham,Kent,ME4 3ED,Tel: 01634 891000, - ,,,39 ratings Rate it yourself - /Services/opticians/LeaveReview/DefaultView.aspx?id=TP8FC,,,
Boots-Chatham - Wilmot Sq,OP_5L3_1784__000002_ME44BB,OPT,30-34 Wilmot Square,Pentagon Centre,,Kent,Kent,ME4 4BB,Tel: 01634 828672, - ,,,1 rating Rate it yourself - /Services/opticians/LeaveReview/DefaultView.aspx?id=OP_5L3_1784__000002_ME44BB,,,
Vision Express (Chatham),OP_5L3_6149__000002_ME44BG,OPT,199 - 201 High Street,,Chatham,Kent,,ME4 4BG,Tel: 01634 404808, - ,,,1 rating Rate it yourself - /Services/opticians/LeaveReview/DefaultView.aspx?id=OP_5L3_6149__000002_ME44BG,,,
Specsavers (Chatham),OP_5L3_7948__000001_ME44BG,OPT,215 High Street,,Chatham,Kent,,ME4 4BG,Tel: 01634 818555, - ,,,5 ratings Rate it yourself - /Services/opticians/LeaveReview/DefaultView.aspx?id=OP_5L3_7948__000001_ME44BG,,,
The Village Optician,OPT_ME65NJ_1,OPT,,4 Holborough Road,,Snodland,,ME6 5NJ,Tel: 01634 240090, - ,,,No ratings yet Rate it yourself - /Services/opticians/LeaveReview/DefaultView.aspx?id=OPT_ME65NJ_1,0,0,
Buchanan Optometrists,OP_5L2_663__000001_ME65AG,OPT,Buchanan House,56 Malling Road,,Snodland,Kent,ME6 5NB,Tel: 01634 757227, - ,,,20 ratings Rate it yourself - /Services/opticians/LeaveReview/DefaultView.aspx?id=OP_5L2_663__000001_ME65AG,,,yes
Optical Express,K5B4X,OPT,40 Lower Level,"Riverbridge House, Anchor Boulevard",,Dartford,Kent,DA2 6SL,Tel: 0800 023 2020, - ,,,No ratings yet Rate it yourself - /Services/opticians/LeaveReview/DefaultView.aspx?id=K5B4X,0,0,
Costco Wholesale UK Ltd,CO-1833-17,OPT,,West Thurrock Way,,West Thurrock,Essex,RM20 3WY,Tel: 01708 683 085, - ,,,1 rating Rate it yourself - /Services/opticians/LeaveReview/DefaultView.aspx?id=CO-1833-17,,,
Specsavers Opticians,,OPT,,Sainsburys Howard Road,,"Chafford Hundred, Grays",,RM16 6YJ,Tel: 01375 808301, - ,,,N/A - Data not available,,,
Stanford Opticians,OP_5GQ_7872__000001_SS170EX,OPT,6 The Green,,Stanford-le-Hope,Essex,,SS17 0EX,Tel: 01375 672149, - ,,,No ratings yet Rate it yourself - /Services/opticians/LeaveReview/DefaultView.aspx?id=OP_5GQ_7872__000001_SS170EX,0,0,
Specsavers (Gillingham),00323__000002_ME71AQ,OPT,137 High Street,,Gillingham,Kent,,ME7 1AQ,Tel: 01634 583350, - ,,,1 rating Rate it yourself - /Services/opticians/LeaveReview/DefaultView.aspx?id=00323__000002_ME71AQ,,,
Opticial Express,OP_12345_RM20 2ZP,OPT,"Unit 230, Level 2",Lakeside Shopping Centre,,Thurrock,Essex,RM20 2ZP,Tel: 0800 023 2020, - ,,,No ratings yet Rate it yourself - /Services/opticians/LeaveReview/DefaultView.aspx?id=OP_12345_RM20 2ZP,0,0,
Boots Opticians Ltd,OP_5GQ_1340__000001_RM202ZG,OPT,74-75 Thurrock Lakeside Shopping Centre,West Thurrock,Grays,,,RM20 2ZG,Tel: 01708 861534, - ,,,2 ratings Rate it yourself - /Services/opticians/LeaveReview/DefaultView.aspx?id=OP_5GQ_1340__000001_RM202ZG,,,
Vision Express (UK) Ltd,OP_5GQ_13034__000001_RM202ZH,OPT,337 Thurrock Lakeside Shopping Centre,West Thurrock,Grays,,,RM20 2ZH,Tel: 01708 860300, - ,,,No ratings yet Rate it yourself - /Services/opticians/LeaveReview/DefaultView.aspx?id=OP_5GQ_13034__000001_RM202ZH,0,0,
Boots-West Thurrock,OP_5GQ_1608__000001_RM202ZQ,OPT,228 Thurrock,Lakeside Shopping Centre,,Grays,Essex,RM20 2ZQ,Tel: 01708 861534, - ,,,No ratings yet Rate it yourself - /Services/opticians/LeaveReview/DefaultView.aspx?id=OP_5GQ_1608__000001_RM202ZQ,0,0,
Vision Express (UK) Ltd,OP_5GQ_11510__000001_RM161ZF,OPT,9 Thurrock Lakeside Shopping Centre,West Thurrock,Grays,,,RM16 1ZF,Tel: 01708 860300, - ,,,No ratings yet Rate it yourself - /Services/opticians/LeaveReview/DefaultView.aspx?id=OP_5GQ_11510__000001_RM161ZF,0,0,
Asda Stores Limited,OPT_ME7 1RX,OPT,,Pier Road,,Gillingham,,ME7 1RX,Tel: 01732 753131, - ,,,No ratings yet Rate it yourself - /Services/opticians/LeaveReview/DefaultView.aspx?id=OPT_ME7 1RX,0,0,
Sanford Opticians,000281__000001_ME39AA,OPT,7 Main Road,Hoo,Rochester,Kent,,ME3 9AA,Tel: 01634 256565, - ,,,No ratings yet Rate it yourself - /Services/opticians/LeaveReview/DefaultView.aspx?id=000281__000001_ME39AA,0,0,
Tesco opticians,RM201TX211015,OPT,,Cygnet View,,West Thurrock,,RM20 1TX,, - ,,,No ratings yet Rate it yourself - /Services/opticians/LeaveReview/DefaultView.aspx?id=RM201TX211015,0,0,
T. J. Woolley,000179__000002_ME72YN,OPT,60 Watling Street,,Gillingham,Kent,,ME7 2YN,Tel: 01634 281291, - ,,,12 ratings Rate it yourself - /Services/opticians/LeaveReview/DefaultView.aspx?id=000179__000002_ME72YN,,,
Tesco Optician (Lunsford Park),ME206RJ060716,OPT,,Lunsford Park,,Larkfield,,ME20 6RJ,Tel: 0345 601 3479, - ,,,No ratings yet Rate it yourself - /Services/opticians/LeaveReview/DefaultView.aspx?id=ME206RJ060716,0,0,
Portobello Eyecare Ltd,K8A7B,OPT,,"3 Portobello Parade, Fawkham Road",,"West Kingsdown, Kent",,TN15 6JP,, - ,,,1 rating Rate it yourself - /Services/opticians/LeaveReview/DefaultView.aspx?id=K8A7B,,,
Goldsmith Webb,OP_5GQ_11951__000001_SS177LY,OPT,8 Grover Walk,Corringham,Stanford-le-Hope,Essex,,SS17 7LY,Tel: 01375 677577, - ,,,No ratings yet Rate it yourself - /Services/opticians/LeaveReview/DefaultView.aspx?id=OP_5GQ_11951__000001_SS177LY,0,0,
Belson & Sons,OP_5GQ_4450__000001_SS177NA,OPT,63 St. Johns Way,Corringham,Stanford-le-Hope,Essex,,SS17 7NA,Tel: 01375 674130, - ,,,No ratings yet Rate it yourself - /Services/opticians/LeaveReview/DefaultView.aspx?id=OP_5GQ_4450__000001_SS177NA,0,0,
Vraitch Vision (Walderslade),OPT_ME59LR_1,OPT,,3-4 Thetford House,,Walderslade,,ME5 9LR,Tel: 01634 682595, - ,,,No ratings yet Rate it yourself - /Services/opticians/LeaveReview/DefaultView.aspx?id=OPT_ME59LR_1,0,0,
Specsavers (Dartford),OP_5CM_11606__000002_DA11DE,OPT,54 High Street,,Dartford,Kent,,DA1 1DE,Tel: 01322 294040, - ,,,5 ratings Rate it yourself - /Services/opticians/LeaveReview/DefaultView.aspx?id=OP_5CM_11606__000002_DA11DE,,,
Boots-Dartford - High St (in Boots UK),OP_5P9_3123__000003_DA11DE,OPT,48-52 High Street,,,Dartford,Kent,DA1 1DE,Tel: 01322 223935, - ,,,No ratings yet Rate it yourself - /Services/opticians/LeaveReview/DefaultView.aspx?id=OP_5P9_3123__000003_DA11DE,0,0,
Linklater Opticians ,OP_5CM_3977__000001_DA11HD,OPT,22 Lowfield Street,,Dartford,Dartford,,DA1 1HD,Tel: 01322 223113, - ,,,No ratings yet Rate it yourself - /Services/opticians/LeaveReview/DefaultView.aspx?id=OP_5CM_3977__000001_DA11HD,0,0,
Boots-Dartford - High St,OP_5CM_1268__000002_DA11BY,OPT,20 High Street,,,Dartford,Kent,DA1 1BY,Tel: 01322 223 007, - ,,,No ratings yet Rate it yourself - /Services/opticians/LeaveReview/DefaultView.aspx?id=OP_5CM_1268__000002_DA11BY,0,0,
Earnshaw & Dallow,OP_5GQ_1245__000001_RM155DZ,OPT,32 Derry Avenue,,,South Ockendon,,RM15 5DZ,Tel: 01708 853050, - ,,,No ratings yet Rate it yourself - /Services/opticians/LeaveReview/DefaultView.aspx?id=OP_5GQ_1245__000001_RM155DZ,0,0,
Kent Eye Care Ltd,NKCCKNCK,OPT,Kent Eye Care Independent Specialist Optometrists & Opticians,786 London Road,,"Larkfield, Aylesford",Kent,ME20 6BE,Tel: 01732 873378, - ,,,1 rating Rate it yourself - /Services/opticians/LeaveReview/DefaultView.aspx?id=NKCCKNCK,,,no
West Malling Opticians ,OP_5L2_7653__000001_ME196QR,OPT,32 High Street,,Kent,West Malling,,ME19 6QR,Tel: 01732 841403, - ,,,No ratings yet Rate it yourself - /Services/opticians/LeaveReview/DefaultView.aspx?id=OP_5L2_7653__000001_ME196QR,0,0,
Tesco Optician (Gillingham),ME80GX060716,OPT,,Courtney Road,,Gillingham,,ME8 0GX,Tel: 0345 601 3479, - ,,,1 rating Rate it yourself - /Services/opticians/LeaveReview/DefaultView.aspx?id=ME80GX060716,,,
Vision Express (Gillingham),OPT_ME73PD_1,OPT,,Unit 39 Hempstead Valley Shopping Centre,,Gillingham,,ME7 3PD,Tel: 01634 365661, - ,,,No ratings yet Rate it yourself - /Services/opticians/LeaveReview/DefaultView.aspx?id=OPT_ME73PD_1,0,0,
Leightons Opticians & Hearing Care,OP_5L3_154__000001_ME73PD,OPT,,67 Hempstead Valley Shopping Centre,,Gillingham,Kent,ME7 3PD,Tel: 01634 261311, - ,,,No ratings yet Rate it yourself - /Services/opticians/LeaveReview/DefaultView.aspx?id=OP_5L3_154__000001_ME73PD,0,0,
Specsavers Opticians,OPT_ME207NA_2,OPT,,Sainsburys Supermarket,"Quarry Wood, Mills road",Aylesford,Kent,ME20 7NA,Tel: 01622 797200, - ,,,No ratings yet Rate it yourself - /Services/opticians/LeaveReview/DefaultView.aspx?id=OPT_ME207NA_2,0,0,
Borough Green Opticians,OP_5FF_10481__000002_TN158BT,OPT,25 High Street,Borough Green,Sevenoaks,Kent,,TN15 8BT,Tel: 01732 884558, - ,,,1 rating Rate it yourself - /Services/opticians/LeaveReview/DefaultView.aspx?id=OP_5FF_10481__000002_TN158BT,,,
Specsavers Crayford,G1O1G,OPT,Sainsbury's,Stadium Way,,Dartford,Kent,DA1 4HW,Tel: 01322 470662, - ,,,1 rating Rate it yourself - /Services/opticians/LeaveReview/DefaultView.aspx?id=G1O1G,,,
Asda Opticians (Swanley),OPT_BR8 7UN,OPT,,London Road,,Swanley,,BR8 7UN,Tel: 01322 661963, - ,,,3 ratings Rate it yourself - /Services/opticians/LeaveReview/DefaultView.aspx?id=OPT_BR8 7UN,,,
Robert Murrell incorporating Armstrong and North,W4X1M,OPT,,17 Swanley Centre,,Swanley,Kent,BR8 7TG,Tel: 01322 663231, - ,,,No ratings yet Rate it yourself - /Services/opticians/LeaveReview/DefaultView.aspx?id=W4X1M,0,0,
Specsavers Opticians Swanley,OPT_BR87TQ_1,OPT,,Unit 39 The Shopping Centre,,Swanley,Kent,BR8 7TQ,Tel: 01322 614827, - ,,,1 rating Rate it yourself - /Services/opticians/LeaveReview/DefaultView.aspx?id=OPT_BR87TQ_1,,,
Patrick Duff Opticians,OP_5L3_2150__000001_ME87HS,OPT,65 High Street,Rainham,Gillingham,Kent,,ME8 7HS,Tel: 01634 231308, - ,,,1 rating Rate it yourself - /Services/opticians/LeaveReview/DefaultView.aspx?id=OP_5L3_2150__000001_ME87HS,,,
John High Opticians (Rainham),OP_5L3_439__000001_ME87PH,OPT,73 High Street,Rainham,Gillingham,Kent,,ME8 7HS,Tel: 01634 233634, - ,,,1 rating Rate it yourself - /Services/opticians/LeaveReview/DefaultView.aspx?id=OP_5L3_439__000001_ME87PH,,,
Crayford Opticial Centre,OP_5AX_1701__000001_DA14ES,OPT,11a Crayford High Street,,Crayford,Kent,,DA1 4HH,Tel: 01322557700, - ,,,No ratings yet Rate it yourself - /Services/opticians/LeaveReview/DefaultView.aspx?id=OP_5AX_1701__000001_DA14ES,0,0,
Boots-Rainham,OP_5L3_7198__000003_ME87HW,OPT,15 Rainham Shopping Centre,Rainham,Gillingham,Kent,,ME8 7HW,Tel: 01634 362738, - ,,,No ratings yet Rate it yourself - /Services/opticians/LeaveReview/DefaultView.aspx?id=OP_5L3_7198__000003_ME87HW,0,0,
Kings Hill Opticians,00325__000001_ME194AU,OPT,Liberty Square,,West Malling,Kent,,ME19 4AU,Tel: 01732 875544, - ,,,17 ratings Rate it yourself - /Services/opticians/LeaveReview/DefaultView.aspx?id=00325__000001_ME194AU,,,
Eye 2 Eye,OP_5L2_11435__000002_ME160PU,OPT,Mid Kent Shopping Centre,Castle Road,Allington,Maidstone,Kent,ME16 0PU,Tel: 01622 672563, - ,,,4 ratings Rate it yourself - /Services/opticians/LeaveReview/DefaultView.aspx?id=OP_5L2_11435__000002_ME160PU,,,yes
M M Beg Opticians,OP_5AX_14694__000001_DA81RG,OPT,115 Erith High Street,,Erith,Kent,,DA8 1RG,Tel: 01322 342620, - ,,,2 ratings Rate it yourself - /Services/opticians/LeaveReview/DefaultView.aspx?id=OP_5AX_14694__000001_DA81RG,,,
Castle Opticians,OP_5JP_1560__000001_SS80JP,OPT,164 Long Road,,Canvey Island,Essex,,SS8 0JP,Tel: 01268 514666, - ,,,No ratings yet Rate it yourself - /Services/opticians/LeaveReview/DefaultView.aspx?id=OP_5JP_1560__000001_SS80JP,0,0,
L Dollay ,OP_5AX_14678__000003_DA83EX,OPT,259 Bexley Road,Northumberland Heath,Erith,Kent,,DA8 3EX,Tel: 01322 359 507, - ,,,1 rating Rate it yourself - /Services/opticians/LeaveReview/DefaultView.aspx?id=OP_5AX_14678__000003_DA83EX,,,
Specsavers Opticians,OP_5GR_2933__000001_SS141DT,OPT,58-60 Town Square,,Basildon,Essex,,SS14 1DT,Tel: 01268 274444, - ,,,No ratings yet Rate it yourself - /Services/opticians/LeaveReview/DefaultView.aspx?id=OP_5GR_2933__000001_SS141DT,0,0,
Asda Opticians,OPT_SS14 1AE,OPT,,EASTGATE SHOPPING CENTRE,EASTGATE,BASILDON,,SS14 1AE,Tel: 01268 884 020, - ,,,1 rating Rate it yourself - /Services/opticians/LeaveReview/DefaultView.aspx?id=OPT_SS14 1AE,,,
Vision Express (UK) Ltd,OP_5GR_9390__000001_SS141BT,OPT,82 Town Square,,Basildon,,,SS14 1BJ,Tel: 01268 530198, - ,,,No ratings yet Rate it yourself - /Services/opticians/LeaveReview/DefaultView.aspx?id=OP_5GR_9390__000001_SS141BT,0,0,
Boots-Basildon - Town Sq,OP_5GR_570__000002_SS141BA,OPT,25 Town Square,,Basildon,Basildon,Essex,SS14 1BA,Tel: 01268 293363, - ,,,2 ratings Rate it yourself - /Services/opticians/LeaveReview/DefaultView.aspx?id=OP_5GR_570__000002_SS141BA,,,
Templeman Opticians,OP_5GR_10876__000002_SS155TE,OPT,11 The Laindon Centre,,Basildon,Essex,,SS15 5TE,Tel: 01268 544646, - ,,,1 rating Rate it yourself - /Services/opticians/LeaveReview/DefaultView.aspx?id=OP_5GR_10876__000002_SS155TE,,,yes
Dollond & Aitchison,OP_5GR_5237__000002_SS141HG,OPT,1 - 3 East Walk,,Basildon,Essex,,SS14 1HG,Tel: 01268 520340, - ,,,No ratings yet Rate it yourself - /Services/opticians/LeaveReview/DefaultView.aspx?id=OP_5GR_5237__000002_SS141HG,0,0,
Weston Opticians Ltd,OP_5GR_12818__000001_SS141HA,OPT,39 East Walk,,Basildon,Essex,,SS14 1HA,Tel: 01268 531420, - ,,,No ratings yet Rate it yourself - /Services/opticians/LeaveReview/DefaultView.aspx?id=OP_5GR_12818__000001_SS141HA,0,0,
Tesco Opticians,OP_5GR_12819__000002_SS133JU,OPT,Off Station Lane,Pitsea,Basildon,Essex,,SS13 3JU,Tel: 01268 367438, - ,,,No ratings yet Rate it yourself - /Services/opticians/LeaveReview/DefaultView.aspx?id=OP_5GR_12819__000002_SS133JU,0,0,
Tyler Goodchild,OP_5JP_4887__000002_SS87AG,OPT,51 Furtherwick Road,,Canvey Island,Essex,,SS8 7AG,Tel: 01268 693532, - ,,,No ratings yet Rate it yourself - /Services/opticians/LeaveReview/DefaultView.aspx?id=OP_5JP_4887__000002_SS87AG,0,0,
Boots-Bexleyheath,OP_5AX_10393__000002_DA67JJ,OPT,25 The Mall,Broadway Shopping Centre,Bexleyheath,Kent,,DA6 7JJ,Tel: 020 8301 5656, - ,,,1 rating Rate it yourself - /Services/opticians/LeaveReview/DefaultView.aspx?id=OP_5AX_10393__000002_DA67JJ,,,
Vision Express Ltd,OP_5AX_5408__000003_DA67JJ,OPT,5 The Mall,Broadway Shopping Centre,Bexleyheath,Kent,,DA6 7JJ,Tel: 0208 298 9629, - ,,,No ratings yet Rate it yourself - /Services/opticians/LeaveReview/DefaultView.aspx?id=OP_5AX_5408__000003_DA67JJ,0,0,
Bodys-Optic (part of the Goldsmith Webb Group),OP_5JP_2441__000002_SS87AD,OPT,12 Knightswick Centre,,Canvey Island,Essex,Essex,SS8 7AD,Tel: 01268 683447, - ,,,No ratings yet Rate it yourself - /Services/opticians/LeaveReview/DefaultView.aspx?id=OP_5JP_2441__000002_SS87AD,0,0,yes
Specsavers (Maidstone),OPT_ME141QS_1,OPT,,21-25 Week Street,,Maidstone,Kent,ME14 1QS,Tel: 01622 663111, - ,,,No ratings yet Rate it yourself - /Services/opticians/LeaveReview/DefaultView.aspx?id=OPT_ME141QS_1,0,0,
Linklater Optometrists,OP_5AX_10048__000002_DA67DQ,OPT,Linklaters Optometrists,120 Broadway,Bexleyheath,Kent,,DA6 7DQ,Tel: 0208 303 4014, - ,,,3 ratings Rate it yourself - /Services/opticians/LeaveReview/DefaultView.aspx?id=OP_5AX_10048__000002_DA67DQ,,,no
Specsavers Opticians,OP_5AX_227__000001_DA67DQ,OPT,116a Broadway,Bexleyheath,Kent,,,DA6 7DQ,Tel: 0208 298 9920, - ,,,No ratings yet Rate it yourself - /Services/opticians/LeaveReview/DefaultView.aspx?id=OP_5AX_227__000001_DA67DQ,0,0,
Belson & Sons,OP_5GR_2283__000002_SS133AT,OPT,3 Broadway North,Pitsea,Basildon,Essex,,SS13 3AT,Tel: 01268 552030, - ,,,No ratings yet Rate it yourself - /Services/opticians/LeaveReview/DefaultView.aspx?id=OP_5GR_2283__000002_SS133AT,0,0,
Bayfields Opticians and Audiologists (Maidstone),I9V4Y,OPT,,6 Pudding Lane,,Maidstone,,ME14 1LN,Tel: 01622 758566, - ,,,No ratings yet Rate it yourself - /Services/opticians/LeaveReview/DefaultView.aspx?id=I9V4Y,0,0,
Tinsons ,OP_5L2_760__000001_ME141TG,OPT,9 Middle Row,,Kent,Maidstone,,ME14 1TG,Tel: 01622 686051, - ,,,No ratings yet Rate it yourself - /Services/opticians/LeaveReview/DefaultView.aspx?id=OP_5L2_760__000001_ME141TG,0,0,
Aves Opticians,OP_5A4_13772__000001_RM139Y,OPT,24 The Broadway,Rainham,Essex,,,RM13 9YW,Tel: 01708 555606, - ,,,No ratings yet Rate it yourself - /Services/opticians/LeaveReview/DefaultView.aspx?id=OP_5A4_13772__000001_RM139Y,0,0,
Boots-Maidstone - King St,OP_5L2_195__000002_ME141BW,OPT,56-62 King Street,,Kent,Maidstone,,ME14 1BW,Tel: 01622 762337, - ,,,No ratings yet Rate it yourself - /Services/opticians/LeaveReview/DefaultView.aspx?id=OP_5L2_195__000002_ME141BW,0,0,
William J Wilkinson (Maidstone),OP_5L2_2043__000001_ME156JJ,OPT,50 Gabriels Hill,,Kent,Maidstone,,ME15 6JJ,Tel: 01622 677424, - ,,,No ratings yet Rate it yourself - /Services/opticians/LeaveReview/DefaultView.aspx?id=OP_5L2_2043__000001_ME156JJ,0,0,
Tesco Opticians Rainham,RM13 9YZ,OPT,,"Bridge Road, Rainham",,Essex,,RM13 9YZ,, - ,,,No ratings yet Rate it yourself - /Services/opticians/LeaveReview/DefaultView.aspx?id=RM13 9YZ,0,0,
Vision Express (Maidstone),OP_5L2_6952__000001_ME156AS,OPT,346-348 Dukes Walk,Chequers Centre,Maidstone,Kent,,ME15 6AS,Tel: 01622 678123, - ,,,No ratings yet Rate it yourself - /Services/opticians/LeaveReview/DefaultView.aspx?id=OP_5L2_6952__000001_ME156AS,0,0,
"Bahri, P.K.",OP_5A4_8118__000001_RM143BT,OPT,172 St. Marys Lane,,Upminster,,,RM14 3BT,Tel: 01708 228397, - ,,,No ratings yet Rate it yourself - /Services/opticians/LeaveReview/DefaultView.aspx?id=OP_5A4_8118__000001_RM143BT,0,0,
Boots-Upminster,OP_5A4_4931__000001_RM142AP,OPT,7 Corbets Tey Road,,,Upminster,Essex,RM14 2AP,Tel: 01708 222 383, - ,,,No ratings yet Rate it yourself - /Services/opticians/LeaveReview/DefaultView.aspx?id=OP_5A4_4931__000001_RM142AP,0,0,
James Read Opticians Ltd,OP_5A4_14773__000001_RM142S,OPT,36 Station Road,Upminster,,Essex,,RM14 2TR,Tel: 01708 221086, - ,,,No ratings yet Rate it yourself - /Services/opticians/LeaveReview/DefaultView.aspx?id=OP_5A4_14773__000001_RM142S,0,0,
W Johnston,OP_5AX_14680__000001_DA175JN,OPT,63 Nuxley Road,,Upper Belvedere,Kent,,DA17 5JN,Tel: 01322 432868, - ,,,1 rating Rate it yourself - /Services/opticians/LeaveReview/DefaultView.aspx?id=OP_5AX_14680__000001_DA175JN,,,
Castle Opticians,OP_5JP_11661__000002_SS75HA,OPT,275 High Road,,Benfleet,Essex,,SS7 5HA,Tel: 01268 792165, - ,,,No ratings yet Rate it yourself - /Services/opticians/LeaveReview/DefaultView.aspx?id=OP_5JP_11661__000002_SS75HA,0,0,
"Debney, K. Optician",OP_5A4_999__000001_RM141LD,OPT,219 Front Lane,,Upminster,,,RM14 1LD,Tel: 01708 223116, - ,,,No ratings yet Rate it yourself - /Services/opticians/LeaveReview/DefaultView.aspx?id=OP_5A4_999__000001_RM141LD,0,0,
Maa Eyecare,TP8XN,OPT,Maa Eyecare,121 Avon Road,Cranham,Upminster,Greater London,RM14 1RQ,Tel: 01708 259889, - ,,,No ratings yet Rate it yourself - /Services/opticians/LeaveReview/DefaultView.aspx?id=TP8XN,0,0,yes