Organisation Name,NACS Code,Organisation Type,Address1,Address2,Address3,Address4,Address5,PostCode,Telephone Number,Opening time,Value  (Opening time),Banding Classification  (Opening time),NHS.UK users rating,Value  (NHS.UK users rating),Banding Classification  (NHS.UK users rating),Car parking (Is there car parking at this organisation?)
Robert Higson Opticians,OP_5E4_7315__000002_HU181PB,OPT,104 Newbegin,,Hornsea,East Yorkshire,,HU18 1PB,Tel: 01964 532589, - ,,,No ratings yet Rate it yourself - /Services/opticians/LeaveReview/DefaultView.aspx?id=OP_5E4_7315__000002_HU181PB,0,0,
ASDA Opticians,OPT_HU11 4AL,OPT,,"Main Road, Bilton",,HULL,,HU11 4AL,Tel: 01482 818812, - ,,,No ratings yet Rate it yourself - /Services/opticians/LeaveReview/DefaultView.aspx?id=OPT_HU11 4AL,0,0,
Rouse Opticians,OP_5E5_2060__000004_HU74EE,OPT,5c North Point Shopping Centre,Goodhart Road,Hull,E Yorkshire,,HU7 4EE,Tel: 01482 833451, - ,,,No ratings yet Rate it yourself - /Services/opticians/LeaveReview/DefaultView.aspx?id=OP_5E5_2060__000004_HU74EE,0,0,
Asda Opticians,OP_5E5_14668__000003_HU74HS,OPT,Asda Stores,Kingswood,,Hull,,HU7 4HS,Tel: 01482 370820, - ,,,No ratings yet Rate it yourself - /Services/opticians/LeaveReview/DefaultView.aspx?id=OP_5E5_14668__000003_HU74HS,0,0,
Winter Opticians,OP_5E5_14667__000001_HU89AL,OPT,,623 Holderness Road,,Hull,,HU8 9AL,Tel: 01482 375295, - ,,,No ratings yet Rate it yourself - /Services/opticians/LeaveReview/DefaultView.aspx?id=OP_5E5_14667__000001_HU89AL,0,0,
Specsavers Opticians,OP_5E3_7142__000001_HU179BN,OPT,52 Toll Gavel,,Beverley,,,HU17 9BN,Tel: 01482 679933, - ,,,No ratings yet Rate it yourself - /Services/opticians/LeaveReview/DefaultView.aspx?id=OP_5E3_7142__000001_HU179BN,0,0,
Boots-Beverley,OP_5E3_11631__000001_HU179AJ,OPT,43-45 Toll Gavel,,,Beverley,Yorkshire,HU17 9AA,Tel: 01482 872333, - ,,,No ratings yet Rate it yourself - /Services/opticians/LeaveReview/DefaultView.aspx?id=OP_5E3_11631__000001_HU179AJ,0,0,
Beverley Vision Express,5NW VE__000003_HU179AJ,OPT,,12 Toll Gavel,,Beverley,Yorkshire(East Riding),HU17 9AJ,Tel: 01482 863547, - ,,,No ratings yet Rate it yourself - /Services/opticians/LeaveReview/DefaultView.aspx?id=5NW VE__000003_HU179AJ,0,0,
Eyesite,OPT_5E3_HARRODS__000003_HU178BB,OPT,13a Saturday Market Place,Beverley,,East Yorkshire,,HU17 8BB,Tel: 01482 868039, - ,,,No ratings yet Rate it yourself - /Services/opticians/LeaveReview/DefaultView.aspx?id=OPT_5E3_HARRODS__000003_HU178BB,0,0,
Edwards Opticians,OP_5E3_487__000002_HU178BB,OPT,8 Saturday Market,,Beverley,,,HU17 8BB,Tel: 01482 868428, - ,,,No ratings yet Rate it yourself - /Services/opticians/LeaveReview/DefaultView.aspx?id=OP_5E3_487__000002_HU178BB,0,0,
Andrew and Rogers,OP_5E3_13038__000001_HU178AJ,OPT,15 North Bar Within,,Beverley,E Yorkshire,,HU17 8AP,Tel: 01482 860362, - ,,,No ratings yet Rate it yourself - /Services/opticians/LeaveReview/DefaultView.aspx?id=OP_5E3_13038__000001_HU178AJ,0,0,
Bush Opticians (Hull) Ltd,OP_5E5_7794__000001_HU88RD,OPT,337 Holderness Road,,Hull,E Yorkshire,,HU8 8RD,Tel: 01482 323443, - ,,,No ratings yet Rate it yourself - /Services/opticians/LeaveReview/DefaultView.aspx?id=OP_5E5_7794__000001_HU88RD,0,0,
Robert Higson Opticians,OP_5E5_3497__000001_HU88SH,OPT,323 Holderness Road,,,Hull,,HU8 8SH,Tel: 01482 329404, - ,,,No ratings yet Rate it yourself - /Services/opticians/LeaveReview/DefaultView.aspx?id=OP_5E5_3497__000001_HU88SH,0,0,
Vision Plus Opticians,OP_5E5_9519__000001_HU88TE,OPT,,283 Holderness Road,,Hull,,HU8 8TE,Tel: 01482 225545, - ,,,No ratings yet Rate it yourself - /Services/opticians/LeaveReview/DefaultView.aspx?id=OP_5E5_9519__000001_HU88TE,0,0,
Asda Opticians,OPT_HU9 2BN,OPT,,THE MOUNT RETAIL PARK,,HULL,,HU9 2BN,, - ,,,No ratings yet Rate it yourself - /Services/opticians/LeaveReview/DefaultView.aspx?id=OPT_HU9 2BN,0,0,
M & A Optics,OP_5E6_5538__000002_HU52ES,OPT,115 Newland Avenue,,Hull,,,HU5 2ES,Tel: 01482 472848, - ,,,No ratings yet Rate it yourself - /Services/opticians/LeaveReview/DefaultView.aspx?id=OP_5E6_5538__000002_HU52ES,0,0,
Rouse Opticians,OP_5E6_2061__000001_HU52AA,OPT,95 Newland Avenue,95 Newland Avenue,,Hull,,HU5 2AA,Tel: 01482 346728, - ,,,No ratings yet Rate it yourself - /Services/opticians/LeaveReview/DefaultView.aspx?id=OP_5E6_2061__000001_HU52AA,0,0,
Robert Higson Opticians,OP_5E4_9272__000001_HU128JS,OPT,18 Souttergate,,Hedon,E Yorkshire,,HU12 8JS,Tel: 01482 896803, - ,,,No ratings yet Rate it yourself - /Services/opticians/LeaveReview/DefaultView.aspx?id=OP_5E4_9272__000001_HU128JS,0,0,
Eyesite,OP_5E4_4737__000001_HU128EU,OPT,19 St. Augustines Gate,,Hedon,E Yorkshire,,HU12 8EU,Tel: 01482 890621, - ,,,No ratings yet Rate it yourself - /Services/opticians/LeaveReview/DefaultView.aspx?id=OP_5E4_4737__000001_HU128EU,0,0,
Scrivens Opticians,OP_5E3_5474__000002_HU164BD,OPT,160 Hallgate,,Cottingham,Nr Hull,Yorkshire(East Riding),HU16 4BD,Tel: 01482 845056, - ,,,No ratings yet Rate it yourself - /Services/opticians/LeaveReview/DefaultView.aspx?id=OP_5E3_5474__000002_HU164BD,0,0,
Eyesite Opticians,OP_5E3_13040__000003_HU165QE,OPT,96 King Street,,Cottingham,E Yorkshire,,HU16 5QE,Tel: 01482 845651, - ,,,No ratings yet Rate it yourself - /Services/opticians/LeaveReview/DefaultView.aspx?id=OP_5E3_13040__000003_HU165QE,0,0,
Coates Opticians,OP_5E3_4819__000002_HU165QE,OPT,,8 King Street,,Cottingham,East Yorkshire,HU16 5QE,Tel: 01482 840989, - ,,,No ratings yet Rate it yourself - /Services/opticians/LeaveReview/DefaultView.aspx?id=OP_5E3_4819__000002_HU165QE,0,0,
Buckingham Opticians,OP_5E3_3903__000001_HU164BB,OPT,183 Hallgate,,Cottingham,Cottingham,,HU16 4BB,Tel: 01482 841359, - ,,,No ratings yet Rate it yourself - /Services/opticians/LeaveReview/DefaultView.aspx?id=OP_5E3_3903__000001_HU164BB,0,0,
Bright Eyes,OP_5E6_14672__000001_HU28HH,OPT,3 Percy Street,,Hull,East Yorkshire,,HU2 8HH,Tel: 01482 210888, - ,,,No ratings yet Rate it yourself - /Services/opticians/LeaveReview/DefaultView.aspx?id=OP_5E6_14672__000001_HU28HH,0,0,
Wheatcroft Opticians Ltd,OP_5E6_12554__000001_HU31AB,OPT,72 Spring Bank,,Hull,,,HU3 1AB,Tel: 01482 329545, - ,,,No ratings yet Rate it yourself - /Services/opticians/LeaveReview/DefaultView.aspx?id=OP_5E6_12554__000001_HU31AB,0,0,
"Daniels, Turner & Associates",5NXDANIELS__000002_HU31AA,OPT,90 Spring Bank,,Hull,E Yorkshire,,HU3 1AA,Tel: 01482 228525, - ,,,No ratings yet Rate it yourself - /Services/opticians/LeaveReview/DefaultView.aspx?id=5NXDANIELS__000002_HU31AA,0,0,
Optical Express,HU2 8PX_11111,OPT,Prospect Street,,,Hull,Yorkshire(East Riding),HU2 8PX,Tel: 0800 023 2020, - ,,,No ratings yet Rate it yourself - /Services/opticians/LeaveReview/DefaultView.aspx?id=HU2 8PX_11111,0,0,
Boots-Hull - Prospect Centre,OP_5E6_11583__000002_HU28PS,OPT,48-58 Prospect Centre,,,Hull,,HU2 8PS,Tel: 01482 323892, - ,,,No ratings yet Rate it yourself - /Services/opticians/LeaveReview/DefaultView.aspx?id=OP_5E6_11583__000002_HU28PS,0,0,
Aspec's Opticians,OP_5E6_14671__000001_HU28PP,OPT,Unit 4 Saville Row,18 Saville Street,,Hull,East Yorkshire,HU1 3EF,Tel: 01482 211115, - ,,,No ratings yet Rate it yourself - /Services/opticians/LeaveReview/DefaultView.aspx?id=OP_5E6_14671__000001_HU28PP,0,0,
R M Higson,OP_5E6_1131__000001_HU13EA,OPT,,44 Savile Street,,Hull,East Yorkshire,HU1 3EA,Tel: 01482 329122, - ,,,No ratings yet Rate it yourself - /Services/opticians/LeaveReview/DefaultView.aspx?id=OP_5E6_1131__000001_HU13EA,0,0,
Specsavers Opticians,OP_5E6_12910__000001_HU13LS,OPT,50-52 Jameson Street,,Hull,,,HU1 3LS,Tel: 01482 324494, - ,,,No ratings yet Rate it yourself - /Services/opticians/LeaveReview/DefaultView.aspx?id=OP_5E6_12910__000001_HU13LS,0,0,
Tesco Opticians,CO1998__000001_HU28RW,OPT,Park Street,,Hull,E Yorkshire,,HU2 8RW,Tel: 01482 303437, - ,,,No ratings yet Rate it yourself - /Services/opticians/LeaveReview/DefaultView.aspx?id=CO1998__000001_HU28RW,0,0,
Vision Express (UK) Ltd,OP_5E6_8572__000002_HU12PQ,OPT,F14-15 Upper Deck,Princes Quay,Hull,,,HU1 2PQ,Tel: 01482 323333, - ,,,No ratings yet Rate it yourself - /Services/opticians/LeaveReview/DefaultView.aspx?id=OP_5E6_8572__000002_HU12PQ,0,0,
Todd & Clarke,OP_5E6_3229__000001_HU13QH,OPT,,10 Anlaby Road,,Hull,East Yorkshire,HU1 2PA,Tel: 01482 223502, - ,,,No ratings yet Rate it yourself - /Services/opticians/LeaveReview/DefaultView.aspx?id=OP_5E6_3229__000001_HU13QH,0,0,
Rose Eyecare Ltd,OP_5E6_2056__000002_HU32SE,OPT,275 Anlaby Road,,Hull,,,HU3 2SE,Tel: 01482 324414, - ,,,No ratings yet Rate it yourself - /Services/opticians/LeaveReview/DefaultView.aspx?id=OP_5E6_2056__000002_HU32SE,0,0,
Buckingham Opticians,OP_5E6_452__000001_HU36AS,OPT,453 Anlaby Road,,Hull,Hull,,HU3 6AS,Tel: 01482 566451, - ,,,No ratings yet Rate it yourself - /Services/opticians/LeaveReview/DefaultView.aspx?id=OP_5E6_452__000001_HU36AS,0,0,
John Tomlinson Mobile Optician,OP_5E4_14668__000003_YO259QZ,OPT,Mobile Unit,Station Yard (Friday (Pm),Hutton Cranswick,,,YO25 9QZ,Tel: 07976 567487, - ,,,No ratings yet Rate it yourself - /Services/opticians/LeaveReview/DefaultView.aspx?id=OP_5E4_14668__000003_YO259QZ,0,0,
The Spectacle Shop,OP_5E6_14668__000001_HU34BE,OPT,271 Hessle Road,,Hull,E Yorkshire,,HU3 4BE,Tel: 01482 585083, - ,,,No ratings yet Rate it yourself - /Services/opticians/LeaveReview/DefaultView.aspx?id=OP_5E6_14668__000001_HU34BE,0,0,
Rouse Opticians,OP_5E6_14674__000001_HU33SE,OPT,428 Hessle Road,,Hull,E Yorkshire,,HU3 3SE,Tel: 01482 323856, - ,,,No ratings yet Rate it yourself - /Services/opticians/LeaveReview/DefaultView.aspx?id=OP_5E6_14674__000001_HU33SE,0,0,
Asda Opticians,OP_5E6_14670__000001_HU34PE,OPT,Hessle Road,,,Hull,,HU3 4PE,Tel: 01482 596620, - ,,,No ratings yet Rate it yourself - /Services/opticians/LeaveReview/DefaultView.aspx?id=OP_5E6_14670__000001_HU34PE,0,0,
Sight Care UK Ltd,OP_5E3_8924__000001_HU106BN,OPT,4 Kingston Road,,Willerby,,,HU10 6BN,Tel: 01482 658048, - ,,,No ratings yet Rate it yourself - /Services/opticians/LeaveReview/DefaultView.aspx?id=OP_5E3_8924__000001_HU106BN,0,0,
Jane Gray Eyecare Ltd,OP_5E3_8347__000001_HU107AN,OPT,7 Wilson Street,,Anlaby,E Yorkshire,,HU10 7AN,Tel: 01482 651531, - ,,,No ratings yet Rate it yourself - /Services/opticians/LeaveReview/DefaultView.aspx?id=OP_5E3_8347__000001_HU107AN,0,0,
Eye Contact Opticians,OP_5E3_4150__000002_HU130AA,OPT,8 The Orchard Centre,,Hessle,,,HU13 0AA,Tel: 01482 645369, - ,,,No ratings yet Rate it yourself - /Services/opticians/LeaveReview/DefaultView.aspx?id=OP_5E3_4150__000002_HU130AA,0,0,
R M Higson Optometrist ,OP_5E4_1270__000001_YO256QE,OPT,100 Middle Street South,,Driffield,,,YO25 6QE,Tel: 01377 253039, - ,,,No ratings yet Rate it yourself - /Services/opticians/LeaveReview/DefaultView.aspx?id=OP_5E4_1270__000001_YO256QE,0,0,
Bush Opticians (Hull) Ltd,OP_5E3_8458__000001_HU130RU,OPT,18 The Weir,Hessle,,East Yorkshire,,HU13 0RU,Tel: 01482 648919, - ,,,No ratings yet Rate it yourself - /Services/opticians/LeaveReview/DefaultView.aspx?id=OP_5E3_8458__000001_HU130RU,0,0,
Specsavers Hessle,OP_5E3_3367__000001_HU130RD,OPT,44-46 Prestongate,,Hessle,,,HU13 0RE,Tel: 01482 640971, - ,,,No ratings yet Rate it yourself - /Services/opticians/LeaveReview/DefaultView.aspx?id=OP_5E3_3367__000001_HU130RD,0,0,
Glens Optical Ltd,OP_5E4_2457__000002_YO256PS,OPT,23/3 Middle Street South,,Driffield,Driffield,,YO25 6PS,Tel: 01377 257252, - ,,,No ratings yet Rate it yourself - /Services/opticians/LeaveReview/DefaultView.aspx?id=OP_5E4_2457__000002_YO256PS,0,0,
Scrivens Opticians,OP_5E4_6784__000001_YO256QF,OPT,71 Middle Street South,,,Driffield,Yorkshire(East Riding),YO25 6QF,Tel: 01377 253145, - ,,,No ratings yet Rate it yourself - /Services/opticians/LeaveReview/DefaultView.aspx?id=OP_5E4_6784__000001_YO256QF,0,0,
Specsavers Opticians,OP_5E4_14669__000001_YO256AP,OPT,7 Market Place,,Driffield,E Yorkshire,,YO25 6AP,Tel: 01377 249710, - ,,,No ratings yet Rate it yourself - /Services/opticians/LeaveReview/DefaultView.aspx?id=OP_5E4_14669__000001_YO256AP,0,0,
Onlookers Ltd,OP_5NW_ONLOOKERS__000002_YO259DJ,OPT,,83 Kelleythorpe Industrial Estate,,Driffield,Yorkshire(East Riding),YO25 9DJ,Tel: 01377 200040, - ,,,No ratings yet Rate it yourself - /Services/opticians/LeaveReview/DefaultView.aspx?id=OP_5NW_ONLOOKERS__000002_YO259DJ,0,0,
John Tomlinson Mobile Optician,OP_5E3_13034__000001_HU151QT,OPT,Mobile Unit,The Library Car Park,Church Street (Tues 9-12.15pm Alt),,,HU15 1QT,Tel: 07976 567487, - ,,,No ratings yet Rate it yourself - /Services/opticians/LeaveReview/DefaultView.aspx?id=OP_5E3_13034__000001_HU151QT,0,0,
Smith & Walker (Optometrists) Ltd,OP_5EF_3196__000003_DN185PD,OPT,16 High Street,,Barton-upon-Humber,North Lincolnshire,,DN18 5PD,Tel: 01652 632315, - ,,,No ratings yet Rate it yourself - /Services/opticians/LeaveReview/DefaultView.aspx?id=OP_5EF_3196__000003_DN185PD,0,0,
Eyesite Opticians Ltd,OP_5EF_4393__000002_DN185PD,OPT,42 High Street,,Barton-upon-Humber,North Lincolnshire,,DN18 5PD,Tel: 01652 635997, - ,,,No ratings yet Rate it yourself - /Services/opticians/LeaveReview/DefaultView.aspx?id=OP_5EF_4393__000002_DN185PD,0,0,
R M Higson Optometrist ,OP_5E4_1132__000003_HU192HB,OPT,,120 Queen Street,,Withernsea,East Yorkshire,HU19 2HB,Tel: 01964 612012, - ,,,No ratings yet Rate it yourself - /Services/opticians/LeaveReview/DefaultView.aspx?id=OP_5E4_1132__000003_HU192HB,0,0,
Specsavers Opticians,OP_5E4_12692__000001_YO152DN,OPT,29 King Street,,,Bridlington,,YO15 2DN,Tel: 01262 400011, - ,,,No ratings yet Rate it yourself - /Services/opticians/LeaveReview/DefaultView.aspx?id=OP_5E4_12692__000001_YO152DN,0,0,
Crown Optical,OP_5E4_14664__000001_YO152PX,OPT,4a The Promenade,,Bridlington,E Yorkshire,,YO15 2PX,Tel: 01262 674350, - ,,,No ratings yet Rate it yourself - /Services/opticians/LeaveReview/DefaultView.aspx?id=OP_5E4_14664__000001_YO152PX,0,0,
Langton Opticians,OP_5E4_8177__000001_YO152AE,OPT,27 Prospect Street,,Bridlington,,,YO15 2AE,Tel: 01262 673113, - ,,,No ratings yet Rate it yourself - /Services/opticians/LeaveReview/DefaultView.aspx?id=OP_5E4_8177__000001_YO152AE,0,0,
John Tomlinson Mobile Optician,OP_5E3_13033__000001_YO433SN,OPT,Mobile Unit,Newbald Village Hall Car Park,Westgate (Thur 4.45pm-7pm Alt),,,YO43 4SE,Tel: 07976 567487, - ,,,No ratings yet Rate it yourself - /Services/opticians/LeaveReview/DefaultView.aspx?id=OP_5E3_13033__000001_YO433SN,0,0,
Edwards Opticians,OP_5E3_4047__000001_HU151HW,OPT,1 Stockbridge Road,,Elloughton,E Yorkshire,,HU15 1HW,Tel: 01482 668712, - ,,,No ratings yet Rate it yourself - /Services/opticians/LeaveReview/DefaultView.aspx?id=OP_5E3_4047__000001_HU151HW,0,0,
Old Town Optometrists,OP_5E4_5718__000001_YO164QL,OPT,69 High Street,69 High Street,Bridlington,Bridlington,,YO16 4PR,Tel: 01262 673772, - ,,,No ratings yet Rate it yourself - /Services/opticians/LeaveReview/DefaultView.aspx?id=OP_5E4_5718__000001_YO164QL,0,0,
Sightcare UK Ltd,BROUGH1__000001_HU151AF,OPT,Welton Road,,Brough,E Yorkshire,,HU15 1AF,Tel: 01482 665999, - ,,,No ratings yet Rate it yourself - /Services/opticians/LeaveReview/DefaultView.aspx?id=BROUGH1__000001_HU151AF,0,0,
Edwards Opticians,OP_5E4_9059__000001_YO43AF,OPT,17-19 Southgate,,Market Weighton,E Yorkshire,,YO43 3AF,Tel: 01430 873288, - ,,,No ratings yet Rate it yourself - /Services/opticians/LeaveReview/DefaultView.aspx?id=OP_5E4_9059__000001_YO43AF,0,0,
Smith & Walker (Optometrists) Ltd,OP_5AN_8150__000001_DN402AE,OPT,2 Kennedy Way,,,Immingham,,DN40 2AE,Tel: 01469 572702, - ,,,No ratings yet Rate it yourself - /Services/opticians/LeaveReview/DefaultView.aspx?id=OP_5AN_8150__000001_DN402AE,0,0,
John Tomlinson Mobile Optician,OP_5E3_13031__000001_HU152PR,OPT,Mobile Unit,Recreation Club (Thur Pm Alt),,"Main Street, Newport",,HU15 2PR,Tel: 07976 567487, - ,,,No ratings yet Rate it yourself - /Services/opticians/LeaveReview/DefaultView.aspx?id=OP_5E3_13031__000001_HU152PR,0,0,
Smith & Walker (Optometrists) Ltd,OP_5EF_8151__000001_DN159PU,OPT,1 High Street,,Winterton,North Lincolnshire,,DN15 9PU,Tel: 01724 733754, - ,,,No ratings yet Rate it yourself - /Services/opticians/LeaveReview/DefaultView.aspx?id=OP_5EF_8151__000001_DN159PU,0,0,
"Keen, King & Jones",OP_5AN_4059__000001_DN312BD,OPT,3 Lynton Parade,Cromwell Road,Grimsby,,,DN31 2BD,Tel: 01472 360900, - ,,,No ratings yet Rate it yourself - /Services/opticians/LeaveReview/DefaultView.aspx?id=OP_5AN_4059__000001_DN312BD,0,0,
Boots-Grimsby - Friargate,OP_5AN_11689__000002_DN311ED,OPT,17 Friargate,,Freshney Place,Grimsby,,DN31 1QQ,Tel: 01472 342 209, - ,,,No ratings yet Rate it yourself - /Services/opticians/LeaveReview/DefaultView.aspx?id=OP_5AN_11689__000002_DN311ED,0,0,
Asda Vision,OPT_5AN 018__000002_DN329DL,OPT,Holles Street,,Grimsby,North East Lincolnshire,,DN32 9DL,Tel: 01472 243124, - ,,,No ratings yet Rate it yourself - /Services/opticians/LeaveReview/DefaultView.aspx?id=OPT_5AN 018__000002_DN329DL,0,0,
Vision Express (UK) Ltd,OP_5AN_12319__000001_DN311TB,OPT,2 Newbiggin Walk,Freshney Place,Grimsby,,,DN31 1ED,Tel: 01472 344244, - ,,,No ratings yet Rate it yourself - /Services/opticians/LeaveReview/DefaultView.aspx?id=OP_5AN_12319__000001_DN311TB,0,0,
John Tomlinson Mobile Optician,OP_5E3_13036__000001_HU152UB,OPT,Mobile Optician,Village Hall Car Park,Gilberdyke,,,HU15 2UB,Tel: 07976 567487, - ,,,No ratings yet Rate it yourself - /Services/opticians/LeaveReview/DefaultView.aspx?id=OP_5E3_13036__000001_HU152UB,0,0,
Boots-Grimsby - Victoria St,OP_5AN_1566__000001_DN311UU,OPT,45 Victoria Street,,,Grimsby,Lincolnshire,DN31 1UU,Tel: 01472 242997, - ,,,No ratings yet Rate it yourself - /Services/opticians/LeaveReview/DefaultView.aspx?id=OP_5AN_1566__000001_DN311UU,0,0,
Specsavers Opticians,OP_5AN_12791__000001_DN311EY,OPT,31-33 Victoria St West,,,Grimsby,,DN31 1DL,Tel: 01472 242018, - ,,,No ratings yet Rate it yourself - /Services/opticians/LeaveReview/DefaultView.aspx?id=OP_5AN_12791__000001_DN311EY,0,0,
Mackay & Rollett Limited,OP_5AN_13995__000002_DN312AB,OPT,14 Dudley Street,Grimsby,North East Lincolnshire,,,DN31 2AB,Tel: 01472 354040, - ,,,No ratings yet Rate it yourself - /Services/opticians/LeaveReview/DefaultView.aspx?id=OP_5AN_13995__000002_DN312AB,0,0,
Optic Direct,OPT-TAN-020__000001_DN311LH,OPT,2 East Street,Mary Gate,,Grimsby,,DN31 1LH,Tel: 01472 267779, - ,,,No ratings yet Rate it yourself - /Services/opticians/LeaveReview/DefaultView.aspx?id=OPT-TAN-020__000001_DN311LH,0,0,
Hunmanby Opticians,OP_5KK_14980__000004_YO140JR,OPT,24 Bridlington Street,Hunmanby,Filey,,,YO14 0JR,Tel: 01723 890011, - ,,,No ratings yet Rate it yourself - /Services/opticians/LeaveReview/DefaultView.aspx?id=OP_5KK_14980__000004_YO140JR,0,0,
Specsavers,TP730,OPT,,17-21 Market Place,,Pocklington,,YO42 2AS,, - ,,,No ratings yet Rate it yourself - /Services/opticians/LeaveReview/DefaultView.aspx?id=TP730,0,0,
Scrivens Opticians,OP_5E4_10770__000001_YO422DG,OPT,4 George Street,,Pocklington,E Yorkshire,,YO42 2DG,Tel: 01759 303150, - ,,,No ratings yet Rate it yourself - /Services/opticians/LeaveReview/DefaultView.aspx?id=OP_5E4_10770__000001_YO422DG,0,0,
Stephens & Drew Opticians,OP_5AN_13993__000001_DN358JZ,OPT,9-11 Cross Street,Cleethorpes,North East Lincolnshire,Cleethorpes,,DN35 8JZ,Tel: 01472 691636, - ,,,No ratings yet Rate it yourself - /Services/opticians/LeaveReview/DefaultView.aspx?id=OP_5AN_13993__000001_DN358JZ,0,0,
Specsavers Opticians,OP_5AN_14619__000001_DN353HL,OPT,36 St Peters Avenue,,Cleethorpes,,,DN35 8HL,Tel: 01472 608840, - ,,,No ratings yet Rate it yourself - /Services/opticians/LeaveReview/DefaultView.aspx?id=OP_5AN_14619__000001_DN353HL,0,0,
Scartho Eyecare Limited,OPT TAN-082__000003_DN332LY,OPT,11 Waltham Road,Scartho,Grimsby,North East Lincolnshire,,DN33 2LY,Tel: 01472 877235, - ,,,No ratings yet Rate it yourself - /Services/opticians/LeaveReview/DefaultView.aspx?id=OPT TAN-082__000003_DN332LY,0,0,
Ulph & Kearns Ltd,OP_5AN_1981__000002_DN332EP,OPT,1 Scartho Court,Pinfold Lane,Scartho,,,DN33 2EW,Tel: 01472 870164, - ,,,No ratings yet Rate it yourself - /Services/opticians/LeaveReview/DefaultView.aspx?id=OP_5AN_1981__000002_DN332EP,0,0,
O'Brien's Opticians,OP_5EF_3276__000001_DN208JB,OPT,43-44 Wrawby Street,Brigg,Scunthorpe,North Lincolnshire,,DN20 8BS,Tel: 01652 653595, - ,,,No ratings yet Rate it yourself - /Services/opticians/LeaveReview/DefaultView.aspx?id=OP_5EF_3276__000001_DN208JB,0,0,
Brigg Optical,OPT_5EF_017__000001_DN208JZ,OPT,5 Chapel Court,,Brigg,North Lincolnshire,,DN20 8JZ,Tel: 01652 650400, - ,,,No ratings yet Rate it yourself - /Services/opticians/LeaveReview/DefaultView.aspx?id=OPT_5EF_017__000001_DN208JZ,0,0,
Tesco Opticians,OPT_5AN_019__000002_DN359QR,OPT,Hewitt Retail Park,Hewitt Avenue,Cleethorpes,North East Lincolnshire,,DN35 9QR,Tel: 0345 601 3479, - ,,,No ratings yet Rate it yourself - /Services/opticians/LeaveReview/DefaultView.aspx?id=OPT_5AN_019__000002_DN359QR,0,0,
Langton Opticians,OP_5KK_3231__000001_YO149AA,OPT,17b West Avenue,,Filey,,,YO14 9AA,Tel: 01723 512100, - ,,,No ratings yet Rate it yourself - /Services/opticians/LeaveReview/DefaultView.aspx?id=OP_5KK_3231__000001_YO149AA,0,0,
"Keen, King & Jones",OP_5AN_7360__000001_DN370LS,OPT,4 Kirkgate,Waltham,Grimsby,,,DN37 0LS,Tel: 01472 824643, - ,,,No ratings yet Rate it yourself - /Services/opticians/LeaveReview/DefaultView.aspx?id=OP_5AN_7360__000001_DN370LS,0,0,
Specsavers Opticians,OP_5EF_6742__000001_DN156TG,OPT,54 High Street,,Scunthorpe,North Lincolnshire,,DN15 6SX,Tel: 01724 271451, - ,,,No ratings yet Rate it yourself - /Services/opticians/LeaveReview/DefaultView.aspx?id=OP_5EF_6742__000001_DN156TG,0,0,
Vision Express (UK) Ltd,OP_5EF_13991__000001_DN156SD,OPT,78 High Street,,Scunthorpe,North Lincolnshire,,DN15 6SD,Tel: 01724 276220, - ,,,No ratings yet Rate it yourself - /Services/opticians/LeaveReview/DefaultView.aspx?id=OP_5EF_13991__000001_DN156SD,0,0,
Vision Value,OPT-5EF021__000002_DN156SD,OPT,70 High Street,The Foundry,Scunthorpe,,,DN15 6SD,, - ,,,No ratings yet Rate it yourself - /Services/opticians/LeaveReview/DefaultView.aspx?id=OPT-5EF021__000002_DN156SD,0,0,
Boots-Scunthorpe - High St,OP_5EF_2181__000001_DN156LY,OPT,103 High Street,,,Scunthorpe,Lincolnshire,DN15 6LY,Tel: 01724 847 710, - ,,,No ratings yet Rate it yourself - /Services/opticians/LeaveReview/DefaultView.aspx?id=OP_5EF_2181__000001_DN156LY,0,0,
Peebles & Wayte,OP_5EF_8936__000001_DN156NG,OPT,2 Robert Street,,Scunthorpe,North Lincolnshire,,DN15 6NG,Tel: 01724 843528, - ,,,No ratings yet Rate it yourself - /Services/opticians/LeaveReview/DefaultView.aspx?id=OP_5EF_8936__000001_DN156NG,0,0,
Sutherland Optical Associates,OP_5EF_11493__000001_DN156LA,OPT,123 Mary Street,,Scunthorpe,North Lincolnshire,,DN15 6LA,Tel: 01724 865248, - ,,,No ratings yet Rate it yourself - /Services/opticians/LeaveReview/DefaultView.aspx?id=OP_5EF_11493__000001_DN156LA,0,0,
Boots-Scunthorpe - Oswald Rd,OP_5EF_6059__000001_DN157PQ,OPT,40 Oswald Road,,,Scunthorpe,Lincolnshire,DN15 7PQ,Tel: 01724 843152, - ,,,No ratings yet Rate it yourself - /Services/opticians/LeaveReview/DefaultView.aspx?id=OP_5EF_6059__000001_DN157PQ,0,0,
Tesco Opticians,OPT-5EF-019__000001_DN158GR,OPT,Gallagher Park,Doncaster Road,Scunthorpe,North Lincolnshire,,DN15 8GR,Tel: 0345 677 9664, - ,,,No ratings yet Rate it yourself - /Services/opticians/LeaveReview/DefaultView.aspx?id=OPT-5EF-019__000001_DN158GR,0,0,
Norfolk Optics Limited,OPT_5EF_018__000001_DN162SD,OPT,259 Ashby High Street,,Scunthorpe,North Lincolnshire,,DN16 2SD,Tel: 01724 867117, - ,,,No ratings yet Rate it yourself - /Services/opticians/LeaveReview/DefaultView.aspx?id=OPT_5EF_018__000001_DN162SD,0,0,
Charles Irvine,OPT-5EF-022__000002_DN162RY,OPT,295 Ashby High Street,Ashby,Scunthorpe,,,DN16 2RY,, - ,,,No ratings yet Rate it yourself - /Services/opticians/LeaveReview/DefaultView.aspx?id=OPT-5EF-022__000002_DN162RY,0,0,