Organisation Name,NACS Code,Organisation Type,Address1,Address2,Address3,Address4,Address5,PostCode,Telephone Number,Opening time,Value  (Opening time),Banding Classification  (Opening time),NHS.UK users rating,Value  (NHS.UK users rating),Banding Classification  (NHS.UK users rating),Car parking (Is there car parking at this organisation?)
Croft & Graves Optometrists,OP_TAC_7186__000001_NE455AA,OPT,Woodburn House,Hill Street,Corbridge,Northumberland,,NE45 5AA,Tel: 01434 632 289, - ,,,No ratings yet Rate it yourself - /Services/opticians/LeaveReview/DefaultView.aspx?id=OP_TAC_7186__000001_NE455AA,0,0,yes
Tynedale Eye Clinic,OP_TAC_9461__000001_NE425HJ,OPT,3 Front Street,,Prudhoe,Northumberland,Tyne and Wear,NE42 5HJ,Tel: 01661 835 353, - ,,,No ratings yet Rate it yourself - /Services/opticians/LeaveReview/DefaultView.aspx?id=OP_TAC_9461__000001_NE425HJ,0,0,
Evans & Fairbairn,TAC055__000002_NE425HN,OPT,23 Front Street,,Prudhoe,Northumberland,,NE42 5HN,Tel: 01661 832 564, - ,,,No ratings yet Rate it yourself - /Services/opticians/LeaveReview/DefaultView.aspx?id=TAC055__000002_NE425HN,0,0,
Specsavers Opticians,OP_TAC_4667__000001_NE461LZ,OPT,30 Fore Street,,Hexham,Northumberland,,NE46 1LZ,Tel: 01434 600 222, - ,,,1 rating Rate it yourself - /Services/opticians/LeaveReview/DefaultView.aspx?id=OP_TAC_4667__000001_NE461LZ,,,
Geoff Steven & Son,OP_TAC_9486__000001_NE461XG,OPT,,10 Market Place,,Hexham,Northumberland,NE46 1XG,Tel: 01434 603 862, - ,,,No ratings yet Rate it yourself - /Services/opticians/LeaveReview/DefaultView.aspx?id=OP_TAC_9486__000001_NE461XG,0,0,
Dickinson Optician,OP_TAC_3961__000001_NE461BA,OPT,15 Battle Hill,,Hexham,Northumberland,,NE46 1BA,Tel: 01434 602 709, - ,,,No ratings yet Rate it yourself - /Services/opticians/LeaveReview/DefaultView.aspx?id=OP_TAC_3961__000001_NE461BA,0,0,
Pennington Opticians,OP_TAC_6468__000001_NE461NA,OPT,22 Market Place,,Hexham,Northumberland,,NE46 3NX,Tel: 01434 600 376, - ,,,No ratings yet Rate it yourself - /Services/opticians/LeaveReview/DefaultView.aspx?id=OP_TAC_6468__000001_NE461NA,0,0,
B N Optical,NE40 4NB,OPT,,32 Main Street,,Crawcrook,,NE40 4NB,, - ,,,No ratings yet Rate it yourself - /Services/opticians/LeaveReview/DefaultView.aspx?id=NE40 4NB,0,0,
Opticians at Home,OP_5KA_216__000001_DH85XN,OPT,314 Medomsley Road,,Consett,Co. Durham,,DH8 5NX,Tel: 01207 590111, - ,,,No ratings yet Rate it yourself - /Services/opticians/LeaveReview/DefaultView.aspx?id=OP_5KA_216__000001_DH85XN,0,0,
Specsure Opticians,OP_5KA_00/205__000001_DH85SD,OPT,"Unit 12, The Derwent Centre",Middle Street,Consett,County Durham,,DH8 5SD,Tel: 01207 588 625, - ,,,No ratings yet Rate it yourself - /Services/opticians/LeaveReview/DefaultView.aspx?id=OP_5KA_00/205__000001_DH85SD,0,0,
Eyesite @ Finlays Opticians,OP_5KA_9938__000001_DH85QP,OPT,25 Middle Street,,Consett,,,DH8 5QP,Tel: 01207 505151, - ,,,No ratings yet Rate it yourself - /Services/opticians/LeaveReview/DefaultView.aspx?id=OP_5KA_9938__000001_DH85QP,0,0,
Specsavers Opticians,OP_5KA_00/208__000002_DH85QP,OPT,45 Middle Street,,Consett,County Durham,,DH8 5QP,Tel: 01207 586 910, - ,,,No ratings yet Rate it yourself - /Services/opticians/LeaveReview/DefaultView.aspx?id=OP_5KA_00/208__000002_DH85QP,0,0,
Tesco Opticians,031120161401,OPT,Tesco,Genesis Way,,Consett,Durham,DH8 5XP,Tel: 0345 601 3479, - ,,,No ratings yet Rate it yourself - /Services/opticians/LeaveReview/DefaultView.aspx?id=031120161401,0,0,
Thompson Opticians Ltd,OP_5D7_4469__000001_NE159BT,OPT,Senate House,Hexham Road,Throckley,Newcastle Upon Tyne,Tyne and Wear,NE15 9BT,Tel: 0191 267 4337, - ,,,No ratings yet Rate it yourself - /Services/opticians/LeaveReview/DefaultView.aspx?id=OP_5D7_4469__000001_NE159BT,0,0,
Thompson Opticians Ltd,OP_5KF_6404__000001_NE216DD,OPT,18 The Garth,Front Street,Winlaton On Tyne,Winlaton,Tyne and Wear,NE21 6DD,Tel: 01665 600195, - ,,,No ratings yet Rate it yourself - /Services/opticians/LeaveReview/DefaultView.aspx?id=OP_5KF_6404__000001_NE216DD,0,0,
H B Opticians Limited,OP_TAC^01__000005_NE209PW,OPT,29 Broadway,Darras Hall,Ponteland,Northumberland,,NE20 9PW,Tel: 01661 820 008, - ,,,No ratings yet Rate it yourself - /Services/opticians/LeaveReview/DefaultView.aspx?id=OP_TAC^01__000005_NE209PW,0,0,
B Braysher Optometrists,OP_5KF_13439__000002_NE215BT,OPT,23 Lower Precinct,,Blaydon,Gateshead,Tyne and Wear,NE21 5BT,Tel: 0191 414 3271, - ,,,No ratings yet Rate it yourself - /Services/opticians/LeaveReview/DefaultView.aspx?id=OP_5KF_13439__000002_NE215BT,0,0,yes
The Glasses Factory,NE21 5BT,OPT,TGF Optics,Unit 37,The Precinct,Blaydon on Tyne,Tyne and Wear,NE21 5BT,Tel: 01914 147207, - ,,,2 ratings Rate it yourself - /Services/opticians/LeaveReview/DefaultView.aspx?id=NE21 5BT,,,
Specs 4 You,OP_5D7_14196__000002_NE17YB,OPT,Unit 9,Denton Park Shopping Centre,West Denton Way,Newcastle Upon Tyne,,NE5 2QZ,Tel: 0191 264 6770, - ,,,No ratings yet Rate it yourself - /Services/opticians/LeaveReview/DefaultView.aspx?id=OP_5D7_14196__000002_NE17YB,0,0,
Geoff Steven & Sons,OPT_NE209NH_1,OPT,,25 Main Street,,Ponteland,,NE20 9NH,Tel: 01661 823374, - ,,,No ratings yet Rate it yourself - /Services/opticians/LeaveReview/DefaultView.aspx?id=OPT_NE209NH_1,0,0,
Stewart Eyecare,OP_5KF_13442__000001_NE165JL,OPT,99 Front Street,,Whickham,Newcastle Upon Tyne,,NE16 4JL,Tel: 0191 488 2474, - ,,,No ratings yet Rate it yourself - /Services/opticians/LeaveReview/DefaultView.aspx?id=OP_5KF_13442__000001_NE165JL,0,0,
Vision Clinic,OP_5D7_ 001__000003_NE52UR,OPT,682 West Road,Denton,Newcastle Upon Tyne,Newcastle Upon Tyne,,NE5 2UR,Tel: 0191 274 5385, - ,,,No ratings yet Rate it yourself - /Services/opticians/LeaveReview/DefaultView.aspx?id=OP_5D7_ 001__000003_NE52UR,0,0,
Healthcall Optical Services,OP_5D7^0002__000001_NE51NB,OPT,Redburn Road,Westerhope,Newcastle Upon Tyne,,,NE5 1NB,Tel: 0845 601 7241, - ,,,No ratings yet Rate it yourself - /Services/opticians/LeaveReview/DefaultView.aspx?id=OP_5D7^0002__000001_NE51NB,0,0,
CHEC NEWCASTLE,X5B1U,OPT,,"Unit 1.70-1, Metrocentre",,Gateshead,,NE11 9YG,, - ,,,No ratings yet Rate it yourself - /Services/opticians/LeaveReview/DefaultView.aspx?id=X5B1U,0,0,
Optical Express,NE11 9YP,OPT,,Unit 1.08 red mall,,Gateshead,,NE11 9YP,Tel: 01236 861 448, - ,,,No ratings yet Rate it yourself - /Services/opticians/LeaveReview/DefaultView.aspx?id=NE11 9YP,0,0,
Boots-Gateshead - Metro Centre (in Boots UK),OP_5KF_6012__000002_NE119YQ,OPT,46-52 Metro Centre,,,Gateshead,,NE11 9YQ,Tel: 0191 4932459, - ,,,1 rating Rate it yourself - /Services/opticians/LeaveReview/DefaultView.aspx?id=OP_5KF_6012__000002_NE119YQ,,,
Eyesite,OP_5KA_9361__000002_DH90TB,OPT,73 Front Street,Stanley,County Durham,,,DH9 0TB,Tel: 01207 232580, - ,,,No ratings yet Rate it yourself - /Services/opticians/LeaveReview/DefaultView.aspx?id=OP_5KA_9361__000002_DH90TB,0,0,
Stanley Optical Centre,OP_5KA_00/175__000003_DH90TB,OPT,87 Front Street,,Stanley,County Durham,,DH9 0TB,Tel: 01207 290099, - ,,,No ratings yet Rate it yourself - /Services/opticians/LeaveReview/DefaultView.aspx?id=OP_5KA_00/175__000003_DH90TB,0,0,
Vision Express,OP_5KF_12652__000001_NE119XX,OPT,81-83 Russell Way,Metrocentre,Gateshead,Tyne and Wear,,NE11 9XX,Tel: 0191 460 0644, - ,,,No ratings yet Rate it yourself - /Services/opticians/LeaveReview/DefaultView.aspx?id=OP_5KF_12652__000001_NE119XX,0,0,
"Young, R (Opticians) Limited",OP_5KA_10297__000001_DH90AD,OPT,3 Clifford Road,,,Stanley,Durham,DH9 0AB,Tel: 01207 232 524, - ,,,No ratings yet Rate it yourself - /Services/opticians/LeaveReview/DefaultView.aspx?id=OP_5KA_10297__000001_DH90AD,0,0,
Costco Wholesale UK Ltd,CO-1833-14,OPT,,Mandela Way,Off Handy Drive,Gateshead,Tyne and Wear,NE11 9DH,Tel: 0191 461 9812, - ,,,No ratings yet Rate it yourself - /Services/opticians/LeaveReview/DefaultView.aspx?id=CO-1833-14,0,0,
Concept Eye Clinic,OP_5KA_9488__000001_DH70HY,OPT,1 Croft View,Lanchester,County Durham,Durham,,DH7 0HY,Tel: 01207 521840, - ,,,No ratings yet Rate it yourself - /Services/opticians/LeaveReview/DefaultView.aspx?id=OP_5KA_9488__000001_DH70HY,0,0,
Thompson Opticians Ltd,OP_5D7_11344__000002_NE49RX,OPT,265 Two Ball Lonnen,,Fenham,Newcastle Upon Tyne,Tyne and Wear,NE4 9RX,Tel: 0191 274 3863, - ,,,No ratings yet Rate it yourself - /Services/opticians/LeaveReview/DefaultView.aspx?id=OP_5D7_11344__000002_NE49RX,0,0,
Thompson Opticians Ltd,OP_5D7_5876__000001_NE48BF,OPT,Unit 4 Adelaide Shopping Centre,Adelaide Terrace,Benwell,Newcastle Upon Tyne,Tyne and Wear,NE4 8BE,Tel: 0191 273 2663, - ,,,No ratings yet Rate it yourself - /Services/opticians/LeaveReview/DefaultView.aspx?id=OP_5D7_5876__000001_NE48BF,0,0,
Spicker & Steen Ltd,OP_5D7_13482__000001_NE49PT,OPT,5 West Road,,Newcastle Upon Tyne,,,NE4 9PT,Tel: 0191 273 6014, - ,,,1 rating Rate it yourself - /Services/opticians/LeaveReview/DefaultView.aspx?id=OP_5D7_13482__000001_NE49PT,,,
Tesco Opticians,OP_5D7_5881__000003_NE32FP,OPT,Tesco Extra,2917 Kingston Park Centre,,Kingston Park,,NE3 2FP,Tel: 0845 601 3479, - ,,,16 ratings Rate it yourself - /Services/opticians/LeaveReview/DefaultView.aspx?id=OP_5D7_5881__000003_NE32FP,,,
Michael Offord Optometrist,OP_5D7_9544__000002_NE32FP,OPT,,7 Kingston Court,Kingston Park Avenue,Kingston Park,,NE3 2FP,Tel: 0191 271 2140, - ,,,5 ratings Rate it yourself - /Services/opticians/LeaveReview/DefaultView.aspx?id=OP_5D7_9544__000002_NE32FP,,,
Thompson Opticians Ltd,OP_5KF_1194__000002_NE119SJ,OPT,5 The Crescent,Dunston,Gateshead,Tyne and Wear,,NE11 9SJ,Tel: 01665 600195, - ,,,No ratings yet Rate it yourself - /Services/opticians/LeaveReview/DefaultView.aspx?id=OP_5KF_1194__000002_NE119SJ,0,0,
Asda Opticians,OPT_NE11 97A,OPT,,GIBSIDE WAY,,GATESHEAD,,NE11 9TA,Tel: 0191 4619514, - ,,,No ratings yet Rate it yourself - /Services/opticians/LeaveReview/DefaultView.aspx?id=OPT_NE11 97A,0,0,
Keyes Eyecare,OP_5D7_14439__000002_NE34XN,OPT,1-3 Ashburton Road,.,Gosforth,Newcastle Upon Tyne,,NE3 4XN,Tel: 0191 284 7361, - ,,,3 ratings Rate it yourself - /Services/opticians/LeaveReview/DefaultView.aspx?id=OP_5D7_14439__000002_NE34XN,,,
King & Wood,OP_5D7_9414__000001_NE31HA,OPT,Records at Keyes Eyecare,1-3 Ashburton Road,Gosforth,Newcastle Upon Tyne,,NE3 4XN,Tel: 0191 2847361, - ,,,No ratings yet Rate it yourself - /Services/opticians/LeaveReview/DefaultView.aspx?id=OP_5D7_9414__000001_NE31HA,0,0,
Buckingham & Hickson,OP_5J8_7765__000002_DL132TZ,OPT,Front Street,Stanhope,County Durham,,,DL13 2TZ,Tel: 01388 528237, - ,,,No ratings yet Rate it yourself - /Services/opticians/LeaveReview/DefaultView.aspx?id=OP_5J8_7765__000002_DL132TZ,0,0,
Vision Care at Home ,CO-5051-2,OPT,,11 Kingsway House,,Newcastle,,NE11 0HW,, - ,,,No ratings yet Rate it yourself - /Services/opticians/LeaveReview/DefaultView.aspx?id=CO-5051-2,0,0,
Vision Care at Home ,OPT_NE110HW_1,OPT,,11 Kingsway House,Team Valley,Newcastle,Tyne and Wear,NE11 0HW,Tel: 0191 487 9362, - ,,,2 ratings Rate it yourself - /Services/opticians/LeaveReview/DefaultView.aspx?id=OPT_NE110HW_1,,,
D Berry Optometrist,OP_5KF_2315__000001_NE84TH,OPT,56 Saltwell Road,,Gateshead,Tyne and Wear,,NE8 4XE,Tel: 0191 477 2516, - ,,,3 ratings Rate it yourself - /Services/opticians/LeaveReview/DefaultView.aspx?id=OP_5KF_2315__000001_NE84TH,,,
C4 Sightcare-RVI,OP_5D7_2534__000001_NE14LP,OPT,"Eye Department,Royal Victoria Infirmary","Claremont Wing,Queen Victoria Road",Newcastle Upon Tyne,,,NE1 4LP,Tel: 0191 221 0934, - ,,,1 rating Rate it yourself - /Services/opticians/LeaveReview/DefaultView.aspx?id=OP_5D7_2534__000001_NE14LP,,,
Opticial Express,OP_12345_NE1 7XJ,OPT,18 Blackettbridge,intu Eldon Square,,Newcastle,Tyne and Wear,NE1 7XJ,Tel: 0800 023 2020, - ,,,No ratings yet Rate it yourself - /Services/opticians/LeaveReview/DefaultView.aspx?id=OP_12345_NE1 7XJ,0,0,
Boots-Newcastle Upon Tyne - High Friars,OP_5D7_5387__000001_NE17XQ,OPT,23 High Friars,Eldon Square,,Newcastle-Upon-Tyne,Staffordshire,NE1 7XQ,Tel: 0191 232 6837, - ,,,No ratings yet Rate it yourself - /Services/opticians/LeaveReview/DefaultView.aspx?id=OP_5D7_5387__000001_NE17XQ,0,0,
Northern Optical Company Limited,OP_5D7_9676__000001_NE15QG,OPT,1-4 Grainger Market,,Newcastle Upon Tyne,,,NE1 5QG,Tel: 0191 232 7284, - ,,,No ratings yet Rate it yourself - /Services/opticians/LeaveReview/DefaultView.aspx?id=OP_5D7_9676__000001_NE15QG,0,0,
Boots-Newcastle Upon Tyne - Hotspur Way,OP_5D7_3240__000002_NE17XE,OPT,Hotspur Way,Eldon Square,,Newcastle Upon Tyne,Tyne and Wear,NE1 7XE,Tel: 0191 2612 475, - ,,,1 rating Rate it yourself - /Services/opticians/LeaveReview/DefaultView.aspx?id=OP_5D7_3240__000002_NE17XE,,,
OP & TOM,01-19825 NE1 1EN ,OPT,,8A High Bridge,,Newcastle,,NE1 1EN,Tel: 0191 2611426, - ,,,No ratings yet Rate it yourself - /Services/opticians/LeaveReview/DefaultView.aspx?id=01-19825 NE1 1EN,0,0,
Grey St. Opticians,OP_5D7^1975__000001_NE16EG,OPT,103 Grey Street,Central Exchange Buildings,Newcastle Upon Tyne,Newcastle Upon Tyne,,NE1 6EG,Tel: 0191 260 5450, - ,,,1 rating Rate it yourself - /Services/opticians/LeaveReview/DefaultView.aspx?id=OP_5D7^1975__000001_NE16EG,,,
Specsavers Opticians,OP_5D7_1164__000001_NE17XG,OPT,10 Eldon Way,Eldon Square,,Newcastle Upon Tyne,Tyne and Wear,NE1 7XS,Tel: 0191 233 0077, - ,,,No ratings yet Rate it yourself - /Services/opticians/LeaveReview/DefaultView.aspx?id=OP_5D7_1164__000001_NE17XG,0,0,
Opticial Express,OP_12345_NE1 1RF,OPT,5 St. Nicholas Street,,,Newcastle,Tyne and Wear,NE1 1RF,Tel: 0800 023 2020, - ,,,1 rating Rate it yourself - /Services/opticians/LeaveReview/DefaultView.aspx?id=OP_12345_NE1 1RF,,,
F Robson & Co,OP_5D7_5123__000001_NE16QG,OPT,16 Pilgrim Street,,Newcastle Upon Tyne,,,NE1 6QG,Tel: 0191 232 1631, - ,,,No ratings yet Rate it yourself - /Services/opticians/LeaveReview/DefaultView.aspx?id=OP_5D7_5123__000001_NE16QG,0,0,
D Rosenberg,OP_5KF_13441__000001_NE81RD,OPT,210/212 Rectory Road,,Gateshead,Tyne and Wear,,NE8 4RR,Tel: 0191 477 0454, - ,,,No ratings yet Rate it yourself - /Services/opticians/LeaveReview/DefaultView.aspx?id=OP_5KF_13441__000001_NE81RD,0,0,
Vision Express UK Ltd,OP_5D7_3169__000001_NE17DE,OPT,2 Northumberland Street,,Newcastle Upon Tyne,,,NE1 7DE,Tel: 0191 261 7622, - ,,,No ratings yet Rate it yourself - /Services/opticians/LeaveReview/DefaultView.aspx?id=OP_5D7_3169__000001_NE17DE,0,0,
G T Harvey & Partners Ltd,OP_5D7_56__000001_NE18JE,OPT,9 Saville Row,,Newcastle Upon Tyne,,,NE1 8JE,Tel: 0191 232 7615, - ,,,28 ratings Rate it yourself - /Services/opticians/LeaveReview/DefaultView.aspx?id=OP_5D7_56__000001_NE18JE,,,
C4 Sightcare,OP_5D7_3395__000001_NE16JE,OPT,Northumberland House,Princess Square,,Newcastle Upon Tyne,,NE1 8ER,Tel: 0191 232 1002, - ,,,No ratings yet Rate it yourself - /Services/opticians/LeaveReview/DefaultView.aspx?id=OP_5D7_3395__000001_NE16JE,0,0,
Coatsworth Eye Clinic Limited,NE8 1SR,OPT,,209 Coatsworth Road,,Gateshead,,NE8 1SR,, - ,,,2 ratings Rate it yourself - /Services/opticians/LeaveReview/DefaultView.aspx?id=NE8 1SR,,,
Thompson Opticians Ltd,OP_5D7_11345__000002_NE31JZ,OPT,,25 Gosforth Centre,Gosforth,Newcastle Upon Tyne,Tyne and Wear,NE3 1JZ,Tel: 0191 284 2538, - ,,,No ratings yet Rate it yourself - /Services/opticians/LeaveReview/DefaultView.aspx?id=OP_5D7_11345__000002_NE31JZ,0,0,
Concept Eye Clinic,OP_5D7_1182__000001_NE31HP,OPT,57 – 159 High Street,,,Newcastle Upon Tyne,,NE3 1HE,Tel: 0191 285 1603, - ,,,No ratings yet Rate it yourself - /Services/opticians/LeaveReview/DefaultView.aspx?id=OP_5D7_1182__000001_NE31HP,0,0,
Mark English Opticians,OP_5D7_10908__000001_NE32HH,OPT,228 High Street,,Gosforth,Newcastle Upon Tyne,,NE3 1HH,Tel: 0191 285 5930, - ,,,No ratings yet Rate it yourself - /Services/opticians/LeaveReview/DefaultView.aspx?id=OP_5D7_10908__000001_NE32HH,0,0,
Hampton Graves Eyecare,OP_5KF_8342__000001_NE81EH,OPT,,11 High West Street,Gateshead,Tyne and Wear,,NE8 1EH,Tel: 0191 477 1357, - ,,,No ratings yet Rate it yourself - /Services/opticians/LeaveReview/DefaultView.aspx?id=OP_5KF_8342__000001_NE81EH,0,0,yes
Specsavers Opticians,OP _ 5KF__000002_NE81EE,OPT,37 Jackson Street,,Gateshead,Tyne and Wear,,NE8 1EE,Tel: 0191 478 8060, - ,,,No ratings yet Rate it yourself - /Services/opticians/LeaveReview/DefaultView.aspx?id=OP _ 5KF__000002_NE81EE,0,0,
The Optometric Centre Ltd,OP_5KF_3294__000001_NE81AS,OPT,225 High Street,,Gateshead,Tyne and Wear,,NE8 1AS,Tel: 0191 477 2389, - ,,,No ratings yet Rate it yourself - /Services/opticians/LeaveReview/DefaultView.aspx?id=OP_5KF_3294__000001_NE81AS,0,0,
Tesco Opticians,NE8 1EP,OPT,,241 High Street,,Gateshead,,NE8 1EP,Tel: 0191 403 1838, - ,,,No ratings yet Rate it yourself - /Services/opticians/LeaveReview/DefaultView.aspx?id=NE8 1EP,0,0,
Summers Opticians,OP_5KF_3030__000001_NE95AN,OPT,407 Durham Road,Low Fell,Gateshead,Tyne and Wear,,NE9 5AN,Tel: 0191 487 9464, - ,,,No ratings yet Rate it yourself - /Services/opticians/LeaveReview/DefaultView.aspx?id=OP_5KF_3030__000001_NE95AN,0,0,
Sight Direct Ltd,OP_NE95EY_30494,OPT,,509 Durham Road,Low Fell,Gateshead,,NE9 5EY,Tel: 0191 482 0834, - ,,,No ratings yet Rate it yourself - /Services/opticians/LeaveReview/DefaultView.aspx?id=OP_NE95EY_30494,0,0,
Long & Pickard,OP_5D7_8704__000001_NE22DN,OPT,113 St Georges Terrace,,Jesmond,Newcastle Upon Tyne,,NE2 2DN,Tel: 0191 281 8810, - ,,,No ratings yet Rate it yourself - /Services/opticians/LeaveReview/DefaultView.aspx?id=OP_5D7_8704__000001_NE22DN,0,0,
Evans Opticians,OP_5D7_505__000001_NE22DJ,OPT,28 Acorn Road,,Jesmond,Newcastle Upon Tyne,,NE2 2DJ,Tel: 0191 281 4145, - ,,,2 ratings Rate it yourself - /Services/opticians/LeaveReview/DefaultView.aspx?id=OP_5D7_505__000001_NE22DJ,,,
The Big Optician,OP_5D7_14441__000001_NE61JX,OPT,Stephen Street,,Byker,Newcastle Upon Tyne,,NE6 1JX,Tel: 0191 224 4555, - ,,,No ratings yet Rate it yourself - /Services/opticians/LeaveReview/DefaultView.aspx?id=OP_5D7_14441__000001_NE61JX,0,0,
Tynedale Eye Clinic,OP_5D7_9071__000001_NE61DL,OPT,110 - 112 Shields Road,,Byker,Newcastle Upon Tyne,,NE6 1DS,Tel: 0191 276 0242, - ,,,2 ratings Rate it yourself - /Services/opticians/LeaveReview/DefaultView.aspx?id=OP_5D7_9071__000001_NE61DL,,,
Optica Eye Clinic Ltd,OP_5D8_14191__000001_NE128GA,OPT,9b The Boulevard,West Farm Avenue,,Longbenton,,NE12 8GA,Tel: 0191 266 3339, - ,,,1 rating Rate it yourself - /Services/opticians/LeaveReview/DefaultView.aspx?id=OP_5D8_14191__000001_NE128GA,,,
Richardsons Opticians,OPL/01-25420/5D9,OPT,,"233 Shields Road, Byker",,Newcastle Upon Tyne,,NE6 1DQ,, - ,,,No ratings yet Rate it yourself - /Services/opticians/LeaveReview/DefaultView.aspx?id=OPL/01-25420/5D9,0,0,
Wrekenton Eye Centre Ltd,OP_5KF_13443__000001_NE97JR,OPT,159 High Street,Wrekenton,Gateshead,Tyne and Wear,,NE9 7JR,Tel: 0191 487 3269, - ,,,1 rating Rate it yourself - /Services/opticians/LeaveReview/DefaultView.aspx?id=OP_5KF_13443__000001_NE97JR,,,
J Wood,OP_5KF_3262__000001_NE109HJ,OPT,10 Morley Terrace,,Gateshead,Tyne and Wear,,NE10 9HJ,Tel: 0191 469 4641, - ,,,No ratings yet Rate it yourself - /Services/opticians/LeaveReview/DefaultView.aspx?id=OP_5KF_3262__000001_NE109HJ,0,0,
Querido and Davidson,OP_5D7_9832__000001_NE65LN,OPT,,196 Chillingham Road,Heaton,Newcastle Upon Tyne,Tyne and Wear,NE6 5LN,Tel: 0191 265 9898, - ,,,1 rating Rate it yourself - /Services/opticians/LeaveReview/DefaultView.aspx?id=OP_5D7_9832__000001_NE65LN,,,
Thompson Opticians Ltd,OP_5KF_14364__000002_NE109PW,OPT,9 Crowhall Lane,Victoria Square,Felling,Gateshead,Tyne and Wear,NE10 9PW,Tel: 01665 600195, - ,,,No ratings yet Rate it yourself - /Services/opticians/LeaveReview/DefaultView.aspx?id=OP_5KF_14364__000002_NE109PW,0,0,
Thompson Opticians Ltd,OP_5KF_14365__000001_NE84EL,OPT,56 Durham Road,Birtley,Chester Le Street,Co Durham,,DH3 2QJ,Tel: 01665 600195, - ,,,No ratings yet Rate it yourself - /Services/opticians/LeaveReview/DefaultView.aspx?id=OP_5KF_14365__000001_NE84EL,0,0,
Dawson Opticians,OP_5KF_10199__000001_DH32PS,OPT,5 Co Op Buildings,Durham Road,Chester Le Street,Co Durham,,DH3 2PS,Tel: 0191 492 0474, - ,,,No ratings yet Rate it yourself - /Services/opticians/LeaveReview/DefaultView.aspx?id=OP_5KF_10199__000001_DH32PS,0,0,
Four Lane Ends Opticians,OP_5D7_9143__000002_NE77EE,OPT,341 Benton Road,,Benton,Newcastle Upon Tyne,,NE7 7EE,Tel: 0191 266 3218, - ,,,No ratings yet Rate it yourself - /Services/opticians/LeaveReview/DefaultView.aspx?id=OP_5D7_9143__000002_NE77EE,0,0,
C D HALL OPTICIANS LTD,OP_5D7_6967__000001_NE62QX,OPT,,335 Welbeck Road,Walker,Newcastle Upon Tyne,Tyne and Wear,NE6 2QX,Tel: 0191 276 0274, - ,,,1 rating Rate it yourself - /Services/opticians/LeaveReview/DefaultView.aspx?id=OP_5D7_6967__000001_NE62QX,,,
Thompson Opticians Ltd,CO-1751,OPT,,1 Station Road,,Newcastle Upon Tyne,Tyne and Wear,NE12 7AR,Tel: 0191 2666449, - ,,,No ratings yet Rate it yourself - /Services/opticians/LeaveReview/DefaultView.aspx?id=CO-1751,0,0,
Thompson Opticians,OP_5D8_5346__000001_NE129AD,OPT,20 Station Road North,,Forest Hall,Newcastle Upon Tyne,,NE12 9AD,Tel: 0191 266 2840, - ,,,No ratings yet Rate it yourself - /Services/opticians/LeaveReview/DefaultView.aspx?id=OP_5D8_5346__000001_NE129AD,0,0,
Thompson Opticians Ltd,OP_5KF_10653__000002_NE108XQ,OPT,6 Fewster Square,Leam Lane Estate,,Gateshead,Tyne and Wear,NE10 8XQ,Tel: 0191 469 3357, - ,,,No ratings yet Rate it yourself - /Services/opticians/LeaveReview/DefaultView.aspx?id=OP_5KF_10653__000002_NE108XQ,0,0,
Optometric Centre Ltd,OP_5KC_3293__000002_DH33YQ,OPT,5 St. Cuthberts Walk,Chester Le Street,County Durham,,,DH3 3YQ,Tel: 0191 387 1807, - ,,,No ratings yet Rate it yourself - /Services/opticians/LeaveReview/DefaultView.aspx?id=OP_5KC_3293__000002_DH33YQ,0,0,
Vision Express,OP_5KC_8954__000001_DH33BJ,OPT,,41 Front Street,,Chester Le Street,,DH3 3BH,Tel: 0191 388 2232, - ,,,No ratings yet Rate it yourself - /Services/opticians/LeaveReview/DefaultView.aspx?id=OP_5KC_8954__000001_DH33BJ,0,0,
Specsavers Opticians,OP_5KC_00/211__000002_DH33BD,OPT,66 Front Street,,Chester Le Street,County Durham,,DH3 3BD,Tel: 0191 3872930, - ,,,1 rating Rate it yourself - /Services/opticians/LeaveReview/DefaultView.aspx?id=OP_5KC_00/211__000002_DH33BD,,,
Riverside Opticians,T6G7W,OPT,,52 Front Street,,Chester le Street,,DH3 3BD,, - ,,,No ratings yet Rate it yourself - /Services/opticians/LeaveReview/DefaultView.aspx?id=T6G7W,0,0,
B L Ainley,OP_5D7_2884__000002_NE63DH,OPT,19 Churchwalk Shopping Centre,,Walker,Newcastle Upon Tyne,,NE6 3DH,Tel: 0191 263 1570, - ,,,No ratings yet Rate it yourself - /Services/opticians/LeaveReview/DefaultView.aspx?id=OP_5D7_2884__000002_NE63DH,0,0,
Specsavers Opticians (Killingworth),TP85D ,OPT,,"Unit 37, The Killingworth Centre",,"Killingworth, Newcastle Upon Tyne ",,NE12 6YT,, - ,,,2 ratings Rate it yourself - /Services/opticians/LeaveReview/DefaultView.aspx?id=TP85D ,,,
Stevens Optical Group,OP_5D8_13483__000002_NE126YT,OPT,Unit 22,The Killingworth Centre,Killingworth,Newcastle Upon Tyne,,NE12 6YT,Tel: 0191 268 1317, - ,,,No ratings yet Rate it yourself - /Services/opticians/LeaveReview/DefaultView.aspx?id=OP_5D8_13483__000002_NE126YT,0,0,
"Naylor, G (Optometrists)",OP_5KC_3257__000001_DH33AZ,OPT,170 Front Street,Chester Le Street,County Durham,,,DH3 3AZ,Tel: 0191 388 3113, - ,,,No ratings yet Rate it yourself - /Services/opticians/LeaveReview/DefaultView.aspx?id=OP_5KC_3257__000001_DH33AZ,0,0,
Sight Service,OP_5KF^0002__000002_NE84YL,OPT,Saltwell Road,The Bradbury Centre for Sight,Unit 2B Stonehills Business Centre,Gateshead,Tyne and Wear,NE10 0HW,Tel: 0191 478 5959, - ,,,1 rating Rate it yourself - /Services/opticians/LeaveReview/DefaultView.aspx?id=OP_5KF^0002__000002_NE84YL,,,
Specsavers,OP_5D8_1836__000001_NE288JA,OPT,9 High Street West,,Wallsend,Tyne and Wear,,NE28 8JA,Tel: 0191 262 5550, - ,,,No ratings yet Rate it yourself - /Services/opticians/LeaveReview/DefaultView.aspx?id=OP_5D8_1836__000001_NE288JA,0,0,