Organisation Name,NACS Code,Organisation Type,Address1,Address2,Address3,Address4,Address5,PostCode,Telephone Number,Opening time,Value  (Opening time),Banding Classification  (Opening time),NHS.UK users rating,Value  (NHS.UK users rating),Banding Classification  (NHS.UK users rating),Car parking (Is there car parking at this organisation?)
S W Allen Ltd,OP_5J6_6334__000001_OL145AB,OPT,19 Water Street,,Todmorden,,,OL14 5AB,Tel: 01706 815551, - ,,,No ratings yet Rate it yourself - /Services/opticians/LeaveReview/DefaultView.aspx?id=OP_5J6_6334__000001_OL145AB,0,0,
Mark Hurst Opticians,HX7 8UQ__000001_HX78UQ,OPT,37 West End,Hebden Bridge,Halifax,West Yorkshire,,HX7 8UQ,Tel: 01422 843456, - ,,,1 rating Rate it yourself - /Services/opticians/LeaveReview/DefaultView.aspx?id=HX7 8UQ__000001_HX78UQ,,,
Valli Opticians,QDT-00:133__000001_HX75LL,OPT,,1 Bridgegate,,Hebden Bridge,West Yorkshire,HX7 8EX,Tel: 01422 842084, - ,,,No ratings yet Rate it yourself - /Services/opticians/LeaveReview/DefaultView.aspx?id=QDT-00:133__000001_HX75LL,0,0,
Valli Opticians,OP_5J6_4094__000001_HX78AH,OPT,14 Albert Street,,Hebden Bridge,Hebden Bridge,,HX7 8AH,Tel: 01422 842084, - ,,,No ratings yet Rate it yourself - /Services/opticians/LeaveReview/DefaultView.aspx?id=OP_5J6_4094__000001_HX78AH,0,0,
D Winslow Opticians,OP_5KJ_1337__000001_BD208TU,OPT,1 Holme Lane,Crosshills,Keighley,,,BD20 8TU,Tel: 01535 635085, - ,,,No ratings yet Rate it yourself - /Services/opticians/LeaveReview/DefaultView.aspx?id=OP_5KJ_1337__000001_BD208TU,0,0,
Yates & Suddell,OP_5JX_3316__000002_BL09AD,OPT,,35 Bridge Street,Ramsbottom,Bury,Lancashire,BL0 9AD,Tel: 01706 822393, - ,,,No ratings yet Rate it yourself - /Services/opticians/LeaveReview/DefaultView.aspx?id=OP_5JX_3316__000002_BL09AD,0,0,
The Spectacle Studio Ltd,OP_5JX_6696__000001_BL09AD,OPT,45 Bridge Street,Ramsbottom,Bury,Lancashire,,BL0 9AD,Tel: 01706 822 200, - ,,,No ratings yet Rate it yourself - /Services/opticians/LeaveReview/DefaultView.aspx?id=OP_5JX_6696__000001_BL09AD,0,0,
Mr Yacub (Dom Only),OP_5HP_14297__000003_BB20AF,OPT,Ammarah House,7 Assheton Road,Blackburn,,,BB2 6SF,Tel: 01254 611084, - ,,,No ratings yet Rate it yourself - /Services/opticians/LeaveReview/DefaultView.aspx?id=OP_5HP_14297__000003_BB20AF,0,0,
Crossroads Optical Centre,OP_5AW_2673__000001_BD229BA,OPT,Sunderland House,Halifax Road,Keighley,,,BD22 9BA,Tel: 01535 645863, - ,,,No ratings yet Rate it yourself - /Services/opticians/LeaveReview/DefaultView.aspx?id=OP_5AW_2673__000001_BD229BA,0,0,
Craven & Murray Opticians Ltd,OP_5NQ_00003__000001_OL115XE,OPT,675 Edenfield Road,Norden,Rochdale,Lancashire,,OL11 5XE,Tel: 01706 641138, - ,,,No ratings yet Rate it yourself - /Services/opticians/LeaveReview/DefaultView.aspx?id=OP_5NQ_00003__000001_OL115XE,0,0,
Patricia Hooson ,OP_5J5_14210__000001_OL159DB,OPT,46 Victoria Street,Littleborough,,Rochdale,,OL15 9DB,Tel: 01706 379783, - ,,,No ratings yet Rate it yourself - /Services/opticians/LeaveReview/DefaultView.aspx?id=OP_5J5_14210__000001_OL159DB,0,0,
Leightons Optometrists,OP_5JX_4666__000001_BL09SH,OPT,7 The Precinct,Longsight Road,Holcombe Brook,Holcombe Brook,,BL0 9SH,Tel: 01204 888100, - ,,,No ratings yet Rate it yourself - /Services/opticians/LeaveReview/DefaultView.aspx?id=OP_5JX_4666__000001_BL09SH,0,0,
A&S Ghazi Opticians,,OPT,,9 Newmarket Street,,Skipton,,BD23 2HX,, - ,,,N/A - Data not available,,,
Boots-Skipton - High St,OP_5KJ_12608__000001_BD231JP,OPT,52 High Street,,,Skipton,North Yorkshire,BD23 1JP,Tel: 01756 790988, - ,,,No ratings yet Rate it yourself - /Services/opticians/LeaveReview/DefaultView.aspx?id=OP_5KJ_12608__000001_BD231JP,0,0,
Clifford Benjamin Optometrists,OP_5KJ_13254__000002_BD232JE,OPT,23 Newmarket Street,Skipton,,,,BD23 2JE,Tel: 01756 792933, - ,,,No ratings yet Rate it yourself - /Services/opticians/LeaveReview/DefaultView.aspx?id=OP_5KJ_13254__000002_BD232JE,0,0,
J Exley & Co,OP_5KJ_4842__000001_BD231DY,OPT,7 Otley Street,,Skipton,,,BD23 1DY,Tel: 01756 792416, - ,,,No ratings yet Rate it yourself - /Services/opticians/LeaveReview/DefaultView.aspx?id=OP_5KJ_4842__000001_BD231DY,0,0,
Eyecare Opticians,OP_5AW_14976__000001_BD212DF,OPT,24-26 Belgrave Road,,Keighley,bradford,,BD21 2DF,Tel: 01535 602200, - ,,,No ratings yet Rate it yourself - /Services/opticians/LeaveReview/DefaultView.aspx?id=OP_5AW_14976__000001_BD212DF,0,0,
Hirst Opticians,OP_5J6_10501__000001_HX26AL,OPT,52 Keighley Road,Ovenden,Halifax,,,HX2 6AL,Tel: 01422 367348, - ,,,No ratings yet Rate it yourself - /Services/opticians/LeaveReview/DefaultView.aspx?id=OP_5J6_10501__000001_HX26AL,0,0,
Knowle Park Opticians,QDD00173__000001_BD211HD,OPT,,42 Devonshire Street ,Keighley,West Yorkshire,,BD21 2AU,Tel: 01535 681100, - ,,,No ratings yet Rate it yourself - /Services/opticians/LeaveReview/DefaultView.aspx?id=QDD00173__000001_BD211HD,0,0,
Michael J Leaver,OP_5AW_14055__000001_BD212AU,OPT,40 Devonshire Street,Keighley,West Yorkshire,,,BD21 2AU,Tel: 01535 602935, - ,,,No ratings yet Rate it yourself - /Services/opticians/LeaveReview/DefaultView.aspx?id=OP_5AW_14055__000001_BD212AU,0,0,
Vision Express (UK) Ltd,OP_5AW_580__000001_BD213NN,OPT,,25 College Walk,Airedale Centre,Keighley,West Yorkshire,BD21 3QA,Tel: 01535 603098, - ,,,No ratings yet Rate it yourself - /Services/opticians/LeaveReview/DefaultView.aspx?id=OP_5AW_580__000001_BD213NN,0,0,
Keighley Specsavers Ltd,OP_5AW_5725__000002_BD213PY,OPT,36 Queensway,Airedale Centre,Keighley,,,BD21 3PY,Tel: 01535 669997, - ,,,1 rating Rate it yourself - /Services/opticians/LeaveReview/DefaultView.aspx?id=OP_5AW_5725__000002_BD213PY,,,
Boots-Keighley - Bow St,OP_5AW_3281__000001_BD213QD,OPT,30 Bow Street,,,Keighley,West Yorkshire,BD21 3QD,Tel: 01535 610019, - ,,,No ratings yet Rate it yourself - /Services/opticians/LeaveReview/DefaultView.aspx?id=OP_5AW_3281__000001_BD213QD,0,0,
Airedale Eyecare Ltd,OP_5AW_14317__000001_BD213QE,OPT,50 Towngate,,Keighley,,,BD21 3QE,Tel: 01535 690077, - ,,,No ratings yet Rate it yourself - /Services/opticians/LeaveReview/DefaultView.aspx?id=OP_5AW_14317__000001_BD213QE,0,0,
Silsden Optics Limited,OPT_BD209JS_1,OPT,,17 Briggate,,Silsden,,BD20 9JS,, - ,,,No ratings yet Rate it yourself - /Services/opticians/LeaveReview/DefaultView.aspx?id=OPT_BD209JS_1,0,0,
Clarus Opticians,OPT_BD213RL_1,OPT,,46 Cavendish Street,,Keighley,,BD21 3RL,Tel: 01535 930116, - ,,,No ratings yet Rate it yourself - /Services/opticians/LeaveReview/DefaultView.aspx?id=OPT_BD213RL_1,0,0,
Eye Care Optical,OP_5JY_12490__000001_OL120DR,OPT,149 Yorkshire Street,149 Yorkshire Street,Rochdale,Rochdale,,OL12 0DR,Tel: 01706 645006, - ,,,No ratings yet Rate it yourself - /Services/opticians/LeaveReview/DefaultView.aspx?id=OP_5JY_12490__000001_OL120DR,0,0,
Clinic 4 Eyes,OPT_OL162LJ_1,OPT,,268 Entwistle Road,,Rochdale,,OL16 2LJ,Tel: 01706 643622, - ,,,No ratings yet Rate it yourself - /Services/opticians/LeaveReview/DefaultView.aspx?id=OPT_OL162LJ_1,0,0,
Specsavers Opticians,OP_5JY_11180__000001_OL161BZ,OPT,67 Yorkshire Street,,Rochdale,,,OL16 1BZ,Tel: 01706 642 244, - ,,,No ratings yet Rate it yourself - /Services/opticians/LeaveReview/DefaultView.aspx?id=OP_5JY_11180__000001_OL161BZ,0,0,
Vision Express,OP_5JY_7061__000004_OL161EA,OPT,56 Market Way,Royal Exchange Shopping Centre,Rochdale,,,OL16 1EA,Tel: 01706 352220, - ,,,No ratings yet Rate it yourself - /Services/opticians/LeaveReview/DefaultView.aspx?id=OP_5JY_7061__000004_OL161EA,0,0,
Boots-Rochdale - Royal Exchange Shopping Cntr,OP_5JY_12769__000003_OL161EA,OPT,50 Royal Exchange Shopping Centre,,,Rochdale,Lancashire,OL16 1EA,Tel: 01706 525135, - ,,,No ratings yet Rate it yourself - /Services/opticians/LeaveReview/DefaultView.aspx?id=OP_5JY_12769__000003_OL161EA,0,0,
Paul Cheetham Eyecare,OP_5JY_1235__000001_OL161ED,OPT,,4 Lord Square,,Rochdale,Lancashire,OL16 1ED,Tel: 01706 647119, - ,,,No ratings yet Rate it yourself - /Services/opticians/LeaveReview/DefaultView.aspx?id=OP_5JY_1235__000001_OL161ED,0,0,
Asda Opticians,OPT_OL12 6XT,OPT,ASDA,THE OLD CRICKET GROUND,,ROCHDALE,,OL12 6XT,Tel: 01706 652012, - ,,,No ratings yet Rate it yourself - /Services/opticians/LeaveReview/DefaultView.aspx?id=OPT_OL12 6XT,0,0,
Crescent Optical Ltd,OPT_OL161PZ_1,OPT,,103 Drake Street,,Rochdale,Lancashire,OL16 1PZ,Tel: 01706 633020, - ,,,No ratings yet Rate it yourself - /Services/opticians/LeaveReview/DefaultView.aspx?id=OPT_OL161PZ_1,0,0,
The Clinic 4 Eyes Ltd,SP_5J5_3094__000001_OL111HH,OPT,Nye Bevan House,Maclure Road,,Rochdale,,OL11 1DN,Tel: 01706 868333, - ,,,2 ratings Rate it yourself - /Services/opticians/LeaveReview/DefaultView.aspx?id=SP_5J5_3094__000001_OL111HH,,,
Clinic 4 Eyes,OP_5NQ_00001__000002_OL111HH,OPT,Nye Bevan House,Maclure Road,Rochdale,Lancashire,,OL11 1DN,Tel: 01706 868333, - ,,,No ratings yet Rate it yourself - /Services/opticians/LeaveReview/DefaultView.aspx?id=OP_5NQ_00001__000002_OL111HH,0,0,
Focus Opticians,OP_5NQ_20430__000002_OL111EB,OPT,4 Milkstone Road,,Rochdale,Lancashire,,OL11 1EB,Tel: 01706 713200, - ,,,No ratings yet Rate it yourself - /Services/opticians/LeaveReview/DefaultView.aspx?id=OP_5NQ_20430__000002_OL111EB,0,0,
Eye Care Optical,OP_5JY_13744__000001_OL111EB,OPT,44 Milkstone Road,Rochdale,Lancashire,,,OL11 1EB,Tel: 01706 710500, - ,,,No ratings yet Rate it yourself - /Services/opticians/LeaveReview/DefaultView.aspx?id=OP_5JY_13744__000001_OL111EB,0,0,
S J  Holt,OP_5JY_13743__000001_OL112ER,OPT,216 Oldham Road,Rochdale,Lancashire,,,OL11 2ER,Tel: 01706 633084, - ,,,No ratings yet Rate it yourself - /Services/opticians/LeaveReview/DefaultView.aspx?id=OP_5JY_13743__000001_OL112ER,0,0,
Yates & Suddell,OP_5JY_4206__000001_OL163NW,OPT,,109 Dale Street,Rochdale,Milnrow,Lancashire,OL16 3NW,Tel: 01706 642203, - ,,,No ratings yet Rate it yourself - /Services/opticians/LeaveReview/DefaultView.aspx?id=OP_5JY_4206__000001_OL163NW,0,0,
Whitakers Opticians Ltd,OP_5J6_11442__000001_HX62AE,OPT,,34 - 36 Wharf Street,,Sowerby Bridge,West Yorkshire,HX6 2AE,Tel: 01422 831030, - ,,,No ratings yet Rate it yourself - /Services/opticians/LeaveReview/DefaultView.aspx?id=OP_5J6_11442__000001_HX62AE,0,0,yes
Sarah Farrar Opticians Ltd,OPT_BD150HX_1,OPT,,160 Main Street,,Wilsden,Yorkshire,BD15 0HX,Tel: 01535 274963, - ,,,2 ratings Rate it yourself - /Services/opticians/LeaveReview/DefaultView.aspx?id=OPT_BD150HX_1,,,no
Mark Andrew Hurst,HX2 8AL__000003_HX28AL,OPT,52 Keighley Road,Ovenden,Halifax,,,HX2 8AL,Tel: 01422 367348, - ,,,No ratings yet Rate it yourself - /Services/opticians/LeaveReview/DefaultView.aspx?id=HX2 8AL__000003_HX28AL,0,0,
The Eye Centre (Heywood) Ltd,OPT_OL104LY_1,OPT,,58 Market Street,,Heywood,Lancashire,OL10 4LY,Tel: 01706 620432, - ,,,1 rating Rate it yourself - /Services/opticians/LeaveReview/DefaultView.aspx?id=OPT_OL104LY_1,,,
Shaw's Opticians,OP_5F4_1008__000002_OL101HX,OPT,39 Market Street,39 Market Street,Heywood,Heywood,,OL10 1HX,Tel: 01706 369369, - ,,,1 rating Rate it yourself - /Services/opticians/LeaveReview/DefaultView.aspx?id=OP_5F4_1008__000002_OL101HX,,,
Vision Express Ltd,OP_5JX_BL90JN__000001_BL90JN,OPT,19 Central Street,The Rock,Bury,,,BL9 0JN,Tel: 0161 797 6639, - ,,,No ratings yet Rate it yourself - /Services/opticians/LeaveReview/DefaultView.aspx?id=OP_5JX_BL90JN__000001_BL90JN,0,0,
DG Opticians,OP_5F4_4583__000001_OL101AA,OPT,7 Hornby Street,,Heywood,,,OL10 1AA,Tel: 01706 369525, - ,,,No ratings yet Rate it yourself - /Services/opticians/LeaveReview/DefaultView.aspx?id=OP_5F4_4583__000001_OL101AA,0,0,
Specscart (Union Street),TP9EC,OPT,Specscart Bury,10 Union Street,,Bury,Greater Manchester,BL9 0NY,Tel: 01613125767, - ,,,No ratings yet Rate it yourself - /Services/opticians/LeaveReview/DefaultView.aspx?id=TP9EC,0,0,
Boots-Bury - Union Arcade,OP_5JX_10975__000001_BL90QF,OPT,Unit 7 Union Arcade,Millgate Shopping Centre,,Bury,Lancashire,BL9 0QF,Tel: 0161 705 1157, - ,,,No ratings yet Rate it yourself - /Services/opticians/LeaveReview/DefaultView.aspx?id=OP_5JX_10975__000001_BL90QF,0,0,
Rose & Tarrant Opticians,OP_5JX_13736__000001_BL90AD,OPT,,14 Crompton Street,Lancashire,Bury,Lancashire,BL9 0AD,Tel: 0161 764 4420, - ,,,1 rating Rate it yourself - /Services/opticians/LeaveReview/DefaultView.aspx?id=OP_5JX_13736__000001_BL90AD,,,
Specsavers Opticians,OP_5JX_717__000001_BL90BX,OPT,39/41,The Haymarket,Millgate Shopping Centre,Bury,Lancashire,BL9 0BX,Tel: 0161 763 3916, - ,,,No ratings yet Rate it yourself - /Services/opticians/LeaveReview/DefaultView.aspx?id=OP_5JX_717__000001_BL90BX,0,0,
J H  Fisher (Optometrist),OP_5JY_2528__000001_OL113AW,OPT,778-780 Manchester Road,Castleton,,Rochdale,,OL11 3AW,Tel: 01706 343505, - ,,,No ratings yet Rate it yourself - /Services/opticians/LeaveReview/DefaultView.aspx?id=OP_5JY_2528__000001_OL113AW,0,0,
Yates & Suddell,OP_5JX_100__000001_BL90QG,OPT,,15-19 Minden Parade,,Bury,Greater Manchester,BL9 0QG,Tel: 0161 7642209, - ,,,No ratings yet Rate it yourself - /Services/opticians/LeaveReview/DefaultView.aspx?id=OP_5JX_100__000001_BL90QG,0,0,
The Optical Shop,,OPT,,15 Princess Parade,Mill Gate Shopping Centre,Bury,Greater Manchester,BL9 0QL,Tel: 0161 2225020, - ,,,N/A - Data not available,,,
Bromley Cross Opticians,01-19767-0913,OPT,,494 Darwen Rd,Bromley Cross,Bolton,Lancashire,BL7 9DX,Tel: 01204 771818, - ,,,6 ratings Rate it yourself - /Services/opticians/LeaveReview/DefaultView.aspx?id=01-19767-0913,,,
opticare Eye Care Specialist Ltd,270516HX14NJ,OPT,,276 Queens Road,,Halifax,,HX1 4NJ,Tel: 01422 364453, - ,,,No ratings yet Rate it yourself - /Services/opticians/LeaveReview/DefaultView.aspx?id=270516HX14NJ,0,0,
Harwood Eyecare Opticians,TP9JR,OPT,,117 Lea Gate,,Bolton,,BL2 4BQ,Tel: 01204 771717, - ,,,No ratings yet Rate it yourself - /Services/opticians/LeaveReview/DefaultView.aspx?id=TP9JR,0,0,
King Cross Opticians,OP_HX13JP_29903,OPT,,220 King Cross Road,,Halifax,West Yorkshire,HX1 3JP,Tel: 01422 353000, - ,,,No ratings yet Rate it yourself - /Services/opticians/LeaveReview/DefaultView.aspx?id=OP_HX13JP_29903,0,0,
Supervision Optics,270516HX13JP,OPT,,202 King Cross Road,,Halifax,West Yorkshire,HX1 3JP,Tel: 01422 323211, - ,,,1 rating Rate it yourself - /Services/opticians/LeaveReview/DefaultView.aspx?id=270516HX13JP,,,yes
Victoria Gore Optometrist,OP_5CG_5030__000002_BD132PA,OPT,72 - 74 High Street,Queensbury,Bradford,,,BD13 2PA,Tel: 01274 815861, - ,,,No ratings yet Rate it yourself - /Services/opticians/LeaveReview/DefaultView.aspx?id=OP_5CG_5030__000002_BD132PA,0,0,
David Howarth ,OP_5AW_8980__000001_BD162HR,OPT,158 Main Street,,Bingley,,,BD16 2HR,Tel: 01274 563048, - ,,,No ratings yet Rate it yourself - /Services/opticians/LeaveReview/DefaultView.aspx?id=OP_5AW_8980__000001_BD162HR,0,0,
David C Kenyon,OP_5AW_14052__000002_BD161AJ,OPT,139 Main Street,Bingley,Bradford,,,BD16 1AJ,Tel: 01274 568622, - ,,,No ratings yet Rate it yourself - /Services/opticians/LeaveReview/DefaultView.aspx?id=OP_5AW_14052__000002_BD161AJ,0,0,
Specsavers Opticians,D8V4P,OPT,,155 Main Street,,Bingley,West Yorkshire,BD16 1AJ,Tel: 01274 028001, - ,,,No ratings yet Rate it yourself - /Services/opticians/LeaveReview/DefaultView.aspx?id=D8V4P,0,0,
Mackereth Opticians,OP_5J6_8393__000001_HX12SE,OPT,,6 Regent Street,,Halifax,West Yorkshire,HX1 2SE,Tel: 01422 352883, - ,,,No ratings yet Rate it yourself - /Services/opticians/LeaveReview/DefaultView.aspx?id=OP_5J6_8393__000001_HX12SE,0,0,no
Asda Stores Ltd,OP_5JX_11062__000002_BL98RS,OPT,Asda Store,Pilsworth Road,Pilsworth,Bury,,BL9 8RS,Tel: 0161 3512520, - ,,,No ratings yet Rate it yourself - /Services/opticians/LeaveReview/DefaultView.aspx?id=OP_5JX_11062__000002_BL98RS,0,0,
Boots-Halifax - Market St,OP_5J6_1088__000002_HX11PB,OPT,7-11 Market Street,,,Halifax,West Yorkshire,HX1 1PB,Tel: 01422352009, - ,,,3 ratings Rate it yourself - /Services/opticians/LeaveReview/DefaultView.aspx?id=OP_5J6_1088__000002_HX11PB,,,
I Care Opticians,OPT_HX11PB_1,OPT,i care opticians,36 Market Street,,Halifax,,HX1 1PB,Tel: 01422 385254, - ,,,No ratings yet Rate it yourself - /Services/opticians/LeaveReview/DefaultView.aspx?id=OPT_HX11PB_1,0,0,
Vision Express (UK) Ltd,OP_5J6_3092__000001_HX11RU,OPT,6 Woolshops,,Halifax,Halifax,,HX1 1RU,Tel: 01422 331018, - ,,,No ratings yet Rate it yourself - /Services/opticians/LeaveReview/DefaultView.aspx?id=OP_5J6_3092__000001_HX11RU,0,0,
Specsavers Opticians,QDT00:280__000002_HX11TQ,OPT,3-5 The Square,Woolshops Shopping Centre,,Halifax,,HX1 1RJ,Tel: 01422 255055, - ,,,No ratings yet Rate it yourself - /Services/opticians/LeaveReview/DefaultView.aspx?id=QDT00:280__000002_HX11TQ,0,0,
The Eyeworks,OPT0110__000002_BL22LS,OPT,53 Thicketford Road,,,Bolton,,BL2 2LS,Tel: 01204 559056, - ,,,1 rating Rate it yourself - /Services/opticians/LeaveReview/DefaultView.aspx?id=OPT0110__000002_BL22LS,,,
Greenhalgh Opticians,OP_5HQ_3339__000002_BL26PA,OPT,834 Bury Road,,Bolton,,,BL2 6PA,Tel: 01204 370760, - ,,,No ratings yet Rate it yourself - /Services/opticians/LeaveReview/DefaultView.aspx?id=OP_5HQ_3339__000002_BL26PA,0,0,
The Eye People,OP_5HQ_5096__000001_BL18HE,OPT,179 Blackburn Road,,Bolton,,,BL1 8HE,Tel: 01204 557300, - ,,,No ratings yet Rate it yourself - /Services/opticians/LeaveReview/DefaultView.aspx?id=OP_5HQ_5096__000001_BL18HE,0,0,
Robert Glass Opticians Limited,OP_5J5 42__000003_OL28NH,OPT,36 Market Street,Shaw,,Oldham,Lancashire,OL2 8NH,Tel: 01706 299422, - ,,,No ratings yet Rate it yourself - /Services/opticians/LeaveReview/DefaultView.aspx?id=OP_5J5 42__000003_OL28NH,0,0,
Univision Eye Centre,OLO1126805HQ__000001_BL18DF,OPT,341 Halliwell Rd,,Bolton,,,BL1 8DF,Tel: 01204 849900, - ,,,No ratings yet Rate it yourself - /Services/opticians/LeaveReview/DefaultView.aspx?id=OLO1126805HQ__000001_BL18DF,0,0,
Scrivens Opticians & Hearing Care,OP_5J5_4079__000001_OL28NY,OPT,,63 Market Street,,Shaw,Lancashire,OL2 8NP,Tel: 01706 847809, - ,,,No ratings yet Rate it yourself - /Services/opticians/LeaveReview/DefaultView.aspx?id=OP_5J5_4079__000001_OL28NY,0,0,
Stotts Opticians,OP_5JX_5509__000001_BL98JN,OPT,113 Parr Lane,Unsworth,Bury,,,BL9 8JN,Tel: 0161 796 6170, - ,,,No ratings yet Rate it yourself - /Services/opticians/LeaveReview/DefaultView.aspx?id=OP_5JX_5509__000001_BL98JN,0,0,
Scrivens Opticians & Hearing Care,OP_5J5_162__000001_OL25QA,OPT,,3 Market Square,,Royton,Lancashire,OL2 5QD,Tel: 0161 620 0121, - ,,,No ratings yet Rate it yourself - /Services/opticians/LeaveReview/DefaultView.aspx?id=OP_5J5_162__000001_OL25QA,0,0,
Vision Express,OP_5HQ_6882__000002_BL12AL,OPT,23-29 Upper Mall,,Bolton,,,BL1 2AL,Tel: 01204 532323, - ,,,No ratings yet Rate it yourself - /Services/opticians/LeaveReview/DefaultView.aspx?id=OP_5HQ_6882__000002_BL12AL,0,0,
Maxwell Kay Opticians Ltd,OP_5JX_2911__000001_M261NQ,OPT,26 Blackburn Street,Radcliffe,Manchester,,,M26 1NQ,Tel: 0161 723 3397, - ,,,No ratings yet Rate it yourself - /Services/opticians/LeaveReview/DefaultView.aspx?id=OP_5JX_2911__000001_M261NQ,0,0,
Optical Outlook Ltd,OP_5CH_5076__000001_BD184SB,OPT,T/A Opula Vision Centre,71 Bingley Road,Saltaire,,,BD18 4SB,Tel: 01274 533898, - ,,,1 rating Rate it yourself - /Services/opticians/LeaveReview/DefaultView.aspx?id=OP_5CH_5076__000001_BD184SB,,,
Scrivens Opticians & Hearing Care,BL1 2AP_12543,OPT,,18 Knowsley Street,,Bolton,Lancashire,BL1 2AP,Tel: 01204 523531, - ,,,No ratings yet Rate it yourself - /Services/opticians/LeaveReview/DefaultView.aspx?id=BL1 2AP_12543,0,0,
Eyewear Brands,OP_5HQ_6883__000001_BL11HH,OPT,15 Deansgate,,Bolton,Lancashire,,BL1 1HH,Tel: 01204 520055, - ,,,No ratings yet Rate it yourself - /Services/opticians/LeaveReview/DefaultView.aspx?id=OP_5HQ_6883__000001_BL11HH,0,0,
Boots-Bolton - The Gates,OP_5HQ_6690__000001_BL11BL,OPT,Unit 12-15 The Gates Shopping Centre,Meal House Lane,Bolton,Greater Manchester,,BL1 1DF,Tel: 01204 363555, - ,,,No ratings yet Rate it yourself - /Services/opticians/LeaveReview/DefaultView.aspx?id=OP_5HQ_6690__000001_BL11BL,0,0,
I & M Eyecare,OP_5HQ_0154__000001_BL13BW,OPT,232 Chorley Old Road,,Bolton,,,BL1 3BW,Tel: 01204 849595, - ,,,No ratings yet Rate it yourself - /Services/opticians/LeaveReview/DefaultView.aspx?id=OP_5HQ_0154__000001_BL13BW,0,0,
One Vision Opticians,OP_5HQ_10008__000001_BL11DD,OPT,22 Mealhouse Lane,,Bolton,,,BL1 1DD,Tel: 01204 384305, - ,,,No ratings yet Rate it yourself - /Services/opticians/LeaveReview/DefaultView.aspx?id=OP_5HQ_10008__000001_BL11DD,0,0,
Eyedeal Optical (Yorkshire) Ltd,OP_5CF_4568__000001_BD95ER,OPT,45-47 Duckworth Lane,45 Duckworth Lane,Bradford,Bradford,,BD9 5ET,Tel: 01274 488825, - ,,,No ratings yet Rate it yourself - /Services/opticians/LeaveReview/DefaultView.aspx?id=OP_5CF_4568__000001_BD95ER,0,0,
Crossroads Optical Centre,OP_5CF_14050__000002_BD95HB,OPT,54 Duckworth Lane,Bradford,West Yorkshire,,,BD9 5HB,Tel: 01274 544520, - ,,,No ratings yet Rate it yourself - /Services/opticians/LeaveReview/DefaultView.aspx?id=OP_5CF_14050__000002_BD95HB,0,0,
J Bowden Ltd,OP_5HQ_2371__000002_BL16AB,OPT,552 Chorley Old Road,,Bolton,,,BL1 6AB,Tel: 01204 846219, - ,,,No ratings yet Rate it yourself - /Services/opticians/LeaveReview/DefaultView.aspx?id=OP_5HQ_2371__000002_BL16AB,0,0,
Andrew Fletcher Opticians,CO135HQ__000001_BL14QR,OPT,13 Chorley New Road,,Bolton,,,BL1 4QR,Tel: 01204 520921, - ,,,4 ratings Rate it yourself - /Services/opticians/LeaveReview/DefaultView.aspx?id=CO135HQ__000001_BL14QR,,,
Specsavers Opticians,OP_5HQ_6211__000001_BL11BQ,OPT,27 - 29 Victoria Square,,Bolton,,,BL1 1RJ,Tel: 01204 521122, - ,,,No ratings yet Rate it yourself - /Services/opticians/LeaveReview/DefaultView.aspx?id=OP_5HQ_6211__000001_BL11BQ,0,0,
Brosgill Opticians,OP_LS299NQ_46855,OPT,Brosgill Opticians,27 The Grove,,Ilkley,West Yorkshire,LS29 9NQ,Tel: 01943 816033, - ,,,No ratings yet Rate it yourself - /Services/opticians/LeaveReview/DefaultView.aspx?id=OP_LS299NQ_46855,0,0,
Paul Verity Opticians,OP_5AW_2354__000001_LS299EE,OPT,50 The Grove,,Ilkley,West Yorkshire,,LS29 9EE,Tel: 01943 608533, - ,,,No ratings yet Rate it yourself - /Services/opticians/LeaveReview/DefaultView.aspx?id=OP_5AW_2354__000001_LS299EE,0,0,
I Care at Home,OPT_BL21BJ_1,OPT,4a Caroline House,125 Bradshawgate,,Bolton,,BL2 1BJ,Tel: 08002461462, - ,,,1 rating Rate it yourself - /Services/opticians/LeaveReview/DefaultView.aspx?id=OPT_BL21BJ_1,,,
Optimeyes Opticians,OP_5KJ_12137__000001_BD231DG,OPT,15b The Moors Shopping Centre,South Hawksworth Street,Ilkley,West Yorkshire,,LS29 9LB,Tel: 01943 604600, - ,,,No ratings yet Rate it yourself - /Services/opticians/LeaveReview/DefaultView.aspx?id=OP_5KJ_12137__000001_BD231DG,0,0,
Specsavers Opticians,BRA165/5NY__000002_LS299LB,OPT,"5, 6 and 7 The Moors Shopping Centre",,Ilkley,West Yorkshire,,LS29 9LB,Tel: 01943 811330, - ,,,No ratings yet Rate it yourself - /Services/opticians/LeaveReview/DefaultView.aspx?id=BRA165/5NY__000002_LS299LB,0,0,
Specsavers Opticians,OP_5CF_14049__000002_BD89BN,OPT,"Unit 12, Victoria Shopping Centre",Thornton Road,Bradford,,,BD8 9BN,Tel: 01274 480030, - ,,,No ratings yet Rate it yourself - /Services/opticians/LeaveReview/DefaultView.aspx?id=OP_5CF_14049__000002_BD89BN,0,0,
Premier Vision,TP90X,OPT,Unit 4,Victoria Centre,Thornton Road,Bradford,West Yorkshire,BD8 9BN,Tel: 01274 499550, - ,,,No ratings yet Rate it yourself - /Services/opticians/LeaveReview/DefaultView.aspx?id=TP90X,0,0,
Boots Opticians,OPT_LS299LA_1,OPT,,"Unit 1, Dalesway House",South Hawksworth Street,Ilkley,West Yorkshire,LS29 9LA,Tel: 01943 605557 (ext. 1303), - ,,,No ratings yet Rate it yourself - /Services/opticians/LeaveReview/DefaultView.aspx?id=OPT_LS299LA_1,0,0,
Specs Direct Opticians,OP_5JX_13738__000001_M456BG,OPT,8 Elms Square,Whitefield,Manchester,,,M45 7TA,Tel: 0161 767 9740, - ,,,No ratings yet Rate it yourself - /Services/opticians/LeaveReview/DefaultView.aspx?id=OP_5JX_13738__000001_M456BG,0,0,