Organisation Name,NACS Code,Organisation Type,Address1,Address2,Address3,Address4,Address5,PostCode,Telephone Number,Opening time,Value  (Opening time),Banding Classification  (Opening time),NHS.UK users rating,Value  (NHS.UK users rating),Banding Classification  (NHS.UK users rating),Car parking (Is there car parking at this organisation?)
Eye Express,5MX090,OPT,,"Unit 32, One Stop Shopping Centre",Perry Barr,Birmingham,,B42 1AA,Tel: 0121 356 7115, - ,,,No ratings yet Rate it yourself - /Services/opticians/LeaveReview/DefaultView.aspx?id=5MX090,0,0,
Eyes & Vision,5MX023,OPT,,280 Wellington,,Birmingham,,B20 2QL,, - ,,,No ratings yet Rate it yourself - /Services/opticians/LeaveReview/DefaultView.aspx?id=5MX023,0,0,
"I M HADFIELD BSc, FCOptom, OPTOMETRISTS",5MX107__000002_B422HN,OPT,,162 Beecehes Road,Birmingham,Birmingham,,B42 2HN,Tel: 0121 357 1748, - ,,,1 rating Rate it yourself - /Services/opticians/LeaveReview/DefaultView.aspx?id=5MX107__000002_B422HN,,,
Ados Sightcare Ltd,01-17616/5PK/C__000001_B448JG,OPT,1 Ridgewood Gardens,Great Barr,Birmingham,,,B44 8JG,Tel: 0121 384 2771, - ,,,No ratings yet Rate it yourself - /Services/opticians/LeaveReview/DefaultView.aspx?id=01-17616/5PK/C__000001_B448JG,0,0,
Syed Hassan Abbas Abdi,OP_5MX_01__000001_B66SP,OPT,,403 Witton Road,Aston,Birmingham,,B6 6SP,Tel: 0121 356 9390, - ,,,No ratings yet Rate it yourself - /Services/opticians/LeaveReview/DefaultView.aspx?id=OP_5MX_01__000001_B66SP,0,0,
Shah-Jallal Opticians,5MX113,OPT,,420 Witton Road,,Birmingham,,B6 6PP,, - ,,,No ratings yet Rate it yourself - /Services/opticians/LeaveReview/DefaultView.aspx?id=5MX113,0,0,
Scrivens Ltd,OP_5MJ_5454__000001_B421NN,OPT,1-2 International House,Old Walsall Road,,Hamstead,West Midlands,B42 1NN,Tel: 0121 357 3182, - ,,,No ratings yet Rate it yourself - /Services/opticians/LeaveReview/DefaultView.aspx?id=OP_5MJ_5454__000001_B421NN,0,0,
Hamstead Eyecare,01-19254-201213,OPT,4 International House,Old Walsall Road,Great Barr,Birmingham,,B42 1NN,Tel: 0121 679 4493, - ,,,2 ratings Rate it yourself - /Services/opticians/LeaveReview/DefaultView.aspx?id=01-19254-201213,,,
Mahendra Mohanlal Davda ,OP_5MX_8215__000001_B66PD,OPT,,364 Witton Road,Aston,Birmingham,,B6 6PD,Tel: 0121 327 7792, - ,,,No ratings yet Rate it yourself - /Services/opticians/LeaveReview/DefaultView.aspx?id=OP_5MX_8215__000001_B66PD,0,0,
NVision Eyecare,01-21451,OPT,,205 Birchfield Road,,Birmingham,,B19 1LL,Tel: 0121 554 5786, - ,,,No ratings yet Rate it yourself - /Services/opticians/LeaveReview/DefaultView.aspx?id=01-21451,0,0,
Salisbury Jones Ltd,OP_5MW_9189__000001_B448QT,OPT,103 Hawthorn Road,Kingstanding,,Birmingham,,B44 8QT,Tel: 0121 373 2556, - ,,,No ratings yet Rate it yourself - /Services/opticians/LeaveReview/DefaultView.aspx?id=OP_5MW_9189__000001_B448QT,0,0,
Scrivens Ltd,OP_5MW_10748__000001_B448PL,OPT,231 Hawthorn Road,Kingstanding,,Birmingham,West Midlands,B44 8PL,Tel: 0121 373 1447, - ,,,No ratings yet Rate it yourself - /Services/opticians/LeaveReview/DefaultView.aspx?id=OP_5MW_10748__000001_B448PL,0,0,
R J Owen Opticians,5MW29__000001_B440QU,OPT,10 Warren Farm Road,Kingstanding,Birmingham,,,B44 0QU,Tel: 0121 373 5790, - ,,,No ratings yet Rate it yourself - /Services/opticians/LeaveReview/DefaultView.aspx?id=5MW29__000001_B440QU,0,0,
Roots Opticians,5MX73__000002_B66HZ,OPT,168 Trinity Road,Aston,Birmingham,,,B6 6HZ,Tel: 0121 328 5700, - ,,,No ratings yet Rate it yourself - /Services/opticians/LeaveReview/DefaultView.aspx?id=5MX73__000002_B66HZ,0,0,
20-20 Vision,5MX127,OPT,,174 Lozells Road,,Birmingham,,B19 2SX,Tel: 0121 551 1721, - ,,,1 rating Rate it yourself - /Services/opticians/LeaveReview/DefaultView.aspx?id=5MX127,,,
Specs Direct,5MX69__000002_B192SX,OPT,,150 Lozells Road,Lozells,Birmingham,,B19 2SX,Tel: 0121 507 1661, - ,,,No ratings yet Rate it yourself - /Services/opticians/LeaveReview/DefaultView.aspx?id=5MX69__000002_B192SX,0,0,
Gallery Opticians,5MX66__000002_B192TJ,OPT,52e Lozels Road,Lozells,Birmingham,,,B19 2TJ,Tel: 0121 554 2563, - ,,,7 ratings Rate it yourself - /Services/opticians/LeaveReview/DefaultView.aspx?id=5MX66__000002_B192TJ,,,
Cox Opticians,5MX106,OPT,,20 Victoria Road,Aston,Birmingham,,B6 5HA,Tel: 0121 507 0812, - ,,,No ratings yet Rate it yourself - /Services/opticians/LeaveReview/DefaultView.aspx?id=5MX106,0,0,
Ward (Ophthalmic Opticians) Ltd,5MX67__000001_B219RN,OPT,,76 Oxhill Road,Handsworth,Birmingham,,B21 9RH,Tel: 0121 554 8949, - ,,,No ratings yet Rate it yourself - /Services/opticians/LeaveReview/DefaultView.aspx?id=5MX67__000001_B219RN,0,0,
HD Eye Clinic Ltd,5MX135,OPT,,295 Rookery Road,Handsworth,Birmingham,,B21 9PS,Tel: 0121 448 1819, - ,,,No ratings yet Rate it yourself - /Services/opticians/LeaveReview/DefaultView.aspx?id=5MX135,0,0,
Eye Express,5MX016,OPT,909 Walsall Road,Great Barr,,Birmingham,,B42 1TN,Tel: 0121 357 6465, - ,,,No ratings yet Rate it yourself - /Services/opticians/LeaveReview/DefaultView.aspx?id=5MX016,0,0,
Colin Lee (Opticians) Ltd,OP_5MJ_9813__000002_B421TQ,OPT,Scott Arms Shopping Centre,964 Walsall Road,Great Barr,,,B42 1TQ,Tel: 0121 357 7890, - ,,,No ratings yet Rate it yourself - /Services/opticians/LeaveReview/DefaultView.aspx?id=OP_5MJ_9813__000002_B421TQ,0,0,
Banks Opticians,OP_5MY_10216__000001_B237JG,OPT,511 Slade Road,Erdington,Birmingham,West Midlands,,B23 7JG,Tel: 0121 373 0435, - ,,,No ratings yet Rate it yourself - /Services/opticians/LeaveReview/DefaultView.aspx?id=OP_5MY_10216__000001_B237JG,0,0,
The Spectacle Company,5MX106__000002_B449ST,OPT,766 Kingstanding Road,Kingstanding,Birmingham,,,B44 9ST,Tel: 0121 355 5639, - ,,,3 ratings Rate it yourself - /Services/opticians/LeaveReview/DefaultView.aspx?id=5MX106__000002_B449ST,,,
Onkar Eye Centre,OP_5MX_12737__000001_B219DP,OPT,98 Soho Road,Birmingham,,,,B21 9DP,Tel: 0121 554 8341, - ,,,No ratings yet Rate it yourself - /Services/opticians/LeaveReview/DefaultView.aspx?id=OP_5MX_12737__000001_B219DP,0,0,
Scrivens Ltd,5MX108__000004_B449HH,OPT,,635 Kingstanding Road,Kingstanding,Birmingham,West Midlands,B44 9SU,Tel: 0121 354 2100, - ,,,No ratings yet Rate it yourself - /Services/opticians/LeaveReview/DefaultView.aspx?id=5MX108__000004_B449HH,0,0,
Vernon Walker Opticians Ltd,5MX109__000005_B449HH,OPT,,unit 21,The Kingstanding Centre,Birmingham,,B44 9HH,Tel: 0121 354 2992, - ,,,No ratings yet Rate it yourself - /Services/opticians/LeaveReview/DefaultView.aspx?id=5MX109__000005_B449HH,0,0,
D M Eye Clinic,5MX108,OPT,,Unit 2-5 Soho City Shopping Centre,263-265 Soho Road,Birmingham,,B21 9RY,Tel: 0121 523 7337, - ,,,No ratings yet Rate it yourself - /Services/opticians/LeaveReview/DefaultView.aspx?id=5MX108,0,0,
Specs Direct,5PG14__000001_B237RJ,OPT,184 Slade Road,Erdington,Birmingham,,,B23 7RJ,Tel: 0121 384 2828, - ,,,No ratings yet Rate it yourself - /Services/opticians/LeaveReview/DefaultView.aspx?id=5PG14__000001_B237RJ,0,0,
Eurospex Opticians Ltd,5MX61__000001_B219NA,OPT,,332 Soho Road,Handsworth,Birmingham,,B21 9NA,Tel: 0121 523 4967, - ,,,1 rating Rate it yourself - /Services/opticians/LeaveReview/DefaultView.aspx?id=5MX61__000001_B219NA,,,
K G Miles,OP_5MX_1989__000001_B219SE,OPT,349a Soho Road,Handsworth,Birmingham,,,B21 9SE,Tel: 0121 5542130, - ,,,4 ratings Rate it yourself - /Services/opticians/LeaveReview/DefaultView.aspx?id=OP_5MX_1989__000001_B219SE,,,
Direct Vision Opticians,TP8Y2,OPT,Direct Vision Opticians,122 Hillingford Avenue,Great Barr,Birmingham,West Midlands,B43 7JU,Tel: 0121 325 0665, - ,,,No ratings yet Rate it yourself - /Services/opticians/LeaveReview/DefaultView.aspx?id=TP8Y2,0,0,yes
Bansal Opticians,OP_5MX_11328__000001_B219SF,OPT,381 Soho Road,Handsworth,Birmingham,West Midlands,,B21 9SF,Tel: 0121 554 5662, - ,,,No ratings yet Rate it yourself - /Services/opticians/LeaveReview/DefaultView.aspx?id=OP_5MX_11328__000001_B219SF,0,0,
Specs Eye Centre,5MX116,OPT,,127 Holyhead Road,Handsworth,Birmingham,,B21 0HH,Tel: 0121 554 9876, - ,,,No ratings yet Rate it yourself - /Services/opticians/LeaveReview/DefaultView.aspx?id=5MX116,0,0,
Costco,OPT_B75SA_1,OPT,,100 Watson Road,Nechells,Birmingham,,B7 5SA,Tel: 0121 326 3515, - ,,,1 rating Rate it yourself - /Services/opticians/LeaveReview/DefaultView.aspx?id=OPT_B75SA_1,,,
Ward (Opthalmic Opticians) Ltd,OP_5MW_12170__000001_B735BA,OPT,85a Chester Road,Sutton Coldfield,West Midlands,,,B73 5BA,Tel: 0121 354 8168, - ,,,No ratings yet Rate it yourself - /Services/opticians/LeaveReview/DefaultView.aspx?id=OP_5MW_12170__000001_B735BA,0,0,
Focus Eye Clinic,5MX109,OPT,,65 Rupert Street,Nechells,Birmingham,,B7 5DT,Tel: 0121 359 2666, - ,,,No ratings yet Rate it yourself - /Services/opticians/LeaveReview/DefaultView.aspx?id=5MX109,0,0,
Tesco Opticians ,5PG157,OPT,,11 Princess Alice Drive,,Sutton Coldfield,,B73 6RB,Tel: 0345 601 3479, - ,,,No ratings yet Rate it yourself - /Services/opticians/LeaveReview/DefaultView.aspx?id=5PG157,0,0,
Scrivens Ltd,OP_5MY_10763__000001_B236SN,OPT,246 High Street,Erdington,,Birmingham,West Midlands,B23 6SN,Tel: 0121 373 0680, - ,,,No ratings yet Rate it yourself - /Services/opticians/LeaveReview/DefaultView.aspx?id=OP_5MY_10763__000001_B236SN,0,0,
Bainbridge Optometrists,OP_5MY_8779__000002_B236SN,OPT,240 High Street,Erdington,,Birmingham,,B23 6SN,Tel: 0121 377 7459, - ,,,No ratings yet Rate it yourself - /Services/opticians/LeaveReview/DefaultView.aspx?id=OP_5MY_8779__000002_B236SN,0,0,
Realeyes Opticians ,OP_5MY_9140__000001_B236TE,OPT,169 High Street,Erdington,,Birmingham,,B23 6SY,Tel: 0121 373 0368, - ,,,1 rating Rate it yourself - /Services/opticians/LeaveReview/DefaultView.aspx?id=OP_5MY_9140__000001_B236TE,,,yes
Specsavers Opticians,OP_5MY_7640__000002_B236RS,OPT,138B High Street,Erdington,,Birmingham,,B23 6RS,Tel: 0121 382 1477, - ,,,No ratings yet Rate it yourself - /Services/opticians/LeaveReview/DefaultView.aspx?id=OP_5MY_7640__000002_B236RS,0,0,
Ward ( Ophthalmic Opticians) Ltd,OP_5MY_13858__000001_B236QU,OPT,202 Sutton New Road,Erdington,,Birmingham,,B23 6QU,Tel: 0121 373 6897, - ,,,No ratings yet Rate it yourself - /Services/opticians/LeaveReview/DefaultView.aspx?id=OP_5MY_13858__000001_B236QU,0,0,
Aston Eye Clinic,OP_5MX_1502__000001_B47ET,OPT,,Aston Eye Clinic,"Vision Science, Aston University",Birmingham,West Midlands,B4 7ET,Tel: 0121 204 3900, - ,,,No ratings yet Rate it yourself - /Services/opticians/LeaveReview/DefaultView.aspx?id=OP_5MX_1502__000001_B47ET,0,0,
Visioncare at Home North West Limited,143109052017,OPT,,"Office 310, Steward Street Business Lofts",,Birmingham,West Midlands,B18 7AF,Tel: 0121 272 1930, - ,,,2 ratings Rate it yourself - /Services/opticians/LeaveReview/DefaultView.aspx?id=143109052017,,,
Matthew Spencer,5PG174,OPT,,11 Shipley Fields,Erdington,Birmingham,,B24 9BW,Tel: 0121 382 8183, - ,,,No ratings yet Rate it yourself - /Services/opticians/LeaveReview/DefaultView.aspx?id=5PG174,0,0,
Andrew Martin Optometrist Ltd,5MW224__000003_B735TJ,OPT,66 Boldmere Road,Boldmere,Sutton Coldfield,West Midlands,,B73 5TJ,Tel: 0121 354 6411, - ,,,No ratings yet Rate it yourself - /Services/opticians/LeaveReview/DefaultView.aspx?id=5MW224__000003_B735TJ,0,0,yes
Montague Canin,5MX78__000001_B46TB,OPT,166 Corporation Street,City Centre,Birmingham,,,B4 6TB,Tel: 0121 236 1487, - ,,,No ratings yet Rate it yourself - /Services/opticians/LeaveReview/DefaultView.aspx?id=5MX78__000001_B46TB,0,0,
Gurdeep Singh Dhinsa,5MX062,OPT,,24 Beacon Road,,Walsall,,WS5 3LF,Tel: 0121 357 3477, - ,,,No ratings yet Rate it yourself - /Services/opticians/LeaveReview/DefaultView.aspx?id=5MX062,0,0,
Scrivens Ltd,OP_5MX_7381__000001_B24UG,OPT,93 Corporation Street,,,Birmingham,West Midlands,B2 4UG,Tel: 0121 236 7583, - ,,,No ratings yet Rate it yourself - /Services/opticians/LeaveReview/DefaultView.aspx?id=OP_5MX_7381__000001_B24UG,0,0,
Eye Centre,5MX64__000001_B184HA,OPT,,289 Dudley Road,Winson Green,Birmingham,,B18 4HA,Tel: 0121 454 6569, - ,,,No ratings yet Rate it yourself - /Services/opticians/LeaveReview/DefaultView.aspx?id=5MX64__000001_B184HA,0,0,
Boots-Birmingham - High Street,OP_5MX_2107__000003_B47TA,OPT,,67 - 69 High Street,Birmingham High Street,Birmingham,West Midlands,B4 7TA,Tel: 0121 2366027, - ,,,4 ratings Rate it yourself - /Services/opticians/LeaveReview/DefaultView.aspx?id=OP_5MX_2107__000003_B47TA,,,
Sodha Optometrists,5MY34__000001_B87ND,OPT,95 Alum Rock Road,Alum Rock,Birmingham,,,B8 1ND,Tel: 0121 326 0334, - ,,,No ratings yet Rate it yourself - /Services/opticians/LeaveReview/DefaultView.aspx?id=5MY34__000001_B87ND,0,0,
Manjot Optical,OP_5MX_7307__000001_B184HD,OPT,,387 Dudley Road,Winson Green,Birmingham,,B18 4HD,Tel: 0121 555 6524, - ,,,1 rating Rate it yourself - /Services/opticians/LeaveReview/DefaultView.aspx?id=OP_5MX_7307__000001_B184HD,,,
Latenight Pharmacy,5MX126,OPT,,328-330 Dudley Road,Winson Green,Birmingham,,B18 4HJ,Tel: 0121 454 4466, - ,,,No ratings yet Rate it yourself - /Services/opticians/LeaveReview/DefaultView.aspx?id=5MX126,0,0,
Piccadilly Opticians,5MX084,OPT,,13 Piccadilly Arcade,,Birmingham,,B2 4HD,, - ,,,1 rating Rate it yourself - /Services/opticians/LeaveReview/DefaultView.aspx?id=5MX084,,,
Specsavers Opticians ,5MX75__000001_B24RQ,OPT,,14-15 New Street,,Birmingham,,B2 4RQ,Tel: 0121 616 2220, - ,,,No ratings yet Rate it yourself - /Services/opticians/LeaveReview/DefaultView.aspx?id=5MX75__000001_B24RQ,0,0,
The Contact Lens Practice Ltd,OP_5MX_10123__000001_B24JD,OPT,5 Lower Temple Street (First Floor),,Birmingham,West Midlands,,B2 4JD,Tel: 0121 643 3848, - ,,,No ratings yet Rate it yourself - /Services/opticians/LeaveReview/DefaultView.aspx?id=OP_5MX_10123__000001_B24JD,0,0,
A B Optics Ltd,5PG123,OPT,,360 Birmingham Road,Wylde Green,Sutton Coldfield,,B72 1YH,Tel: 0121 384 5743, - ,,,4 ratings Rate it yourself - /Services/opticians/LeaveReview/DefaultView.aspx?id=5PG123,,,
Lad & Turner Optical Practice,OP_5MW_8465__000001_B721YG,OPT,8 The Lanes shopping centre,340 Birmingham Road,Wylde Green,sutton coldfield,West Midlands,B72 1YG,Tel: 01213505872, - ,,,No ratings yet Rate it yourself - /Services/opticians/LeaveReview/DefaultView.aspx?id=OP_5MW_8465__000001_B721YG,0,0,
Onkar Eye Care Opticians,5MY33__000002_B81NH,OPT,151 Alum Rock Road,Saltley,,Birmingham,,B8 1NH,Tel: 0121 327 0620, - ,,,1 rating Rate it yourself - /Services/opticians/LeaveReview/DefaultView.aspx?id=5MY33__000002_B81NH,,,
Opticial Express,OP_12345_B4 7SL,OPT,41 High Street,,,Birmingham,West Midlands,B4 7SL,Tel: 0800 023 2020, - ,,,No ratings yet Rate it yourself - /Services/opticians/LeaveReview/DefaultView.aspx?id=OP_12345_B4 7SL,0,0,
Euro Spex Opticians Ltd,OP_5MY_10353__000002_B81HU,OPT,158 Alum Rock Road,Saltley,,Birmingham,,B8 1HU,Tel: 0121 326 8181, - ,,,No ratings yet Rate it yourself - /Services/opticians/LeaveReview/DefaultView.aspx?id=OP_5MY_10353__000002_B81HU,0,0,
Home Eye Clinic Ltd,OP_B81AE_46764,OPT,,"Unit 2, Urban House",,Birmingham,West Midlands,B8 1AE,Tel: 0800 6122145, - ,,,No ratings yet Rate it yourself - /Services/opticians/LeaveReview/DefaultView.aspx?id=OP_B81AE_46764,0,0,
Vision Express (UK) Ltd,5MX76__000001_B54BE,OPT,,SU522 Middle Mall,Bull Ring,Birmingham,,B5 4BE,Tel: 0121 643 3324, - ,,,1 rating Rate it yourself - /Services/opticians/LeaveReview/DefaultView.aspx?id=5MX76__000001_B54BE,,,
The I Clinic,OP_B83BH_30203,OPT,,227 Alum Rock Road,Alum Rock,Birmingham,,B8 3BH,Tel: 0121 326 9008, - ,,,No ratings yet Rate it yourself - /Services/opticians/LeaveReview/DefaultView.aspx?id=OP_B83BH_30203,0,0,
Neil Berry Opticians,OP_5MY_2324__000001_B249LY,OPT,556 Holly Lane,Erdington,,Birmingham,,B24 9LY,Tel: 0121 377 7393, - ,,,No ratings yet Rate it yourself - /Services/opticians/LeaveReview/DefaultView.aspx?id=OP_5MY_2324__000001_B249LY,0,0,
Boots-Birmingham - Erdington Fort ,OP_5MY_6131__000002_B249QS,OPT,Unit 8 Fort Retail Park,20 Fort Parkway,Erdington,Birmingham,West Midlands,B24 9FP,Tel: 01213 826673, - ,,,No ratings yet Rate it yourself - /Services/opticians/LeaveReview/DefaultView.aspx?id=OP_5MY_6131__000002_B249QS,0,0,
Vision Express (UK) Ltd,5PG15__000001_B249FP,OPT,Unit9a The Fort Shopping Park,Erdington,,Birmingham,,B24 9FP,Tel: 0121 384 3110, - ,,,1 rating Rate it yourself - /Services/opticians/LeaveReview/DefaultView.aspx?id=5PG15__000001_B249FP,,,
Cape Opticians,OP_5MG_10220__000001_B664SG,OPT,79 Cape Hill,,Smethwick,,,B66 4SG,Tel: 0121 558 0148, - ,,,No ratings yet Rate it yourself - /Services/opticians/LeaveReview/DefaultView.aspx?id=OP_5MG_10220__000001_B664SG,0,0,
Vision Care for Homeless People,5MX121,OPT,SIFA Fireside,48-52 Allcock Street,,Birmingham,,B9 4DY,Tel: 0121 766 1700, - ,,,No ratings yet Rate it yourself - /Services/opticians/LeaveReview/DefaultView.aspx?id=5MX121,0,0,
Express Vision Care,OP_5MG_13680__000002_B661DS,OPT,70 High Street,,Smethwick,,,B66 1DS,Tel: 0121 558 6322, - ,,,No ratings yet Rate it yourself - /Services/opticians/LeaveReview/DefaultView.aspx?id=OP_5MG_13680__000002_B661DS,0,0,
Avmal Eyewear,OP_5MG_13678__000001_B661DT,OPT,28 High Street,,Smethwick,,,B66 1DT,Tel: 0121 558 9310, - ,,,No ratings yet Rate it yourself - /Services/opticians/LeaveReview/DefaultView.aspx?id=OP_5MG_13678__000001_B661DT,0,0,
Vineys Opticians,OP_5MG_13681__000001_B663NJ,OPT,277-279 High Street,,Smethwick,,,B66 3NJ,Tel: 0121 558 0790, - ,,,No ratings yet Rate it yourself - /Services/opticians/LeaveReview/DefaultView.aspx?id=OP_5MG_13681__000001_B663NJ,0,0,
Attewell and Hardwick Eyecare,OP_5MJ_3174__000001_B713HN,OPT,,96 Walsall Road,,West Bromwich,,B71 3HN,Tel: 0121 588 6163, - ,,,3 ratings Rate it yourself - /Services/opticians/LeaveReview/DefaultView.aspx?id=OP_5MJ_3174__000001_B713HN,,,
T. Cox Opticians,5MX079,OPT,T. Cox Opticians,565 Washwood Heath Road,Ward End,Birmingham,,B8 2HB,Tel: 0121 327 1814, - ,,,No ratings yet Rate it yourself - /Services/opticians/LeaveReview/DefaultView.aspx?id=5MX079,0,0,
Eyes & Vision,OP_5MJ_13674__000002_B713HP,OPT,136 Walsall Road,,West Bromwich,,,B71 3HP,Tel: 0121 588 8484, - ,,,No ratings yet Rate it yourself - /Services/opticians/LeaveReview/DefaultView.aspx?id=OP_5MJ_13674__000002_B713HP,0,0,
Attewell Opticians,OP_5MJ_3165__000002_B706NZ,OPT,100 High Street,,West Bromwich,,,B70 6JW,Tel: 0121 553 4511, - ,,,No ratings yet Rate it yourself - /Services/opticians/LeaveReview/DefaultView.aspx?id=OP_5MJ_3165__000002_B706NZ,0,0,
Park Hall Opticians,OP_RL170914_01-19420,OPT,Gillity Village Shops,15 Liskeard Road,Park Hall,Walsall,,WS5 3EY,Tel: 01922 614 205, - ,,,1 rating Rate it yourself - /Services/opticians/LeaveReview/DefaultView.aspx?id=OP_RL170914_01-19420,,,
Spectrum Opticians,OP_5MG_2442__000001_B664JW,OPT,14 Waterloo Road,,Smethwick,,,B66 4JW,Tel: 0121 565 4505, - ,,,No ratings yet Rate it yourself - /Services/opticians/LeaveReview/DefaultView.aspx?id=OP_5MG_2442__000001_B664JW,0,0,
Tesco Opticians,B707PR141016,OPT,,46 New Square,,West Bromwich,,B70 7PR,, - ,,,No ratings yet Rate it yourself - /Services/opticians/LeaveReview/DefaultView.aspx?id=B707PR141016,0,0,
Specs Direct (Ward End) Ltd,5PG156,OPT,,659 Washwood Heath Road,Washwood Heath,Birmingham,,B8 2HJ,Tel: 0121 328 2964, - ,,,4 ratings Rate it yourself - /Services/opticians/LeaveReview/DefaultView.aspx?id=5PG156,,,
Eye Opticians Ltd,5MX63__000004_B151LD,OPT,,44 Islington Row,Edgbaston,Birmingham,,B15 1LD,Tel: 0121 456 5676, - ,,,No ratings yet Rate it yourself - /Services/opticians/LeaveReview/DefaultView.aspx?id=5MX63__000004_B151LD,0,0,
4 Sight Eyecare,OP_5MJ_12132__000002_B707NG,OPT,Unit 5 Queens Square,,West Bromwich,,,B70 7NG,Tel: 0121 525 5144, - ,,,No ratings yet Rate it yourself - /Services/opticians/LeaveReview/DefaultView.aspx?id=OP_5MJ_12132__000002_B707NG,0,0,
Boots-Birmingham - West Bromwich,OP_5MJ_6306__000001_B707QZ,OPT,197 High Street,Princess Parade,,West Bromwich,,B70 7QZ,Tel: 0121 553 0935, - ,,,No ratings yet Rate it yourself - /Services/opticians/LeaveReview/DefaultView.aspx?id=OP_5MJ_6306__000001_B707QZ,0,0,
Specsavers Opticians,OP_5MJ_2089__000001_B707NW,OPT,70 Kings Square,Sandwell Shopping Centre,West Bromwich,West Midlands,,B70 7NW,Tel: 0121 553 0685, - ,,,1 rating Rate it yourself - /Services/opticians/LeaveReview/DefaultView.aspx?id=OP_5MJ_2089__000001_B707NW,,,
S W Optics Ltd,5MY32__000003_B368TY,OPT,140 Bromford Drive,Bromford,Birmingham,,,B36 8TY,Tel: 0121 749 2660, - ,,,No ratings yet Rate it yourself - /Services/opticians/LeaveReview/DefaultView.aspx?id=5MY32__000003_B368TY,0,0,
Peter Ian McLauchlan,5M151__000003_B169HN,OPT,17 Portland Road,Edgbaston,Birmingham,,,B16 9HN,Tel: 0121 454 6307, - ,,,No ratings yet Rate it yourself - /Services/opticians/LeaveReview/DefaultView.aspx?id=5M151__000003_B169HN,0,0,
Eyeworld Opticians,5PG155,OPT,,678 Alum Rock Road,Pelham,Birmingham,,B8 3NU,Tel: 0121 328 4328, - ,,,No ratings yet Rate it yourself - /Services/opticians/LeaveReview/DefaultView.aspx?id=5PG155,0,0,
Boots-Birmingham - Hagley Rd,5M1099,OPT,,235-237 Hagley Road,Edgbaston,Birmingham,West Midlands,B16 9RR,Tel: 0121 454 3355, - ,,,2 ratings Rate it yourself - /Services/opticians/LeaveReview/DefaultView.aspx?id=5M1099,,,
Scrivens Ltd,OP_5MW_10794__000002_B721PU,OPT,115 Parade,,,Sutton Coldfield,West Midlands,B72 1PU,Tel: 0121 354 4534, - ,,,No ratings yet Rate it yourself - /Services/opticians/LeaveReview/DefaultView.aspx?id=OP_5MW_10794__000002_B721PU,0,0,
Eyespec,OPT_B100XE_1,OPT,,340 Coventry Road,Small Heath,Birmingham,,B10 0XE,Tel: 0121 772 1526, - ,,,1 rating Rate it yourself - /Services/opticians/LeaveReview/DefaultView.aspx?id=OPT_B100XE_1,,,
Portland Eye Care Services Ltd,5MX72__000001_B100SN,OPT,,345 Coventry Road,Small Heath,Birmingham,,B10 0SN,Tel: 0121 772 1442, - ,,,No ratings yet Rate it yourself - /Services/opticians/LeaveReview/DefaultView.aspx?id=5MX72__000001_B100SN,0,0,
Neil Berry Optometrists,OP_5MW_2323__000001_B721RR,OPT,Neil Berry Optometrists,6 Holland Street,,Sutton Coldfield,West Midlands,B72 1RR,Tel: 0121 355 6895, - ,,,No ratings yet Rate it yourself - /Services/opticians/LeaveReview/DefaultView.aspx?id=OP_5MW_2323__000001_B721RR,0,0,
Vision Express,OP_5MW_6348__000001_B721PA,OPT,198 Gracechurch Centre,Sutton Coldfield,,West Midlands,,B72 1PA,Tel: 0121 321 3353, - ,,,No ratings yet Rate it yourself - /Services/opticians/LeaveReview/DefaultView.aspx?id=OP_5MW_6348__000001_B721PA,0,0,
Boots-Birmingham - Sutton Coldfield,OP_5MW_9692__000005_B721PD,OPT,24 The Parade,44-46 Gracechurch Shopping Centre,,Sutton Coldfield,West Midlands,B72 1PD,Tel: 0121 354 4177, - ,,,No ratings yet Rate it yourself - /Services/opticians/LeaveReview/DefaultView.aspx?id=OP_5MW_9692__000005_B721PD,0,0,
Boots Opticians Professional Services Ltd,OP_5MW_7022__000006_B721PD,OPT,44-46 The Parade,Gracechurch Shopping Centre,,Sutton Coldfield,,B72 1PD,Tel: 0121 354 9856, - ,,,No ratings yet Rate it yourself - /Services/opticians/LeaveReview/DefaultView.aspx?id=OP_5MW_7022__000006_B721PD,0,0,
Colin Lee Opticians,5PG150,OPT,12 Fox & Goose Shopping Centre,Washwood Heath Road,Ward End,Birmingham,,B8 2EP,Tel: 0121 784 5888, - ,,,No ratings yet Rate it yourself - /Services/opticians/LeaveReview/DefaultView.aspx?id=5PG150,0,0,
Mikah Opticians,5MX096,OPT,,941 Alum Rock Road,Ward End,Birmingham,,B8 2LX,Tel: 0121 246 3777, - ,,,No ratings yet Rate it yourself - /Services/opticians/LeaveReview/DefaultView.aspx?id=5MX096,0,0,
Home Eye Clinic Ltd,C/3004__000005_B82LX,OPT,Ward End,,Birmingham,,,B8 2LX,Tel: 0121 3266624, - ,,,No ratings yet Rate it yourself - /Services/opticians/LeaveReview/DefaultView.aspx?id=C/3004__000005_B82LX,0,0,
Eurospex Opticians Ltd,OP_5MX_10352__000002_B100UF,OPT,386 Coventry Road,Small Heath,Birmingham,,,B10 0UF,Tel: 0121 773 7327, - ,,,No ratings yet Rate it yourself - /Services/opticians/LeaveReview/DefaultView.aspx?id=OP_5MX_10352__000002_B100UF,0,0,
Eyesavers ,5PG151,OPT,,467 Bordesley Green,Bordesley Green,Birmingham,,B9 5XF,Tel: 0121 771 4488, - ,,,No ratings yet Rate it yourself - /Services/opticians/LeaveReview/DefaultView.aspx?id=5PG151,0,0,