Organisation Name,NACS Code,Organisation Type,Address1,Address2,Address3,Address4,Address5,PostCode,Telephone Number,Opening time,Value  (Opening time),Banding Classification  (Opening time),NHS.UK users rating,Value  (NHS.UK users rating),Banding Classification  (NHS.UK users rating),Car parking (Is there car parking at this organisation?)
M G Wheeler,OP_5M3_12432__000001_WS34LZ,OPT,37a High Street,Pelsall,,Walsall,West Midlands,WS3 4LX,Tel: 01922 683080, - ,,,No ratings yet Rate it yourself - /Services/opticians/LeaveReview/DefaultView.aspx?id=OP_5M3_12432__000001_WS34LZ,0,0,
Kelcher & Pearson Opticians Ltd,OP_5M3_3698__000001_WS32EX,OPT,4 Queens Parade,,Walsall,,,WS3 2EX,Tel: 01922 409000, - ,,,No ratings yet Rate it yourself - /Services/opticians/LeaveReview/DefaultView.aspx?id=OP_5M3_3698__000001_WS32EX,0,0,
K B Opticians,OP_5M3_7191__000002_WS33LQ,OPT,236 High Street,Bloxwich,Walsall,,,WS3 3LQ,Tel: 01922 476553, - ,,,No ratings yet Rate it yourself - /Services/opticians/LeaveReview/DefaultView.aspx?id=OP_5M3_7191__000002_WS33LQ,0,0,
Hill the Opticians,OP_5M3_2576__000001_WS33LA,OPT,198a High Street,Bloxwich,,Walsall,,WS3 3LA,Tel: 01922 475388, - ,,,No ratings yet Rate it yourself - /Services/opticians/LeaveReview/DefaultView.aspx?id=OP_5M3_2576__000001_WS33LA,0,0,
Eyedeal,5M3-203__000002_WS33LA,OPT,212 High Street,Bloxwich,,Walsall,,WS3 3LA,Tel: 01922 473999, - ,,,No ratings yet Rate it yourself - /Services/opticians/LeaveReview/DefaultView.aspx?id=5M3-203__000002_WS33LA,0,0,
Eyeopeners ,OP_WS11PB_29575,OPT,,198c High Street,,Bloxwich,,WS3 3LA,Tel: 01922 726040, - ,,,No ratings yet Rate it yourself - /Services/opticians/LeaveReview/DefaultView.aspx?id=OP_WS11PB_29575,0,0,
Specsavers Bloxwich,TP2JT,OPT,,135 High St,Bloxwich,Walsall,,WS3 3LE,Tel: 01922 400366, - ,,,No ratings yet Rate it yourself - /Services/opticians/LeaveReview/DefaultView.aspx?id=TP2JT,0,0,
Ferguson Family Eye Care,TP9DC,OPT,,Ferguson family Eye Care,17 leamore Lane,Walsall,,WS3 2BJ,Tel: 01922278989, - ,,,3 ratings Rate it yourself - /Services/opticians/LeaveReview/DefaultView.aspx?id=TP9DC,,,
Specsavers Opticians,OP_WS86EQ_29574,OPT,,"Unit 1, 12 - 28 High Street",,Brownhills,,WS8 6EQ,Tel: 01543 363790, - ,,,No ratings yet Rate it yourself - /Services/opticians/LeaveReview/DefaultView.aspx?id=OP_WS86EQ_29574,0,0,
Boots-Brownhills,OP_5M3_6340__000001_WS86EL,OPT,42 High Street,Brownhills,,Walsall,West Midlands,WS8 6EL,Tel: 01543 372 696, - ,,,No ratings yet Rate it yourself - /Services/opticians/LeaveReview/DefaultView.aspx?id=OP_5M3_6340__000001_WS86EL,0,0,
Frames 4 U,OP_5M3_12441__000001_WS86HH,OPT,50 High Street,Brownhills,,Walsall,,WS8 6EL,Tel: 01543 373731, - ,,,1 rating Rate it yourself - /Services/opticians/LeaveReview/DefaultView.aspx?id=OP_5M3_12441__000001_WS86HH,,,
Silver Court Opticians,OP_5M3_2035__000001_WS86ED,OPT,High Street,Brownhills,,Walsall,,WS8 6HA,Tel: 01543 372504, - ,,,No ratings yet Rate it yourself - /Services/opticians/LeaveReview/DefaultView.aspx?id=OP_5M3_2035__000001_WS86ED,0,0,
KELCHER OPTOMETRISTS,OP_5MN_12465__000001_WS66DZ,OPT,88A Wardles Lane,Great Wryley,,Walsall,Staffordshire,WS6 6DY,Tel: 01922 412040, - ,,,No ratings yet Rate it yourself - /Services/opticians/LeaveReview/DefaultView.aspx?id=OP_5MN_12465__000001_WS66DZ,0,0,Data not available
Tesco T/A Tesco Opticians ,OP_WS28HX_29573,OPT,,Littleton Street West,,Walsall,,WS2 8HX,Tel: 01922 777338, - ,,,No ratings yet Rate it yourself - /Services/opticians/LeaveReview/DefaultView.aspx?id=OP_WS28HX_29573,0,0,
Scrivens Opticians & Hearing Care,OP_5M3_10824__000001_WS98PT,OPT,35 Anchor Road,45 Anchor Road,,Aldridge,,WS9 8PT,Tel: 01922 452305, - ,,,No ratings yet Rate it yourself - /Services/opticians/LeaveReview/DefaultView.aspx?id=OP_5M3_10824__000001_WS98PT,0,0,
Colin Lee Opticians,OP_5M3_7850__000002_WS98QP,OPT,7-9 Anchor Parade,Aldridge,,Walsall,,WS9 8QP,Tel: 01922 454151, - ,,,2 ratings Rate it yourself - /Services/opticians/LeaveReview/DefaultView.aspx?id=OP_5M3_7850__000002_WS98QP,,,
Portland Eye Care Ltd,OP_5M3_12436__000002_WS98LY,OPT,8 Croft Parade,Aldridge,Walsall,,,WS9 8LY,Tel: 01922 452279, - ,,,No ratings yet Rate it yourself - /Services/opticians/LeaveReview/DefaultView.aspx?id=OP_5M3_12436__000002_WS98LY,0,0,
P & J Hamer Opticians,OP_5M3_5790__000001_WS98NS,OPT,57 Portland Road,57 Portland Road,,Walsall,,WS9 8NS,Tel: 01922 455664, - ,,,1 rating Rate it yourself - /Services/opticians/LeaveReview/DefaultView.aspx?id=OP_5M3_5790__000001_WS98NS,,,
Boots-Walsall - Townsend Sq,WS2 8LP_19123,OPT,,1 Townend Street,,Walsall,West Midlands,WS2 8LP,Tel: 01922 649288, - ,,,No ratings yet Rate it yourself - /Services/opticians/LeaveReview/DefaultView.aspx?id=WS2 8LP_19123,0,0,
Davis & Samuels Ltd,OP_5M3_9291__000001_WS11DA,OPT,Darwall Street,,Walsall,,,WS1 1DA,Tel: 01922 626500, - ,,,No ratings yet Rate it yourself - /Services/opticians/LeaveReview/DefaultView.aspx?id=OP_5M3_9291__000001_WS11DA,0,0,
Boots Opticians Ltd,OP_5M3_6939__000002_WS11NP,OPT,58 Park Street,Park Place,,Walsall,,WS1 1NG,Tel: 01922 649288, - ,,,No ratings yet Rate it yourself - /Services/opticians/LeaveReview/DefaultView.aspx?id=OP_5M3_6939__000002_WS11NP,0,0,
See to it Opticians Ltd,S7T7F,OPT,,21 Ruston Road,,Burntwood,,WS7 3RU,, - ,,,No ratings yet Rate it yourself - /Services/opticians/LeaveReview/DefaultView.aspx?id=S7T7F,0,0,
Specsavers Opticians,OP_5M3_12431__000001_WS11LY,OPT,17 Park Street,,,Walsall,,WS1 1LY,Tel: 01922 633390, - ,,,No ratings yet Rate it yourself - /Services/opticians/LeaveReview/DefaultView.aspx?id=OP_5M3_12431__000001_WS11LY,0,0,
4 Sight Eyecare Centre Ltd,OP_5M3_322__000001_WS11YS,OPT,50 Park Mall,Walsall,,,,WS1 1YS,Tel: 01922 613433, - ,,,No ratings yet Rate it yourself - /Services/opticians/LeaveReview/DefaultView.aspx?id=OP_5M3_322__000001_WS11YS,0,0,
Vision Express (UK) Ltd,OP_5M3_5865__000002_WS11YT,OPT,12a/b Bradford Mall,The Sadlers Centre,,Walsall,,WS1 1YT,Tel: 01922 633533, - ,,,No ratings yet Rate it yourself - /Services/opticians/LeaveReview/DefaultView.aspx?id=OP_5M3_5865__000002_WS11YT,0,0,
Dolland & Aitchinson,5M3 - 200__000001_WS11PB,OPT,11 Bradford Street,,,Walsall,,WS1 1PB,Tel: 01922 632070, - ,,,No ratings yet Rate it yourself - /Services/opticians/LeaveReview/DefaultView.aspx?id=5M3 - 200__000001_WS11PB,0,0,
Asda Opticians,OPT_WS1 1RS,OPT,,GEORGE STREET,ST MATTHEWS,WALSALL,,WS1 1RS,Tel: 01922 704 125, - ,,,No ratings yet Rate it yourself - /Services/opticians/LeaveReview/DefaultView.aspx?id=OPT_WS1 1RS,0,0,
Moores Opticians,OP_5M3_7665__000001_WS13QD,OPT,73 Bradford Street,,Walsall,Walsall,,WS1 3QD,Tel: 01922 623469, - ,,,No ratings yet Rate it yourself - /Services/opticians/LeaveReview/DefaultView.aspx?id=OP_5M3_7665__000001_WS13QD,0,0,
Jonathan Walker & Associates,OP_5M3_12439__000001_WS13AA,OPT,74 Lysways Street,,,Walsall,,WS1 3AB,Tel: 01922 643988, - ,,,No ratings yet Rate it yourself - /Services/opticians/LeaveReview/DefaultView.aspx?id=OP_5M3_12439__000001_WS13AA,0,0,
Cannock Voyager Specsavers,L6R0Z,OPT,Sainsbury's,Voyager Drive,Orbital Retail Centre,Cannock,Staffordshire,WS11 8XP,Tel: 01543 462 232, - ,,,No ratings yet Rate it yourself - /Services/opticians/LeaveReview/DefaultView.aspx?id=L6R0Z,0,0,
Preeti Eyes,OP_5M3_12433__000001_WS13RL,OPT,19 Caldmore Green,Caldmore,,Walsall,,WS1 3RL,Tel: 01922 722815, - ,,,No ratings yet Rate it yourself - /Services/opticians/LeaveReview/DefaultView.aspx?id=OP_5M3_12433__000001_WS13RL,0,0,
Focus Eyeclinic,OP_WS14HR_29576,OPT,,1 Corporation Street,,Walsall,,WS1 4HR,Tel: 01922 278099, - ,,,No ratings yet Rate it yourself - /Services/opticians/LeaveReview/DefaultView.aspx?id=OP_WS14HR_29576,0,0,
Boots-Chase Terrace - Burntwood,OP_5DQ_14949__000002_WS78JR,OPT,Unit 14,Burntwood Town Centre,,Cannock Road,,WS7 1JR,Tel: 01543 686 498, - ,,,No ratings yet Rate it yourself - /Services/opticians/LeaveReview/DefaultView.aspx?id=OP_5DQ_14949__000002_WS78JR,0,0,
Ashmore Park Opticians,OP_5MV_371__000001_WV112JN,OPT,54 Griffiths Drive,Ashmore Park,,Wolverhampton,,WV11 2JW,Tel: 01902 739777, - ,,,4 ratings Rate it yourself - /Services/opticians/LeaveReview/DefaultView.aspx?id=OP_5MV_371__000001_WV112JN,,,
David Stidwill Optometrist,OP_5DQ_9442__000001_WS78AG,OPT,31 Rugeley Road,Chase Terrace,Burntwood,,,WS7 8AG,Tel: 01543 682730, - ,,,No ratings yet Rate it yourself - /Services/opticians/LeaveReview/DefaultView.aspx?id=OP_5DQ_9442__000001_WS78AG,0,0,
Portland Eye Care Services Ltd,5MX095,OPT,,19 New Street,Bridgtown,Cannock,,WS11 0DD,Tel: 01543 462029, - ,,,No ratings yet Rate it yourself - /Services/opticians/LeaveReview/DefaultView.aspx?id=5MX095,0,0,
Pleck Eyecare Centre,OP_5M3_6140__000001_WS29QN,OPT,252 Wednesbury Road,,,Walsall,West Midlands,WS2 9QN,Tel: 01922 616141, - ,,,1 rating Rate it yourself - /Services/opticians/LeaveReview/DefaultView.aspx?id=OP_5M3_6140__000001_WS29QN,,,yes
Bains Optical Healthcare,TP5KL,OPT,,160-162 Hednesford Road,,"Heath Hayes, Cannock",,WS12 3DZ,Tel: 01543 270080, - ,,,18 ratings Rate it yourself - /Services/opticians/LeaveReview/DefaultView.aspx?id=TP5KL,,,
Colin Lee Opticians,7790_7791__000001_WS70DW,OPT,2 Swan Island Shopping Precinct,Chase Road,Burntwood,Staffordshire,,WS7 0DW,, - ,,,No ratings yet Rate it yourself - /Services/opticians/LeaveReview/DefaultView.aspx?id=7790_7791__000001_WS70DW,0,0,
Park Hall Opticians,OP_RL170914_01-19420,OPT,Gillity Village Shops,15 Liskeard Road,Park Hall,Walsall,,WS5 3EY,Tel: 01922 614 205, - ,,,1 rating Rate it yourself - /Services/opticians/LeaveReview/DefaultView.aspx?id=OP_RL170914_01-19420,,,
Portland Opticians,OP_5MM_11876__000001_WS111BZ,OPT,17 Market Place,Cannock,Staffordshire,Staffordshire,,WS11 1BZ,Tel: 01543 503343, - ,,,No ratings yet Rate it yourself - /Services/opticians/LeaveReview/DefaultView.aspx?id=OP_5MM_11876__000001_WS111BZ,0,0,
Philip Howard Opticians,5PK/WS11 1DD__000001_WS111DD,OPT,4a Market Place,,Cannock,Staffordshire,,WS11 1DD,Tel: 01543 467277, - ,,,No ratings yet Rate it yourself - /Services/opticians/LeaveReview/DefaultView.aspx?id=5PK/WS11 1DD__000001_WS111DD,0,0,
Vision Care Direct Opticians,5M3-201__000002_WV131TG,OPT,,13 Stafford Street,,Willenhall,,WV13 1TG,Tel: 01902 609244, - ,,,No ratings yet Rate it yourself - /Services/opticians/LeaveReview/DefaultView.aspx?id=5M3-201__000002_WV131TG,0,0,
Scrivens Ltd,OP_5M3_1341__000001_WV131PU,OPT,33 Cross Street,,,Willenhall,West Midlands,WV13 1PG,Tel: 01902 605386, - ,,,No ratings yet Rate it yourself - /Services/opticians/LeaveReview/DefaultView.aspx?id=OP_5M3_1341__000001_WV131PU,0,0,
Boots-Cannock,CO-2377/5MM/C__000002_WS111BN,OPT,,69 High Green,,Cannock,Staffordshire,WS11 1BN,Tel: 01543 503 356, - ,,,No ratings yet Rate it yourself - /Services/opticians/LeaveReview/DefaultView.aspx?id=CO-2377/5MM/C__000002_WS111BN,0,0,
Puri Healthcare Ltd T/A Chase Eyecare,CO-2707/5MM/C__000003_WS111BN,OPT,75 High Green,,Cannock,Staffordshire,Staffordshire,WS11 1BN,Tel: 01543 570313, - ,,,No ratings yet Rate it yourself - /Services/opticians/LeaveReview/DefaultView.aspx?id=CO-2707/5MM/C__000003_WS111BN,0,0,yes
LAM Ltd,OP_5MM_5057__000001_WS111BN,OPT,,69 High Green,,Cannock,,WS11 1BN,Tel: 01543 503356, - ,,,No ratings yet Rate it yourself - /Services/opticians/LeaveReview/DefaultView.aspx?id=OP_5MM_5057__000001_WS111BN,0,0,
Puri Healthcare Ltd T/A Chase Eyecare,OP_5MM_7952__000001_WS125AY,OPT,75 High Green,,Cannock,Cannock,Staffordshire,WS11 1BN,Tel: 01543 570313, - ,,,No ratings yet Rate it yourself - /Services/opticians/LeaveReview/DefaultView.aspx?id=OP_5MM_7952__000001_WS125AY,0,0,yes
Supa Specs Ltd,OP_5M3_12438__000001_WV132AA,OPT,12 Market Place,Willenhall,,Wolverhampton,,WV13 2AA,Tel: 01902 630393, - ,,,No ratings yet Rate it yourself - /Services/opticians/LeaveReview/DefaultView.aspx?id=OP_5M3_12438__000001_WV132AA,0,0,
Specsavers Opticians,OP_5MM_8649__000001_WS111WS,OPT,19 Cannock Shopping Centre,Cannock,Staffordshire,,,WS11 1WS,Tel: 01543 462232, - ,,,No ratings yet Rate it yourself - /Services/opticians/LeaveReview/DefaultView.aspx?id=OP_5MM_8649__000001_WS111WS,0,0,
Gurdeep Singh Dhinsa,5MX062,OPT,,24 Beacon Road,,Walsall,,WS5 3LF,Tel: 0121 357 3477, - ,,,No ratings yet Rate it yourself - /Services/opticians/LeaveReview/DefaultView.aspx?id=5MX062,0,0,
Portland Eye Care Services Ltd,OP_5MV_ 795__000001_WV111TW,OPT,45 Lichfield Road,Wednesfield,,Wolverhampton,,WV11 1TW,Tel: 01902 723898, - ,,,No ratings yet Rate it yourself - /Services/opticians/LeaveReview/DefaultView.aspx?id=OP_5MV_ 795__000001_WV111TW,0,0,
Optical and Hearing Centre,5PK/6400__000001_WV107AU,OPT,Surgery House,2 South Crescent,Featherstone,,,WV10 7AU,Tel: 01902 306925, - ,,,No ratings yet Rate it yourself - /Services/opticians/LeaveReview/DefaultView.aspx?id=5PK/6400__000001_WV107AU,0,0,
T/A Watts & Attewell,OP_5M3_5594__000002_WS108DE,OPT,59 King Street,Darlaston,Wednesbury,,,WS10 8DE,Tel: 0121 526 6396, - ,,,No ratings yet Rate it yourself - /Services/opticians/LeaveReview/DefaultView.aspx?id=OP_5M3_5594__000002_WS108DE,0,0,
C M Biddle & Co Ltd,OP_5MV_3311__000004_WV111SZ,OPT,20 High Street,Wednesfield,,Wolverhampton,,WV11 1SZ,Tel: 01902 729028, - ,,,No ratings yet Rate it yourself - /Services/opticians/LeaveReview/DefaultView.aspx?id=OP_5MV_3311__000004_WV111SZ,0,0,
Flint & Partners,OP_5MV_2445__000001_WV111SR,OPT,11 Church Street,Wednesfield,,Wolverhampton,,WV11 1SR,Tel: 01902 719 850, - ,,,2 ratings Rate it yourself - /Services/opticians/LeaveReview/DefaultView.aspx?id=OP_5MV_2445__000001_WV111SR,,,
Heather Bailey,OP_5MM_8119__000003_WS125AG,OPT,T/a Boots Optician,88 Market Street,,Cannock,,WS12 5AG,Tel: 01543 422113, - ,,,No ratings yet Rate it yourself - /Services/opticians/LeaveReview/DefaultView.aspx?id=OP_5MM_8119__000003_WS125AG,0,0,
Boots Opticians,OP_5DQ_14950__000004_WS125AG,OPT,88 Market Street,Hednesford,,Staffordshire,,WS12 1AG,Tel: 01543 422113, - ,,,No ratings yet Rate it yourself - /Services/opticians/LeaveReview/DefaultView.aspx?id=OP_5DQ_14950__000004_WS125AG,0,0,
Overton Eyecare,OP_5MV_9203__000001_WV108PN,OPT,743-745 Cannock Road,The Scotlands,,Wolverhampton,,WV10 8PN,Tel: 01902 731158, - ,,,1 rating Rate it yourself - /Services/opticians/LeaveReview/DefaultView.aspx?id=OP_5MV_9203__000001_WV108PN,,,
R G Amarnani,OP_5MJ_691__000001_WS107HJ,OPT,45 Upper High Street,,Wednesbury,,,WS10 7HJ,Tel: 0121 556 4430, - ,,,No ratings yet Rate it yourself - /Services/opticians/LeaveReview/DefaultView.aspx?id=OP_5MJ_691__000001_WS107HJ,0,0,
Direct Vision Opticians,TP8Y2,OPT,Direct Vision Opticians,122 Hillingford Avenue,Great Barr,Birmingham,West Midlands,B43 7JU,Tel: 0121 325 0665, - ,,,No ratings yet Rate it yourself - /Services/opticians/LeaveReview/DefaultView.aspx?id=TP8Y2,0,0,yes
Chapmans Opticians,OP_5MJ_6469__000001_WS107HB,OPT,61 Union Street,,Wednesbury,,,WS10 7HB,Tel: 0121 556 5564, - ,,,No ratings yet Rate it yourself - /Services/opticians/LeaveReview/DefaultView.aspx?id=OP_5MJ_6469__000001_WS107HB,0,0,
Robbins Opticians,OP_5MJ_7699__000002_WS107HD,OPT,49 Union Street,,Wednesbury,,,WS10 7HB,Tel: 0121 556 0379, - ,,,No ratings yet Rate it yourself - /Services/opticians/LeaveReview/DefaultView.aspx?id=OP_5MJ_7699__000002_WS107HD,0,0,
4 Sight Eye Care Centres Ltd,OP_5MV_886__000002_WV109QY,OPT,1 Raynor Road,Fallings Park,,Wolverhampton,,WV10 9QY,Tel: 01902 723449, - ,,,No ratings yet Rate it yourself - /Services/opticians/LeaveReview/DefaultView.aspx?id=OP_5MV_886__000002_WV109QY,0,0,
Eyes & Vision,OP_5MJ_13674__000002_B713HP,OPT,136 Walsall Road,,West Bromwich,,,B71 3HP,Tel: 0121 588 8484, - ,,,No ratings yet Rate it yourself - /Services/opticians/LeaveReview/DefaultView.aspx?id=OP_5MJ_13674__000002_B713HP,0,0,
Attewell and Hardwick Eyecare,OP_5MJ_3174__000001_B713HN,OPT,,96 Walsall Road,,West Bromwich,,B71 3HN,Tel: 0121 588 6163, - ,,,3 ratings Rate it yourself - /Services/opticians/LeaveReview/DefaultView.aspx?id=OP_5MJ_3174__000001_B713HN,,,
Miracle Eyes,OP_WV109BA_29921,OPT,,5 Showell Circus,,Wolverhampton,,WV10 9BA,, - ,,,No ratings yet Rate it yourself - /Services/opticians/LeaveReview/DefaultView.aspx?id=OP_WV109BA_29921,0,0,
Colin Lee (Opticians) Ltd,OP_5MJ_9813__000002_B421TQ,OPT,Scott Arms Shopping Centre,964 Walsall Road,Great Barr,,,B42 1TQ,Tel: 0121 357 7890, - ,,,No ratings yet Rate it yourself - /Services/opticians/LeaveReview/DefaultView.aspx?id=OP_5MJ_9813__000002_B421TQ,0,0,
Focus Eye Clinic,OP_WV100QB_34100,OPT,Unit 6 Crossways Shopping Centre,Wolverhampton Road,Heath Town,Wolverhampton,West Midlands,WV10 0QB,Tel: 01902 546820, - ,,,No ratings yet Rate it yourself - /Services/opticians/LeaveReview/DefaultView.aspx?id=OP_WV100QB_34100,0,0,
Eye Express,5MX016,OPT,909 Walsall Road,Great Barr,,Birmingham,,B42 1TN,Tel: 0121 357 6465, - ,,,No ratings yet Rate it yourself - /Services/opticians/LeaveReview/DefaultView.aspx?id=5MX016,0,0,
Bushbury Eyecare,,OPT,,339a Bushbury Lane,,Wolverhampton,,WV10 9UL,, - ,,,N/A - Data not available,,,
Eye Openers,OP_WV140AX_29781,OPT,,63 Church Street,,Bilston,,WV14 0AX,Tel: 01902 492020, - ,,,No ratings yet Rate it yourself - /Services/opticians/LeaveReview/DefaultView.aspx?id=OP_WV140AX_29781,0,0,
Jacksons Opticians,OP_WV140AX_29782,OPT,,"53a Church Street,",,Bilston,,WV14 0AX,Tel: 01902 491358, - ,,,No ratings yet Rate it yourself - /Services/opticians/LeaveReview/DefaultView.aspx?id=OP_WV140AX_29782,0,0,
Specsavers Opticians,OP_WV140AX_29785,OPT,,84 Church Street,,Bilston,,WV14 0AX,Tel: 01902 407940, - ,,,No ratings yet Rate it yourself - /Services/opticians/LeaveReview/DefaultView.aspx?id=OP_WV140AX_29785,0,0,
Scrivens Ltd,OP_WV140DR_29783,OPT,,9 Market Way,,Bilston,,WV14 0DR,Tel: 01902 496471, - ,,,No ratings yet Rate it yourself - /Services/opticians/LeaveReview/DefaultView.aspx?id=OP_WV140DR_29783,0,0,
VisionCare Direct Opticians,OP_WV140DZ_29770,OPT,,W M Morrison Supermarkets PLC,Black Country Route,"Bilston, Wolverhampton",West Midlands,WV14 0DZ,Tel: 01902 493322, - ,,,1 rating Rate it yourself - /Services/opticians/LeaveReview/DefaultView.aspx?id=OP_WV140DZ_29770,,,yes
Vernon Walker Opticians Ltd,5MX109__000005_B449HH,OPT,,unit 21,The Kingstanding Centre,Birmingham,,B44 9HH,Tel: 0121 354 2992, - ,,,No ratings yet Rate it yourself - /Services/opticians/LeaveReview/DefaultView.aspx?id=5MX109__000005_B449HH,0,0,
The Spectacle Company,5MX106__000002_B449ST,OPT,766 Kingstanding Road,Kingstanding,Birmingham,,,B44 9ST,Tel: 0121 355 5639, - ,,,3 ratings Rate it yourself - /Services/opticians/LeaveReview/DefaultView.aspx?id=5MX106__000002_B449ST,,,
Hill Top Opticians,5MX056,OPT,,Hill Top Opticians,106 Hill Top,West Bromwich,West Midlands,B70 0SH,Tel: 0121 556 3700, - ,,,No ratings yet Rate it yourself - /Services/opticians/LeaveReview/DefaultView.aspx?id=5MX056,0,0,
Scrivens Ltd,5MX108__000004_B449HH,OPT,,635 Kingstanding Road,Kingstanding,Birmingham,West Midlands,B44 9SU,Tel: 0121 354 2100, - ,,,No ratings yet Rate it yourself - /Services/opticians/LeaveReview/DefaultView.aspx?id=5MX108__000004_B449HH,0,0,
Malcom Gray & Associates,5PG122,OPT,,336 Lichfield Road,,Sutton Coldfield,,B74 4BH,Tel: 0121 308 4255, - ,,,No ratings yet Rate it yourself - /Services/opticians/LeaveReview/DefaultView.aspx?id=5PG122,0,0,
Scrivens Ltd,OP_5MV_585__000001_WV106BA,OPT,5 Three Tuns Parade,Stafford Road,,Fordhouses,West Midlands,WV10 6BA,Tel: 01902 782280, - ,,,No ratings yet Rate it yourself - /Services/opticians/LeaveReview/DefaultView.aspx?id=OP_5MV_585__000001_WV106BA,0,0,
Miracle Eyes Ltd,OP_5MV_853__000001_WV106RT,OPT,Unit 4 Marsh Lane Parade,"Three Tuns, Fordhouses",,Wolverhampton,,WV10 6RT,Tel: 01902 789900, - ,,,No ratings yet Rate it yourself - /Services/opticians/LeaveReview/DefaultView.aspx?id=OP_5MV_853__000001_WV106RT,0,0,
Boots Opticians,TP87W,OPT,,Unit 4 Mulberry Walk,,Sutton Coldfield,,B74 2UG,, - ,,,No ratings yet Rate it yourself - /Services/opticians/LeaveReview/DefaultView.aspx?id=TP87W,0,0,
Andrew Martin & Associates,5MW27__000001_B742UD,OPT,244 Lichfield Road,,Sutton Coldfield,West Midlands,,B74 2UD,Tel: 0121 308 1886, - ,,,No ratings yet Rate it yourself - /Services/opticians/LeaveReview/DefaultView.aspx?id=5MW27__000001_B742UD,0,0,
"I M HADFIELD BSc, FCOptom, OPTOMETRISTS",5MX107__000002_B422HN,OPT,,162 Beecehes Road,Birmingham,Birmingham,,B42 2HN,Tel: 0121 357 1748, - ,,,1 rating Rate it yourself - /Services/opticians/LeaveReview/DefaultView.aspx?id=5MX107__000002_B422HN,,,
D G Arthur & Partner,OP_5DQ_14953__000001_WS136JX,OPT,9 Market Street,Lichfield,Staffordshire,,,WS13 6JX,Tel: 01543 251130, - ,,,No ratings yet Rate it yourself - /Services/opticians/LeaveReview/DefaultView.aspx?id=OP_5DQ_14953__000001_WS136JX,0,0,
Colin Lee Opticians (Lichfield),OP_5DQ_14951__000002_WS136LA,OPT,33 Market Street,Lichfield,Staffordshire,,,WS13 6LA,Tel: 01543 254645, - ,,,No ratings yet Rate it yourself - /Services/opticians/LeaveReview/DefaultView.aspx?id=OP_5DQ_14951__000002_WS136LA,0,0,
Specsavers Opticians,OP_5DQ_357__000001_WS136LA,OPT,Specsavers Opticians,41-43 Market Street,,Lichfield,Staffordshire,WS13 6LA,Tel: 01543 417517, - ,,,No ratings yet Rate it yourself - /Services/opticians/LeaveReview/DefaultView.aspx?id=OP_5DQ_357__000001_WS136LA,0,0,
Scrivens Ltd,OP_5MJ_5454__000001_B421NN,OPT,1-2 International House,Old Walsall Road,,Hamstead,West Midlands,B42 1NN,Tel: 0121 357 3182, - ,,,No ratings yet Rate it yourself - /Services/opticians/LeaveReview/DefaultView.aspx?id=OP_5MJ_5454__000001_B421NN,0,0,
Hamstead Eyecare,01-19254-201213,OPT,4 International House,Old Walsall Road,Great Barr,Birmingham,,B42 1NN,Tel: 0121 679 4493, - ,,,2 ratings Rate it yourself - /Services/opticians/LeaveReview/DefaultView.aspx?id=01-19254-201213,,,
Vision Express (UK) Ltd,OP_5DQ_4932__000001_WS136NN,OPT,"Unit 35, Bakers Lane",Three Spires Shopping Centre,12 Gresley Row,Lichfield,Staffordshire,WS13 6NN,Tel: 01543 417272, - ,,,No ratings yet Rate it yourself - /Services/opticians/LeaveReview/DefaultView.aspx?id=OP_5DQ_4932__000001_WS136NN,0,0,
Boots-Lichfield,OP_5DQ_332__000001_WS136NF,OPT,2 Bakers Lane,,,Lichfield,Staffordshire,WS13 6NF,Tel: 01543 252086, - ,,,No ratings yet Rate it yourself - /Services/opticians/LeaveReview/DefaultView.aspx?id=OP_5DQ_332__000001_WS136NF,0,0,
R K Flatters,OP_5MV_1492__000001_WV13JW,OPT,35 Queen Street,,,Wolverhampton,,WV1 3JW,Tel: 01902 423359, - ,,,No ratings yet Rate it yourself - /Services/opticians/LeaveReview/DefaultView.aspx?id=OP_5MV_1492__000001_WV13JW,0,0,
Eye Deal Opticians,OP_5MH_8755__000001_DY49JA,OPT,Glebefields Health Centre,St Marks Road,,Tipton,West Midlands,DY4 0UB,Tel: 0121 557 1465, - ,,,No ratings yet Rate it yourself - /Services/opticians/LeaveReview/DefaultView.aspx?id=OP_5MH_8755__000001_DY49JA,0,0,
R J Owen Opticians,5MW29__000001_B440QU,OPT,10 Warren Farm Road,Kingstanding,Birmingham,,,B44 0QU,Tel: 0121 373 5790, - ,,,No ratings yet Rate it yourself - /Services/opticians/LeaveReview/DefaultView.aspx?id=5MW29__000001_B440QU,0,0,
Lichfield Street Opticians,OP_5MV_793__000003_WV11DG,OPT,44 Lichfield Street,,Wolverhampton,West Midlands,,WV1 1DG,Tel: 01902 420348, - ,,,No ratings yet Rate it yourself - /Services/opticians/LeaveReview/DefaultView.aspx?id=OP_5MV_793__000003_WV11DG,0,0,
Scrivens Ltd,OP_5MV_3780__000001_WV13NP,OPT,16 Dudley St,,,Wolverhampton,,WV1 3EY,Tel: 01902 424775, - ,,,No ratings yet Rate it yourself - /Services/opticians/LeaveReview/DefaultView.aspx?id=OP_5MV_3780__000001_WV13NP,0,0,
Scrivens Ltd,OP_5MW_10748__000001_B448PL,OPT,231 Hawthorn Road,Kingstanding,,Birmingham,West Midlands,B44 8PL,Tel: 0121 373 1447, - ,,,No ratings yet Rate it yourself - /Services/opticians/LeaveReview/DefaultView.aspx?id=OP_5MW_10748__000001_B448PL,0,0,
Ados Sightcare Ltd,01-17616/5PK/C__000001_B448JG,OPT,1 Ridgewood Gardens,Great Barr,Birmingham,,,B44 8JG,Tel: 0121 384 2771, - ,,,No ratings yet Rate it yourself - /Services/opticians/LeaveReview/DefaultView.aspx?id=01-17616/5PK/C__000001_B448JG,0,0,