Organisation Name,NACS Code,Organisation Type,Address1,Address2,Address3,Address4,Address5,PostCode,Telephone Number,Opening time,Value  (Opening time),Banding Classification  (Opening time),NHS.UK users rating,Value  (NHS.UK users rating),Banding Classification  (NHS.UK users rating),Car parking (Is there car parking at this organisation?)
Nethercott Opticians,OP_5KP_4172__000002_KT205AD,OPT,18 Station Approach,,Tadworth,Surrey,,KT20 5AD,Tel: 01737 813 600, - ,,,No ratings yet Rate it yourself - /Services/opticians/LeaveReview/DefaultView.aspx?id=OP_5KP_4172__000002_KT205AD,0,0,
Specsavers Opticians,RH2 9AE__000001_RH29AE,OPT,39 High Street,,Reigate,Surrey,,RH2 9AE,Tel: 01737 227920, - ,,,1 rating Rate it yourself - /Services/opticians/LeaveReview/DefaultView.aspx?id=RH2 9AE__000001_RH29AE,,,
Bateman Opticians,OP_5KQ_9375__000001_RH27AD,OPT,,7 Bell Street,,Reigate,Surrey,RH2 7AD,Tel: 01737 242 789, - ,,,No ratings yet Rate it yourself - /Services/opticians/LeaveReview/DefaultView.aspx?id=OP_5KQ_9375__000001_RH27AD,0,0,
Whiteman Opticians,OP_5KQ_12938__000001_RH20AD,OPT,,20 Church Street,,Reigate,Surrey,RH2 0AN,Tel: 01737 223 202, - ,,,No ratings yet Rate it yourself - /Services/opticians/LeaveReview/DefaultView.aspx?id=OP_5KQ_12938__000001_RH20AD,0,0,
i-Contact,OP_5KQ_9977__000001_RH20AN,OPT,20 Church Street,,Reigate,,,RH2 0AN,Tel: 01737 242 754, - ,,,No ratings yet Rate it yourself - /Services/opticians/LeaveReview/DefaultView.aspx?id=OP_5KQ_9977__000001_RH20AN,0,0,
Boots-Reigate,OP_5KQ_10061__000002_RH20AD,OPT,25 Church Street,,,Reigate,Surrey,RH2 0AD,Tel: 01737 243 577, - ,,,No ratings yet Rate it yourself - /Services/opticians/LeaveReview/DefaultView.aspx?id=OP_5KQ_10061__000002_RH20AD,0,0,
The Reigate Optical Rooms,TP9DV,OPT,,3 Pool House,,Reigate,Surrey,RH2 7RP,Tel: 01737 304090, - ,,,No ratings yet Rate it yourself - /Services/opticians/LeaveReview/DefaultView.aspx?id=TP9DV,0,0,
Batemans (Opticians) Ltd,OP_5KP_11827__000001_RH41BA,OPT,,114 High Street,,Dorking,Surrey,RH4 1BA,Tel: 01306 882 787, - ,,,No ratings yet Rate it yourself - /Services/opticians/LeaveReview/DefaultView.aspx?id=OP_5KP_11827__000001_RH41BA,0,0,
Specsavers Opticians,OP_5KP_14662__000002_RH41BA,OPT,Specsavers,110 High Street,,Dorking,Surrey,RH4 1BA,Tel: 01306 745 350, - ,,,No ratings yet Rate it yourself - /Services/opticians/LeaveReview/DefaultView.aspx?id=OP_5KP_14662__000002_RH41BA,0,0,
Boots-Dorking,OP_5KP_10554__000003_RH41AW,OPT,83 High Street,,,Dorking,Surrey,RH4 1AW,Tel: 01306 882 176, - ,,,1 rating Rate it yourself - /Services/opticians/LeaveReview/DefaultView.aspx?id=OP_5KP_10554__000003_RH41AW,,,
EMSLIE OPTICIANS,OP_5KP_14528__000001_RH41AY,OPT,62 High Street,,Dorking,Dorking,,RH4 1AY,Tel: 01306 875 201, - ,,,No ratings yet Rate it yourself - /Services/opticians/LeaveReview/DefaultView.aspx?id=OP_5KP_14528__000001_RH41AY,0,0,
Specsavers Opticians,OPT_KT228AH_1,OPT,,12 The Swan Centre,,Leatherhead,Surrey,KT22 8AH,Tel: 01372 227740, - ,,,No ratings yet Rate it yourself - /Services/opticians/LeaveReview/DefaultView.aspx?id=OPT_KT228AH_1,0,0,
Ashtead Eye Clinic,OP_5KP_12937__000001_KT211AA,OPT,31-33 The Street,,Ashtead,,,KT21 1AA,Tel: 01372 274 348, - ,,,No ratings yet Rate it yourself - /Services/opticians/LeaveReview/DefaultView.aspx?id=OP_5KP_12937__000001_KT211AA,0,0,
Eyeworks,OP_5KQ_3954__000001_RH11QH,OPT,66 Station Road,,Redhill,,,RH1 1PL,Tel: 01737 778 877, - ,,,No ratings yet Rate it yourself - /Services/opticians/LeaveReview/DefaultView.aspx?id=OP_5KQ_3954__000001_RH11QH,0,0,
Vision Express (UK) LTD,OP_5KQ_12939__000001_RH11SE,OPT,46 The Belfry,Station Road,,Redhill,Surrey,RH1 1SE,Tel: 01737 768862, - ,,,1 rating Rate it yourself - /Services/opticians/LeaveReview/DefaultView.aspx?id=OP_5KQ_12939__000001_RH11SE,,,
Specsavers Opticians,OP_5KQ_514__000002_RH11QH,OPT,1 - 2 Central Parade,London Road,,Redhill,,RH1 1LY,Tel: 01737 772990, - ,,,No ratings yet Rate it yourself - /Services/opticians/LeaveReview/DefaultView.aspx?id=OP_5KQ_514__000002_RH11QH,0,0,
Redhill Eye Studio,OP_5KQ_14661__000001_RH11SA,OPT,Redhill Opticians,51 High Street,,Redhill,Surrey,RH1 1RX,Tel: 01737 789 924, - ,,,No ratings yet Rate it yourself - /Services/opticians/LeaveReview/DefaultView.aspx?id=OP_5KQ_14661__000001_RH11SA,0,0,
Boots-Redhill - High St,RH1 1RH__000002_RH11RH,OPT,24 High Street,,,Redhill,Surrey,RH1 1RH,Tel: 01737 765 600, - ,,,No ratings yet Rate it yourself - /Services/opticians/LeaveReview/DefaultView.aspx?id=RH1 1RH__000002_RH11RH,0,0,
Boots-Redhill - High St,OP_5KQ_1510__000001_RH11RH,OPT,12 High Street,,,Redhill,Surrey,RH1 1RH,Tel: 01737 763148, - ,,,No ratings yet Rate it yourself - /Services/opticians/LeaveReview/DefaultView.aspx?id=OP_5KQ_1510__000001_RH11RH,0,0,
Vision Express (UK) Ltd,OP_5KP_12653__000002_KT185DB,OPT,,16 Ashley Centre,,Epsom,Surrey,KT18 5DB,Tel: 01372 747 422, - ,,,No ratings yet Rate it yourself - /Services/opticians/LeaveReview/DefaultView.aspx?id=OP_5KP_12653__000002_KT185DB,0,0,
Boots-Epsom - Ashley Centre (in Boots UK),KT18 5DB__000003_KT185DB,OPT,57 Ashley Centre,,,Epsom,Surrey,KT18 5DB,Tel: 01372 747605, - ,,,7 ratings Rate it yourself - /Services/opticians/LeaveReview/DefaultView.aspx?id=KT18 5DB__000003_KT185DB,,,
Donner Optometrists,,OPT,,9 Church Rd,,Great Bookham Leatherhead,,KT23 3PD,Tel: 01372 458318, - ,,,N/A - Data not available,,,
Eye-Care@Banstead Village,OP_5KP_9863__000001_SM72LJ,OPT,,20 High Street,,Banstead,Surrey,SM7 2LJ,Tel: 01737 353 225, - ,,,1 rating Rate it yourself - /Services/opticians/LeaveReview/DefaultView.aspx?id=OP_5KP_9863__000001_SM72LJ,,,
Leightons Opticians & Hearing Care,OP_5KP_3838__000001_KT198EH,OPT,88 High Street,,Epsom,Surrey,,KT19 8BJ,Tel: 01372 722 656, - ,,,No ratings yet Rate it yourself - /Services/opticians/LeaveReview/DefaultView.aspx?id=OP_5KP_3838__000001_KT198EH,0,0,
Specsavers Opticians,OP_5KP_8008__000001_KT198AH,OPT,,24 High Street,,Epsom,Surrey,KT19 8AH,Tel: 01372 744 250, - ,,,No ratings yet Rate it yourself - /Services/opticians/LeaveReview/DefaultView.aspx?id=OP_5KP_8008__000001_KT198AH,0,0,
DOLLOND & AITCHISON,SM7 2NL__000003_SM72NL,OPT,103 High Street,,Banstead,Surrey,,SM7 2NL,Tel: 01737 362948, - ,,,No ratings yet Rate it yourself - /Services/opticians/LeaveReview/DefaultView.aspx?id=SM7 2NL__000003_SM72NL,0,0,
Boots Opticians,OPT_SM72NL_1,OPT,,103 High Street,,Banstead,,SM7 2NL,, - ,,,No ratings yet Rate it yourself - /Services/opticians/LeaveReview/DefaultView.aspx?id=OPT_SM72NL_1,0,0,
Boots-Banstead - High St ,OP_5KP_12811__000002_SM72NL,OPT,85-87 High Street,,Banstead,Banstead,Surrey,SM7 2NL,Tel: 01737 362948, - ,,,No ratings yet Rate it yourself - /Services/opticians/LeaveReview/DefaultView.aspx?id=OP_5KP_12811__000002_SM72NL,0,0,
Specsavers Opticians,OPT_SM72NL_2,OPT,,105 High Street,,Banstead,Surrey,SM7 2NL,Tel: 01737 858940, - ,,,No ratings yet Rate it yourself - /Services/opticians/LeaveReview/DefaultView.aspx?id=OPT_SM72NL_2,0,0,
M S Kalsi Opticians,TP856,OPT,,75 High Street,,Banstead,Surrey,SM7 2NL,Tel: 01737 362011, - ,,,No ratings yet Rate it yourself - /Services/opticians/LeaveReview/DefaultView.aspx?id=TP856,0,0,
SeeAbility Ltd,CO-4941,OPT,,Newplan House,,Surrey,,KT17 1BL,, - ,,,No ratings yet Rate it yourself - /Services/opticians/LeaveReview/DefaultView.aspx?id=CO-4941,0,0,
Banstead Opticians,OPT_SM72NT_1,OPT,,157 High Street,,Banstead,,SM7 2NT,, - ,,,No ratings yet Rate it yourself - /Services/opticians/LeaveReview/DefaultView.aspx?id=OPT_SM72NT_1,0,0,
Specsavers Opticians,TP9GG,OPT,,Sainsburys,Kiln Lane,Epsom,Surrey,KT17 1EQ,Tel: 01372 677928, - ,,,No ratings yet Rate it yourself - /Services/opticians/LeaveReview/DefaultView.aspx?id=TP9GG,0,0,
Bayfields Opticians & Audiologists,X3N3Z,OPT,68 High Street,,Ewell,Surrey,,KT17 1RL,Tel: 020 8393 7711, - ,,,No ratings yet Rate it yourself - /Services/opticians/LeaveReview/DefaultView.aspx?id=X3N3Z,0,0,
Gordon Turner Optometrists,OP_5M7_0000__000001_SM38SG,OPT,,71 Station Way,Cheam,Surrey,,SM3 8SG,Tel: 020 8642 0563, - ,,,1 rating Rate it yourself - /Services/opticians/LeaveReview/DefaultView.aspx?id=OP_5M7_0000__000001_SM38SG,,,no
Coulsdon Opticians,OP_5K9_7089__000001_CR52NJ,OPT,141 Brighton Road,,Coulsdon,,,CR5 2NJ,Tel: 020 8660 7343, - ,,,No ratings yet Rate it yourself - /Services/opticians/LeaveReview/DefaultView.aspx?id=OP_5K9_7089__000001_CR52NJ,0,0,
Optics Direct,OP_5M7_14655__000001_SM38BU,OPT,,18 Ewell Road,,Cheam,,SM3 8BU,Tel: 0208 642 2193, - ,,,No ratings yet Rate it yourself - /Services/opticians/LeaveReview/DefaultView.aspx?id=OP_5M7_14655__000001_SM38BU,0,0,
Eye Matrix Ltd,10007__000001_CR51HE,OPT,DOMICILIARY SERVICE ONLY,,,Old Coulsdon,Surrey,CR5 1HE,Tel: 0800 612 3144, - ,,,No ratings yet Rate it yourself - /Services/opticians/LeaveReview/DefaultView.aspx?id=10007__000001_CR51HE,0,0,
TESCO OPTICIANS,RH6 0AT__000001_RH60AT,OPT,Reigate Road,Hookwood,,Horley,Surrey,RH6 0AT,Tel: 01293 894 638, - ,,,No ratings yet Rate it yourself - /Services/opticians/LeaveReview/DefaultView.aspx?id=RH6 0AT__000001_RH60AT,0,0,
Leightons Opticians & Hearing Care,110520171021,OPT,,10 High Street,,Sutton,Surrey,SM1 1HN,Tel: 020 8642 2798, - ,,,No ratings yet Rate it yourself - /Services/opticians/LeaveReview/DefaultView.aspx?id=110520171021,0,0,
The Optical Gallery (Chessington),OP_5A5_5843__000001_KT91NU,OPT,340 Hook Road,Chessington,,Surrey,,KT9 1NU,Tel: 0208 391 0900, - ,,,No ratings yet Rate it yourself - /Services/opticians/LeaveReview/DefaultView.aspx?id=OP_5A5_5843__000001_KT91NU,0,0,
Boots-Horley,OP_5KQ_5319__000002_RH67AY,OPT,,18/20 High Street,,Horley,Surrey,RH6 7AY,Tel: 01293 782 668, - ,,,1 rating Rate it yourself - /Services/opticians/LeaveReview/DefaultView.aspx?id=OP_5KQ_5319__000002_RH67AY,,,
Specsavers Opticians,TP8G1,OPT,,71 Victoria Road,,Horley,Surrey,RH6 7QH,Tel: 01293 783018, - ,,,No ratings yet Rate it yourself - /Services/opticians/LeaveReview/DefaultView.aspx?id=TP8G1,0,0,
Specsavers Opticians,OP_5M7_9564__000001_SM11EZ,OPT,76 High Street,Sutton,,Surrey,,SM1 1EZ,Tel: 0208 643 3434, - ,,,5 ratings Rate it yourself - /Services/opticians/LeaveReview/DefaultView.aspx?id=OP_5M7_9564__000001_SM11EZ,,,
Boots-Sutton - High St,SM1 1JG_11122,OPT,109-111 High Street,,,Sutton,Surrey,SM1 1JG,Tel: 0208 661 9488, - ,,,5 ratings Rate it yourself - /Services/opticians/LeaveReview/DefaultView.aspx?id=SM1 1JG_11122,,,
Vision Express,OP_5M7_10667__000001_SM11JH,OPT,,145 High Street,,Sutton,Surrey,SM1 1JH,Tel: 0208 661 0303, - ,,,No ratings yet Rate it yourself - /Services/opticians/LeaveReview/DefaultView.aspx?id=OP_5M7_10667__000001_SM11JH,0,0,
Anthony Opticians,OPT_SM38HW_1,OPT,,526 London Road,,Cheam,Surrey,SM3 8HW,Tel: 020 8644 9915, - ,,,No ratings yet Rate it yourself - /Services/opticians/LeaveReview/DefaultView.aspx?id=OPT_SM38HW_1,0,0,
Leightons Opticians & Hearing Care,OP_5KP_3130__000001_KT112LR,OPT,,Unit 5,1-7 Holly Parade,Cobham,Surrey,KT11 3EB,Tel: 01932 867 890, - ,,,No ratings yet Rate it yourself - /Services/opticians/LeaveReview/DefaultView.aspx?id=OP_5KP_3130__000001_KT112LR,0,0,
The Optical Co. ,TP9G6,OPT,,3 High Street,,Cobham,Surrey,KT11 3DH,Tel: 01932 867565, - ,,,No ratings yet Rate it yourself - /Services/opticians/LeaveReview/DefaultView.aspx?id=TP9G6,0,0,
SECOND SIGHT,SM1 2QN__000002_SM12QN,OPT,,,,.,Surrey,SM1 2QN,Tel: 0208 642 2798, - ,,,No ratings yet Rate it yourself - /Services/opticians/LeaveReview/DefaultView.aspx?id=SM1 2QN__000002_SM12QN,0,0,
David Clulow Opticians,KT11 2LR__000002_KT112LR,OPT,21 Oakdene Parade,,Cobham,Surrey,,KT11 2LR,Tel: 01932 590415, - ,,,No ratings yet Rate it yourself - /Services/opticians/LeaveReview/DefaultView.aspx?id=KT11 2LR__000002_KT112LR,0,0,
JOHN ROSE EYE CARE,KT11 1BQ__000001_KT111BQ,OPT,,1 Eden Street,,Kingston,Surrey,KT11 1BQ,Tel: 0208 546 9292, - ,,,1 rating Rate it yourself - /Services/opticians/LeaveReview/DefaultView.aspx?id=KT11 1BQ__000001_KT111BQ,,,
A M S OPTICIANS,KT4 8HY__000001_KT48HY,OPT,,56 -58 Central Road,,Worcester Park,Surrey,KT4 8HY,Tel: 0208 330 5364, - ,,,5 ratings Rate it yourself - /Services/opticians/LeaveReview/DefaultView.aspx?id=KT4 8HY__000001_KT48HY,,,
 Specsavers Opticians ,TP8F2_KT4 8DY ,OPT,,103 Central Road,,Worcester Park ,,KT4 8DY,, - ,,,No ratings yet Rate it yourself - /Services/opticians/LeaveReview/DefaultView.aspx?id=TP8F2_KT4 8DY,0,0,
Boots-Worcester Park,KT4 8HT_19973,OPT,,118 Central Road,,Worcester Park,Surrey,KT4 8HT,Tel: 0208 330 7586, - ,,,No ratings yet Rate it yourself - /Services/opticians/LeaveReview/DefaultView.aspx?id=KT4 8HT_19973,0,0,
R Woodfall Opticians,KT4 8DT__000001_KT48DT,OPT,,159 Central Road,,Worcester Park,Surrey,KT4 8DT,Tel: 0208 337 2059, - ,,,No ratings yet Rate it yourself - /Services/opticians/LeaveReview/DefaultView.aspx?id=KT4 8DT__000001_KT48DT,0,0,
Boots Opticians (Caterham),OPT_CR36LB_1,OPT,,15-17 Station Avenue,,Caterham,Surrey,CR3 6LB,Tel: 01883 337645, - ,,,2 ratings Rate it yourself - /Services/opticians/LeaveReview/DefaultView.aspx?id=OPT_CR36LB_1,,,
Boots-Caterham,CR3 6LB_18273,OPT,,15-17 Station Avenue,,Caterham,Surrey,CR3 6LB,Tel: 01883 337645, - ,,,No ratings yet Rate it yourself - /Services/opticians/LeaveReview/DefaultView.aspx?id=CR3 6LB_18273,0,0,
Rawling & Sons (Opticians) Ltd,OP_5KQ_12732__000001_CR36QB,OPT,2-4 Croydon Road,,,Caterham,Surrey,CR3 6QB,Tel: 01883 343370, - ,,,No ratings yet Rate it yourself - /Services/opticians/LeaveReview/DefaultView.aspx?id=OP_5KQ_12732__000001_CR36QB,0,0,
Specsavers Opticians,00000831__000003_CR36RT,OPT,,10 Church Walk Shopping Centre,,Caterham,Surrey,CR3 6RT,Tel: 01883 333 830, - ,,,No ratings yet Rate it yourself - /Services/opticians/LeaveReview/DefaultView.aspx?id=00000831__000003_CR36RT,0,0,
Anthony Opticians,OP_5A5_7931__000001_KT67HR,OPT,84 The Broadway,Tolworth,,Surrey,,KT6 7HR,Tel: 0208 390 5219, - ,,,No ratings yet Rate it yourself - /Services/opticians/LeaveReview/DefaultView.aspx?id=OP_5A5_7931__000001_KT67HR,0,0,
Tesco Opticians,CR82HA060716,OPT,,8 Purley Road,,Purley,Surrey,CR8 2HA,Tel: 0208 218 9438, - ,,,No ratings yet Rate it yourself - /Services/opticians/LeaveReview/DefaultView.aspx?id=CR82HA060716,0,0,
A M S Ophthalmic Opticians,OP_5K9_632__000002_CR82HA,OPT,15 Purley Road,,Purley,,,CR8 2HA,Tel: 020 8660 0472, - ,,,15 ratings Rate it yourself - /Services/opticians/LeaveReview/DefaultView.aspx?id=OP_5K9_632__000002_CR82HA,,,
For Your Eyes,OP_5M7_14651__000001_SM60LY,OPT,,116 Woodcote Road,,Wallington,Surrey,SM6 0LY,Tel: 0208 647 3644, - ,,,No ratings yet Rate it yourself - /Services/opticians/LeaveReview/DefaultView.aspx?id=OP_5M7_14651__000001_SM60LY,0,0,
SPECSAVERS,SM6 0LY__000002_SM60LY,OPT,,76 Woodcote Road,,Wallington,Surrey,SM6 0LY,Tel: 0208 835 3680, - ,,,1 rating Rate it yourself - /Services/opticians/LeaveReview/DefaultView.aspx?id=SM6 0LY__000002_SM60LY,,,
Wallington Opticians,OPT_SM60LY_1,OPT,,116 Woodcote Road,,Wallington,Surrey,SM6 0LY,Tel: 020 8647 3644, - ,,,No ratings yet Rate it yourself - /Services/opticians/LeaveReview/DefaultView.aspx?id=OPT_SM60LY_1,0,0,
Pursers Optometrists,OP_5K9_956__000001_CR82LA,OPT,,958 Brighton Road,Purley,Croydon,,CR8 2LP,Tel: 020 8660 2147, - ,,,No ratings yet Rate it yourself - /Services/opticians/LeaveReview/DefaultView.aspx?id=OP_5K9_956__000001_CR82LA,0,0,
Rawling & Sons Ltd,OP_5K9_10711__000001_CR22LP,OPT,946 Brighton Road,Purley,,Surrey,Surrey,CR8 2LP,Tel: 020 8660 3271, - ,,,No ratings yet Rate it yourself - /Services/opticians/LeaveReview/DefaultView.aspx?id=OP_5K9_10711__000001_CR22LP,0,0,
Specsavers,01-14901,OPT,,943 Brighton Road,,Purley,,CR8 2UN,Tel: 0208 6605129, - ,,,No ratings yet Rate it yourself - /Services/opticians/LeaveReview/DefaultView.aspx?id=01-14901,0,0,
Balham Eyecare Centre,OPT_CR82AA_1,OPT,,4 High Street,Purley,Croydon,,CR8 2AA,Tel: 0207 998 3595, - ,,,No ratings yet Rate it yourself - /Services/opticians/LeaveReview/DefaultView.aspx?id=OPT_CR82AA_1,0,0,
Punch Opticians,OP_5LG_14644__000002_SM60NN,OPT,400 Garrett Lane,,Wandsworth,,,SM6 0NN,Tel: 0208 669 2631, - ,,,No ratings yet Rate it yourself - /Services/opticians/LeaveReview/DefaultView.aspx?id=OP_5LG_14644__000002_SM60NN,0,0,
Thomas H. Collison Ltd,OP_5A5_11523__000001_KT67BA,OPT,372 Ewell Road,Tolworth,,Surrey,,KT6 7BA,Tel: 020 8399 0700, - ,,,1 rating Rate it yourself - /Services/opticians/LeaveReview/DefaultView.aspx?id=OP_5A5_11523__000001_KT67BA,,,
Esher Eye Centre,OP_5KP_14521__000001_KT109QJ,OPT,122 High Street,,Esher,,,KT10 9QJ,Tel: 01372 464492, - ,,,No ratings yet Rate it yourself - /Services/opticians/LeaveReview/DefaultView.aspx?id=OP_5KP_14521__000001_KT109QJ,0,0,
Mistry Opticians,OP_5A5_13282__000001_KT67AB,OPT,287 Ewell Road,Surbiton,,Surrey,,KT6 7AB,Tel: 020 8399 4491, - ,,,1 rating Rate it yourself - /Services/opticians/LeaveReview/DefaultView.aspx?id=OP_5A5_13282__000001_KT67AB,,,
Visioncare,OP_5KP_849__000002_KT109RL,OPT,,17 High Street,,Esher,Surrey,KT10 9RL,Tel: 01372 462 401, - ,,,No ratings yet Rate it yourself - /Services/opticians/LeaveReview/DefaultView.aspx?id=OP_5KP_849__000002_KT109RL,0,0,
Specsavers,OP_5L6_14625__000001_KT101BY,OPT,22 High Street,22 High Street,Walton-on-Thames,Surrey,,KT10 1DA,Tel: 01932 251 960, - ,,,No ratings yet Rate it yourself - /Services/opticians/LeaveReview/DefaultView.aspx?id=OP_5L6_14625__000001_KT101BY,0,0,
Haig Brown Opticians,OP_5KP_1837__000001_KT109PJ,OPT,Fairoak,Portsmouth Road,Esher,,,KT10 9PJ,Tel: 01372 466 762, - ,,,1 rating Rate it yourself - /Services/opticians/LeaveReview/DefaultView.aspx?id=OP_5KP_1837__000001_KT109PJ,,,
Eye Contact Vision Clinic,OPT_SM69BS_1,OPT,,152 Stafford Road,,Wallington,,SM6 9BS,Tel: 020 8773 3888, - ,,,No ratings yet Rate it yourself - /Services/opticians/LeaveReview/DefaultView.aspx?id=OPT_SM69BS_1,0,0,
Barlindene Ltd,OP_5M7_7788__000001_SM67NY,OPT,,381 Croydon Road,,Wallington,Surrey,SM6 7NY,Tel: 0208 647 8992, - ,,,No ratings yet Rate it yourself - /Services/opticians/LeaveReview/DefaultView.aspx?id=OP_5M7_7788__000001_SM67NY,0,0,
Costco Wholesale,OP_CR04RR_46729,OPT,,23-29 Imperial Way,,Croydon,,CR0 4RR,Tel: 0208 253 4115, - ,,,No ratings yet Rate it yourself - /Services/opticians/LeaveReview/DefaultView.aspx?id=OP_CR04RR_46729,0,0,
Eye Options,SM46JSBRIGNALL,OPT,,"20-22 Rosehill Court, Bishopsford Road",,Morden,,SM4 6JS,Tel: 0208 648 4814, - ,,,2 ratings Rate it yourself - /Services/opticians/LeaveReview/DefaultView.aspx?id=SM46JSBRIGNALL,,,
Boots-Surbiton,KT6 4NR__000001_KT66NR,OPT,2 Onslow House,67 Victoria Rd,,Surbiton,,KT6 4NR,Tel: 020 8390 9268, - ,,,No ratings yet Rate it yourself - /Services/opticians/LeaveReview/DefaultView.aspx?id=KT6 4NR__000001_KT66NR,0,0,
Graham Johnson,OP_5L6_7561__000003_KT124HL,OPT,6 Hersham Centre,Hersham Green,,Hersham,Surrey,KT12 4HL,Tel: 01932 231 470, - ,,,No ratings yet Rate it yourself - /Services/opticians/LeaveReview/DefaultView.aspx?id=OP_5L6_7561__000003_KT124HL,0,0,yes
Hollands Opticians Surbiton,KT6 4JZ__000002_KT64JZ,OPT,24a,Victoria Road,,Surbiton,,KT6 4JZ,Tel: 0208 399 8104, - ,,,3 ratings Rate it yourself - /Services/opticians/LeaveReview/DefaultView.aspx?id=KT6 4JZ__000002_KT64JZ,,,
Opticall Ltd,685P2__000001_W52QP,OPT,7 Acantha Court,"1st Floor, 21 Victoria Road",Ealing,"Surbiton, Surrey",,KT6 4JZ,, - ,,,No ratings yet Rate it yourself - /Services/opticians/LeaveReview/DefaultView.aspx?id=685P2__000001_W52QP,0,0,
Specsavers Opticians,TP10G,OPT,,2 Surbiton Parade,,Surbiton,,KT6 4RB,, - ,,,No ratings yet Rate it yourself - /Services/opticians/LeaveReview/DefaultView.aspx?id=TP10G,0,0,
Specsavers Opticians,TP10G,OPT,,2 Surbiton Parade,,Surbiton,Surrey,KT6 4RB,Tel: 0208 339 8900, - ,,,No ratings yet Rate it yourself - /Services/opticians/LeaveReview/DefaultView.aspx?id=TP10G,0,0,
KALSI OPTICIANS,KT8 4QU__000001_KT64QU,OPT,24 Claremont Road,,,Surbiton,,KT6 4QU,Tel: 0208 399 9887, - ,,,No ratings yet Rate it yourself - /Services/opticians/LeaveReview/DefaultView.aspx?id=KT8 4QU__000001_KT64QU,0,0,
Optilabs Ltd,OP_5K9_12617__000001_CR04NN,OPT,109 Stafford Road,,Croydon,,,CR0 4NN,Tel: 020 8686 5708, - ,,,2 ratings Rate it yourself - /Services/opticians/LeaveReview/DefaultView.aspx?id=OP_5K9_12617__000001_CR04NN,,,
Visionary Eyecare,VISIONARYEYECARE1,OPT,,"Suite 21/22, Marshall House, 124 Middleton Road",,Morden,Surrey,SM4 6RW,Tel: 0800 052 0355, - ,,,No ratings yet Rate it yourself - /Services/opticians/LeaveReview/DefaultView.aspx?id=VISIONARYEYECARE1,0,0,
EYE CONTACT,KT3 4BH__000001_KT34BH,OPT,191 High Street,,,New Malden,,KT3 4BH,Tel: 0208 942 1104, - ,,,No ratings yet Rate it yourself - /Services/opticians/LeaveReview/DefaultView.aspx?id=KT3 4BH__000001_KT34BH,0,0,
Baileys Opticians,OP_5K9_7651__000002_CR29LA,OPT,1 Limpsfield Road,Sanderstead,,South Croydon,,CR2 9LA,Tel: 020 8657 3525, - ,,,No ratings yet Rate it yourself - /Services/opticians/LeaveReview/DefaultView.aspx?id=OP_5K9_7651__000002_CR29LA,0,0,
Boots-New Malden,KT3 4ET__000004_KT34ET,OPT,,82 High Street,,New Malden,Surrey,KT3 4ET,Tel: 0208 942 0570, - ,,,No ratings yet Rate it yourself - /Services/opticians/LeaveReview/DefaultView.aspx?id=KT3 4ET__000004_KT34ET,0,0,
SPECSAVERS,OP_5A5_14575__000003_KT34ET,OPT,72 High Street,New Malden,,Surrey,,KT3 4ET,Tel: 0208 336 7620, - ,,,No ratings yet Rate it yourself - /Services/opticians/LeaveReview/DefaultView.aspx?id=OP_5A5_14575__000003_KT34ET,0,0,
TESCO OPTICIANS,KT2 4PJ__000002_KT34PJ,OPT,,300 Beverley Way,,New Malden,Surrey,KT3 4PJ,Tel: 0208 273 7138, - ,,,No ratings yet Rate it yourself - /Services/opticians/LeaveReview/DefaultView.aspx?id=KT2 4PJ__000002_KT34PJ,0,0,
Asda Opticians,OPT_CR0 4XS,OPT,,Marlow Way,,Croydon,,CR0 4XS,Tel: 0208 6837614, - ,,,1 rating Rate it yourself - /Services/opticians/LeaveReview/DefaultView.aspx?id=OPT_CR0 4XS,,,
Healthcall Optical Services Ltd,OP_5K9_11724__000001_CR26EB,OPT,The Pavillions,31-33 Brighton Road,South Croydon,,,CR2 6EB,Tel: 0845 601 7241, - ,,,No ratings yet Rate it yourself - /Services/opticians/LeaveReview/DefaultView.aspx?id=OP_5K9_11724__000001_CR26EB,0,0,
MORDEN EYE CENTRE,SM4 6NP__000002_SM45NP,OPT,85 London Road,,,Morden,,SM4 5HP,Tel: 0208 648 3503, - ,,,1 rating Rate it yourself - /Services/opticians/LeaveReview/DefaultView.aspx?id=SM4 6NP__000002_SM45NP,,,
Michael Banes Opticians,20082015SM45BL,OPT,,18 Crown Lane,,Morden,Surrey,SM4 5BL,Tel: 0208 542 5775, - ,,,No ratings yet Rate it yourself - /Services/opticians/LeaveReview/DefaultView.aspx?id=20082015SM45BL,0,0,
SPECSAVERS,SM4 58Q__000003_SM45BQ,OPT,,30 London Road,,Morden,Surrey,SM4 5BQ,Tel: 0208 685 6600, - ,,,No ratings yet Rate it yourself - /Services/opticians/LeaveReview/DefaultView.aspx?id=SM4 58Q__000003_SM45BQ,0,0,
Spex Direct,OP_5K9_10386__000001_CR04JA,OPT,21 Rectory Grove,,Croydon,,,CR0 4JA,Tel: 020 8407 1728, - ,,,No ratings yet Rate it yourself - /Services/opticians/LeaveReview/DefaultView.aspx?id=OP_5K9_10386__000001_CR04JA,0,0,
Pitman & Risner,OP_5M7_10278__000001_SW200AY,OPT,,98 Coombe Lane,,West Wimbledon,Surrey,SW20 0AY,Tel: 0208 946 5331, - ,,,No ratings yet Rate it yourself - /Services/opticians/LeaveReview/DefaultView.aspx?id=OP_5M7_10278__000001_SW200AY,0,0,
Boots-Kingston - Union St,KT1 1RP__000005_KT11RP,OPT,42 Union Street,,,Kingston Upon Thames,Surrey,KT1 1RP,Tel: 0208 5411560, - ,,,1 rating Rate it yourself - /Services/opticians/LeaveReview/DefaultView.aspx?id=KT1 1RP__000005_KT11RP,,,
Thomas H. Collison Ltd,OP_5KP_11291__000001_KT80DT,OPT,Kent House,Walton Road,,East Molesey,Surrey,KT8 0DT,Tel: 0208 979 6751, - ,,,No ratings yet Rate it yourself - /Services/opticians/LeaveReview/DefaultView.aspx?id=OP_5KP_11291__000001_KT80DT,0,0,
DOLLAND & AITCHISON,KT1 1RJ__000001_KT11RJ,OPT,10 Church Street,,,Kingston,,KT1 1RJ,Tel: 0208 546 3416, - ,,,No ratings yet Rate it yourself - /Services/opticians/LeaveReview/DefaultView.aspx?id=KT1 1RJ__000001_KT11RJ,0,0,