Organisation Name,NACS Code,Organisation Type,Address1,Address2,Address3,Address4,Address5,PostCode,Telephone Number,Opening time,Value  (Opening time),Banding Classification  (Opening time),NHS.UK users rating,Value  (NHS.UK users rating),Banding Classification  (NHS.UK users rating),Car parking (Is there car parking at this organisation?)
Eyeline,OP_5J3_10510__000002_WA91AD,OPT,77 Higher Parr Street,St Helens,Merseyside,,,WA9 1AD,Tel: 01744 451041, - ,,,No ratings yet Rate it yourself - /Services/opticians/LeaveReview/DefaultView.aspx?id=OP_5J3_10510__000002_WA91AD,0,0,
Kays Opticians Ltd,OP_5J3_10072__000001_WA101AJ,OPT,95 Church Street,St Helens,Merseyside,,,WA10 1AJ,Tel: 01744 23672, - ,,,No ratings yet Rate it yourself - /Services/opticians/LeaveReview/DefaultView.aspx?id=OP_5J3_10072__000001_WA101AJ,0,0,
R A Carr,OP_5J3_1196__000002_WA101AJ,OPT,101 Church Street,,,St Helens,Merseyside,WA10 1AJ,Tel: 01744 23955, - ,,,No ratings yet Rate it yourself - /Services/opticians/LeaveReview/DefaultView.aspx?id=OP_5J3_1196__000002_WA101AJ,0,0,
The Spectacle Centre,OP_5J3_13928__000001_WA101AR,OPT,Kiosk 1a,The Hardshaw Centre,,St Helens,,WA10 1EB,Tel: 01744 736665, - ,,,No ratings yet Rate it yourself - /Services/opticians/LeaveReview/DefaultView.aspx?id=OP_5J3_13928__000001_WA101AR,0,0,
Vision Express (UK) Ltd,OP_5J3_13090__000002_WA101BN,OPT,6 La Grange Arcade,Church Square Shopping Centre,St Helens,,,WA10 1BN,Tel: 01744 737993, - ,,,No ratings yet Rate it yourself - /Services/opticians/LeaveReview/DefaultView.aspx?id=OP_5J3_13090__000002_WA101BN,0,0,
Boots-St Helens - La Grange Arcade (in Boots UK),OP_5J3_12056__000001_WA10,OPT,La Grange Arcade,24 Church Street,,St Helens,Merseyside,WA10 1BD,Tel: 0174 4751087, - ,,,2 ratings Rate it yourself - /Services/opticians/LeaveReview/DefaultView.aspx?id=OP_5J3_12056__000001_WA10,,,
Specsavers Opticians,OP_5J3_383__000001_WA101NW,OPT,2-4 Bridge Street,St Helens,Merseyside,,,WA10 1NW,Tel: 01744 453 665, - ,,,1 rating Rate it yourself - /Services/opticians/LeaveReview/DefaultView.aspx?id=OP_5J3_383__000001_WA101NW,,,
Howards Opticians,OP_5J3_2795__000001_WA102JE,OPT,47 Duke Street,St Helens,Merseyside,,,WA10 2JE,Tel: 01744 24324, - ,,,No ratings yet Rate it yourself - /Services/opticians/LeaveReview/DefaultView.aspx?id=OP_5J3_2795__000001_WA102JE,0,0,
Industrial Eyecare Opticians,OP_WA102PF_46199,OPT,,51-55 Eccleston Street,,St.Helens,,WA10 2PF,, - ,,,No ratings yet Rate it yourself - /Services/opticians/LeaveReview/DefaultView.aspx?id=OP_WA102PF_46199,0,0,
I CARE OPTICIANS,5NMC385__000003_WA95PE,OPT,i care opticians,128 Thatto Heath Road,Thatto Heath,St.Helens,,WA9 5PE,Tel: 01744 811890, - ,,,3 ratings Rate it yourself - /Services/opticians/LeaveReview/DefaultView.aspx?id=5NMC385__000003_WA95PE,,,yes
Rainhill Designer Spectacles,C/227/5NM__000001_L350LP,OPT,11 Station Street,,Rainhill,Merseyside,,L35 0LP,, - ,,,1 rating Rate it yourself - /Services/opticians/LeaveReview/DefaultView.aspx?id=C/227/5NM__000001_L350LP,,,
R D Wilkes (Optometrists) Ltd,OP_5J3_6795__000001_L354LU,OPT,15 Dane Court,Rainhill,Prescot,,,L35 4LU,Tel: 0151 426 2214, - ,,,No ratings yet Rate it yourself - /Services/opticians/LeaveReview/DefaultView.aspx?id=OP_5J3_6795__000001_L354LU,0,0,
Crompton & Gilmore Opticians,OP_5J3_12507__000001_WA129BQ,OPT,37 Market Street,Newton-le-Willows,Merseyside,,,WA12 9BQ,Tel: 01925 222910, - ,,,1 rating Rate it yourself - /Services/opticians/LeaveReview/DefaultView.aspx?id=OP_5J3_12507__000001_WA129BQ,,,
Roberts Opticians,OP_5J3_13927__000001_WA129BE,OPT,31 Bridge Street,Newton-le-Willows,Merseyside,,,WA12 9BE,Tel: 01925 226269, - ,,,No ratings yet Rate it yourself - /Services/opticians/LeaveReview/DefaultView.aspx?id=OP_5J3_13927__000001_WA129BE,0,0,
Total Eyecare,01-18317,OPT,,14 Bridge Street,,"Earlestown, Newton-le-Willows",,WA12 9BA,Tel: 01925 290757, - ,,,1 rating Rate it yourself - /Services/opticians/LeaveReview/DefaultView.aspx?id=01-18317,,,
Costco Wholesale UK Limited,OPT_WA119FA_1,OPT,,Andover Road,,Haydock,,WA11 9FA,Tel: 01942 868 614, - ,,,No ratings yet Rate it yourself - /Services/opticians/LeaveReview/DefaultView.aspx?id=OPT_WA119FA_1,0,0,
Price & Ankers,OP_5J4_9247__000001_L345QP,OPT,2 Leyland Street,Prescot,Merseyside,,,L34 5QP,Tel: 0151 430 9187, - ,,,No ratings yet Rate it yourself - /Services/opticians/LeaveReview/DefaultView.aspx?id=OP_5J4_9247__000001_L345QP,0,0,
Millican Opticians,OP_5J4_5746__000001_L345QA,OPT,29-31 Eccleston Street,Prescot,Merseyside,,,L34 5QA,Tel: 0151 426 6286, - ,,,No ratings yet Rate it yourself - /Services/opticians/LeaveReview/DefaultView.aspx?id=OP_5J4_5746__000001_L345QA,0,0,
Asda Opticians (Westbrook),C/2058/Q44,OPT,,501 Westbrook Centre,,Warrington,,WA5 8UQ,Tel: 01925 646801, - ,,,1 rating Rate it yourself - /Services/opticians/LeaveReview/DefaultView.aspx?id=C/2058/Q44,,,
Rosenburgh Opticians Ltd,OP_5J2_2525__000004_WA52EY,OPT,15 Honiton Way,Penketh,Warrington,Cheshire,,WA5 2EY,Tel: 01925 724000, - ,,,No ratings yet Rate it yourself - /Services/opticians/LeaveReview/DefaultView.aspx?id=OP_5J2_2525__000004_WA52EY,0,0,
i-Care Opticians,OP_5J1_0002__000001_WA86UE,OPT,"Unit G4, Widnes Market Hall",Green Oaks,Bradley Way,Widnes,Cheshire,WA8 6UE,Tel: 0151 4236324, - ,,,1 rating Rate it yourself - /Services/opticians/LeaveReview/DefaultView.aspx?id=OP_5J1_0002__000001_WA86UE,,,
Specs 2U,OPT_WA28QP_1,OPT,,Unit 2 Clarendon Court,Winwick Quay,Warrington,,WA2 8QP,Tel: 01925 633433, - ,,,No ratings yet Rate it yourself - /Services/opticians/LeaveReview/DefaultView.aspx?id=OPT_WA28QP_1,0,0,
Specsavers Opticians,OP_5J1_4210__000002_WA86JA,OPT,47 Albert Road,Widnes,Cheshire,,,WA8 6JA,Tel: 0151 495 3040, - ,,,No ratings yet Rate it yourself - /Services/opticians/LeaveReview/DefaultView.aspx?id=OP_5J1_4210__000002_WA86JA,0,0,
Scrivens Ltd,OP_5J1_10784__000001_WA86JW,OPT,,4,Albert Square,Widnes,Cheshire,WA8 6JW,Tel: 0151 424 3207, - ,,,No ratings yet Rate it yourself - /Services/opticians/LeaveReview/DefaultView.aspx?id=OP_5J1_10784__000001_WA86JW,0,0,
Vision Express (UK) Ltd,OP_5J1_6727__000001_WA86UD,OPT,10  Green Oaks Shopping Centre,Widnes,Cheshire,,,WA8 6UD,Tel: 0151 257 9559, - ,,,No ratings yet Rate it yourself - /Services/opticians/LeaveReview/DefaultView.aspx?id=OP_5J1_6727__000001_WA86UD,0,0,
Merton Beck Opticians,OP_5J1_7606__000001_WA86AZ,OPT,39 Widnes Road,,Widnes,,,WA8 6AZ,Tel: 0151 424 2141, - ,,,No ratings yet Rate it yourself - /Services/opticians/LeaveReview/DefaultView.aspx?id=OP_5J1_7606__000001_WA86AZ,0,0,
Gore & Hepworth,OP_5HG_1287__000001_WN49AF,OPT,6-8 Garswood Street,Ashton-In-Makerfield,Wigan,,,WN4 9AF,Tel: 01942 713257, - ,,,No ratings yet Rate it yourself - /Services/opticians/LeaveReview/DefaultView.aspx?id=OP_5HG_1287__000001_WN49AF,0,0,
Bowen & Leeming,OP_5HG_2373__000001_WN49AG,OPT,49 Gerard Street,Ashton-In-Makerfield,,Wigan,Greater Manchester,WN4 9AG,Tel: 01942 713747, - ,,,No ratings yet Rate it yourself - /Services/opticians/LeaveReview/DefaultView.aspx?id=OP_5HG_2373__000001_WN49AG,0,0,
Makerfield Eye Centre,OP_5HG_681__000002_WN49AN,OPT,"1 The Gerard Centre, Gerard Street",,,Ashton-In-Makerfield,Greater Manchester,WN4 9AN,Tel: 01942 713747, - ,,,No ratings yet Rate it yourself - /Services/opticians/LeaveReview/DefaultView.aspx?id=OP_5HG_681__000002_WN49AN,0,0,yes
Sinply Opticians,3099K__000002_L360UB,OPT,43 Manor Farm Road,Huyton,Liverpool,,,L36 0UB,Tel: 0151 489 7618, - ,,,No ratings yet Rate it yourself - /Services/opticians/LeaveReview/DefaultView.aspx?id=3099K__000002_L360UB,0,0,
ASDA Huyton,2058H__000001_L367TX,OPT,Huyton Lane,,,Huyton,,L36 7TX,Tel: 0151 449 4620, - ,,,1 rating Rate it yourself - /Services/opticians/LeaveReview/DefaultView.aspx?id=2058H__000001_L367TX,,,
Simply Eyes Opticians,OP_5HG_13703__000002_WN40DH,OPT,10 Downall Green Road,Bryn,Wigan,,,WN4 0DH,Tel: 01942 722711, - ,,,No ratings yet Rate it yourself - /Services/opticians/LeaveReview/DefaultView.aspx?id=OP_5HG_13703__000002_WN40DH,0,0,
Specsavers Opticians,OP_5J4_5817__000001_L365SF,OPT,16 Huyton Hey Road,Huyton,Liverpool,,,L36 5RT,Tel: 0151 481 0241, - ,,,No ratings yet Rate it yourself - /Services/opticians/LeaveReview/DefaultView.aspx?id=OP_5J4_5817__000001_L365SF,0,0,
Millican Opticians,OP_5J4_8614__000002_L369UJ,OPT,,44 Derby Road,Huyton,Liverpool,Merseyside,L36 9UJ,Tel: 0151 489 1845, - ,,,No ratings yet Rate it yourself - /Services/opticians/LeaveReview/DefaultView.aspx?id=OP_5J4_8614__000002_L369UJ,0,0,
Specs 2 U (MBOS Ltd),OP_WA88TL_29557,OPT,,Unit 7,St Michael's Industrial Estate,Widnes,Cheshire,WA8 8TL,Tel: 0151 420 0007, - ,,,No ratings yet Rate it yourself - /Services/opticians/LeaveReview/DefaultView.aspx?id=OP_WA88TL_29557,0,0,
Crompton & Gilmore Opticians,OP_5J3_13922__000001_WA118BT,OPT,8 Ormskirk Road,Rainford,St Helens,,,WA11 8BT,Tel: 01744 882553, - ,,,No ratings yet Rate it yourself - /Services/opticians/LeaveReview/DefaultView.aspx?id=OP_5J3_13922__000001_WA118BT,0,0,
Crompton Opticians,OP_5HG_5118__000001_WA33AD,OPT,24 Heath Street,Golborne,Warrington,,,WA3 3AD,Tel: 01942 726061, - ,,,No ratings yet Rate it yourself - /Services/opticians/LeaveReview/DefaultView.aspx?id=OP_5HG_5118__000001_WA33AD,0,0,
Tesco Opticians,OP_5J2_12289__000001_WA27NE,OPT,,Winwick Road,Warrington,Cheshire,,WA2 7NE,Tel: 0345 6779805, - ,,,5 ratings Rate it yourself - /Services/opticians/LeaveReview/DefaultView.aspx?id=OP_5J2_12289__000001_WA27NE,,,
Vision Express,OPT_WA11QP_1,OPT,,Unit 43 The Mall,,Warrington,,WA1 1QP,Tel: 01925 633444, - ,,,No ratings yet Rate it yourself - /Services/opticians/LeaveReview/DefaultView.aspx?id=OPT_WA11QP_1,0,0,
Boots-Warrington - Golden Sq,OP_5J2_12288__000001_WA12LJ,OPT,"Unit SU35, Golden Square",,,Warrington,Cheshire,WA1 1QP,Tel: 01925 413999, - ,,,No ratings yet Rate it yourself - /Services/opticians/LeaveReview/DefaultView.aspx?id=OP_5J2_12288__000001_WA12LJ,0,0,
David Lundstram Opticians,OP_WA11SL_30098,OPT,,45 Sankey Street,,Warrington,,WA1 1SL,Tel: 01925 630018, - ,,,7 ratings Rate it yourself - /Services/opticians/LeaveReview/DefaultView.aspx?id=OP_WA11SL_30098,,,
Specsavers Opticians,OP_5J2_507__000001_WA11TD,OPT,34 Sankey Street,Golden Square Shopping Centre,Warrington,Cheshire,,WA1 1TD,Tel: 01925 240351, - ,,,2 ratings Rate it yourself - /Services/opticians/LeaveReview/DefaultView.aspx?id=OP_5J2_507__000001_WA11TD,,,
R A Shaw Opticians,OP_5J2_1007__000001_WA11DN,OPT,7 Bold Street,Warrington,Cheshire,,,WA1 1DN,Tel: 01925 632516, - ,,,No ratings yet Rate it yourself - /Services/opticians/LeaveReview/DefaultView.aspx?id=OP_5J2_1007__000001_WA11DN,0,0,
Conway Phillips Ltd,OP_5J2_4589__000001_WA12LZ,OPT,31 Buttermarket Street,Warrington,Cheshire,,,WA1 2LZ,Tel: 01925 633746, - ,,,No ratings yet Rate it yourself - /Services/opticians/LeaveReview/DefaultView.aspx?id=OP_5J2_4589__000001_WA12LZ,0,0,
Asda Opticians,OPT_WA1 2QA,OPT,,COCKHEDGE CENTRE,TILLY LANE,WARRINGTON,,WA1 2QA,Tel: 00000 000000, - ,,,1 rating Rate it yourself - /Services/opticians/LeaveReview/DefaultView.aspx?id=OPT_WA1 2QA,,,
KS Opticians,232323__000001_WA12AP,OPT,Cockhedge Shopping Park,Unit 11,Cockhedge Way,Warrington,Cheshire,WA1 2QQ,Tel: 01925 232918, - ,,,No ratings yet Rate it yourself - /Services/opticians/LeaveReview/DefaultView.aspx?id=232323__000001_WA12AP,0,0,
IN-HOUSE MOBILE OPTICIANS,5NG8069__000001_WA46SR,OPT,Exec Suite 16,St James Business Centre,Wilderspool Causeway,Warrington,Cheshire,WA4 6PS,Tel: 01925 210006, - ,,,40 ratings Rate it yourself - /Services/opticians/LeaveReview/DefaultView.aspx?id=5NG8069__000001_WA46SR,,,
Taylors Opticians,5J1 2583__000002_WA71LX,OPT,33 Church Street,,Runcorn,Cheshire,,WA7 1LX,Tel: 01928 574535, - ,,,No ratings yet Rate it yourself - /Services/opticians/LeaveReview/DefaultView.aspx?id=5J1 2583__000002_WA71LX,0,0,
P & A Morgan Opticians,OP_5J1_3675__000001_WA71NA,OPT,2 Alcock Street,,,Runcorn,Cheshire,WA7 1NA,Tel: 01928 572177, - ,,,1 rating Rate it yourself - /Services/opticians/LeaveReview/DefaultView.aspx?id=OP_5J1_3675__000001_WA71NA,,,
J W Caldicott,OP_5HG_1372__000001_WA32EZ,OPT,220 Slag Lane,Lowton,Warrington,,,WA3 2EZ,Tel: 01942 716317, - ,,,No ratings yet Rate it yourself - /Services/opticians/LeaveReview/DefaultView.aspx?id=OP_5HG_1372__000001_WA32EZ,0,0,
John Prebble Opticians,OP_5HC_9800__000001_L252RG,OPT,Unit 21,Belle Vale Shopping Centre,Belle Vale,Liverpool,Merseyside,L25 2RG,Tel: 0151 487 5228, - ,,,12 ratings Rate it yourself - /Services/opticians/LeaveReview/DefaultView.aspx?id=OP_5HC_9800__000001_L252RG,,,
In-Style Opticians,OP_5HC_3689__000001_L252RQ,OPT,Unit 22,Belle Vale Shopping Centre,Belle Vale,,,L25 2RF,Tel: 0151 487 3713, - ,,,No ratings yet Rate it yourself - /Services/opticians/LeaveReview/DefaultView.aspx?id=OP_5HC_3689__000001_L252RQ,0,0,
West Derby Eye Centre,OP_5HA_13837__000002_L126QX,OPT,74 Baycliff Road,West Derby,Liverpool,,,L12 6QX,Tel: 0151 228 6854, - ,,,No ratings yet Rate it yourself - /Services/opticians/LeaveReview/DefaultView.aspx?id=OP_5HA_13837__000002_L126QX,0,0,
Eye Design,OP_L126QX_30293,OPT,,78 Baycliff Road,,Liverpool,,L12 6QX,, - ,,,No ratings yet Rate it yourself - /Services/opticians/LeaveReview/DefaultView.aspx?id=OP_L126QX_30293,0,0,
Specsavers Belle Vale,C/293/5NL__000001_L252XT,OPT,Unit 3 Belle Vale Shopping Centre,Belle Vale,Liverpool,,,L25 2XT,, - ,,,No ratings yet Rate it yourself - /Services/opticians/LeaveReview/DefaultView.aspx?id=C/293/5NL__000001_L252XT,0,0,
PSM VIsion Services Ltd,OL/CO-3338/5J2__000002_WA46SR,OPT,Walton Lodge,Hill Cliffe Road,Walton,Warrington,,WA4 6NU,Tel: 01925 210006, - ,,,No ratings yet Rate it yourself - /Services/opticians/LeaveReview/DefaultView.aspx?id=OL/CO-3338/5J2__000002_WA46SR,0,0,
Integrated Optical Limited,OP_5J2_9746__000001_WA11SL,OPT,10 The Forge Shopping Centre,London Road,Stockton Heath,Warrington,,WA4 6HW,Tel: 01925 630018, - ,,,No ratings yet Rate it yourself - /Services/opticians/LeaveReview/DefaultView.aspx?id=OP_5J2_9746__000001_WA11SL,0,0,
Mullens Opticians,OP_5J2_9150__000003_WA46HW,OPT,10 The Forge Shopping Centre,London Road,Stockton Heath,Warrington,,WA4 6HW,Tel: 01925 268608, - ,,,2 ratings Rate it yourself - /Services/opticians/LeaveReview/DefaultView.aspx?id=OP_5J2_9150__000003_WA46HW,,,
Martin J. Berry Opticians,OP_5J2_11173__000003_WA46SG,OPT,33 London Road,Stockton Heath,Warrington,Cheshire,,WA4 6SG,Tel: 01925 861851, - ,,,No ratings yet Rate it yourself - /Services/opticians/LeaveReview/DefaultView.aspx?id=OP_5J2_11173__000003_WA46SG,0,0,
Hepworth & Hall,OP_5HG_2586__000001_WN58AX,OPT,806 Ormskirk Road,,Wigan,,,WN5 8AX,Tel: 01942 225301, - ,,,No ratings yet Rate it yourself - /Services/opticians/LeaveReview/DefaultView.aspx?id=OP_5HG_2586__000001_WN58AX,0,0,
S Gore Opticians,OP_5HG_0001__000001_WN58QA,OPT,703 Ormskirk Road,Pemberton,Wigan,,,WN5 8AQ,Tel: 01942 214808, - ,,,No ratings yet Rate it yourself - /Services/opticians/LeaveReview/DefaultView.aspx?id=OP_5HG_0001__000001_WN58QA,0,0,
Optical Opticians,OP_5J2_11015__000002_WA41JY,OPT,715 Knutsford Road,Warrington,Cheshire,,,WA4 1JY,Tel: 01925 636696, - ,,,No ratings yet Rate it yourself - /Services/opticians/LeaveReview/DefaultView.aspx?id=OP_5J2_11015__000002_WA41JY,0,0,
Julie Hatchell Opticians,OP_5HC_6617__000001_L255JD,OPT,34 Woolton Street,Woolton,Liverpool,,,L25 5JD,Tel: 0151 428 4040, - ,,,4 ratings Rate it yourself - /Services/opticians/LeaveReview/DefaultView.aspx?id=OP_5HC_6617__000001_L255JD,,,
Specsavers Opticians,OP_5J1_4930__000001_WA72BY,OPT,104 Bridge Walk,Halton Lea,Runcorn,Cheshire,,WA7 2BY,Tel: 01928 716200, - ,,,No ratings yet Rate it yourself - /Services/opticians/LeaveReview/DefaultView.aspx?id=OP_5J1_4930__000001_WA72BY,0,0,
Mullens Opticians,OP_5J1_9152__000002_WA72BX,OPT,98 River Walk,Halton Lea,Runcorn,Cheshire,,WA7 2BX,Tel: 01928 790083, - ,,,No ratings yet Rate it yourself - /Services/opticians/LeaveReview/DefaultView.aspx?id=OP_5J1_9152__000002_WA72BX,0,0,
Hepworth & Hall,OP_5HG_8254__000001_WN59EA,OPT,73 Ormskirk Road,,Wigan,,,WN5 9EA,Tel: 01942 323162, - ,,,No ratings yet Rate it yourself - /Services/opticians/LeaveReview/DefaultView.aspx?id=OP_5HG_8254__000001_WN59EA,0,0,
J M Bennett,OP_5HC_13836__000001_L250NN,OPT,281 Speke Road,Woolton,Liverpool,,,L25 0NN,Tel: 0151 486 4121, - ,,,No ratings yet Rate it yourself - /Services/opticians/LeaveReview/DefaultView.aspx?id=OP_5HC_13836__000001_L250NN,0,0,
Specsavers Opticians,01-20561,OPT,,21 St Chad's Parade,,Kirby,,L32 8RD,Tel: 0151 545 5310, - ,,,No ratings yet Rate it yourself - /Services/opticians/LeaveReview/DefaultView.aspx?id=01-20561,0,0,
S Wilcox,OP_5HA_13841__000001_L167QQ,OPT,169 Dunbabin Road,Childwall,Childwall,,,L16 7QQ,Tel: 0151 722 1182, - ,,,No ratings yet Rate it yourself - /Services/opticians/LeaveReview/DefaultView.aspx?id=OP_5HA_13841__000001_L167QQ,0,0,
Asda Vision Centre Ltd,OP_5J2_0001__000002_WA37PG,OPT,Birchwood Centre,Dewhurst Road,Warrington,Cheshire,,WA3 7PG,Tel: 01925 820797, - ,,,No ratings yet Rate it yourself - /Services/opticians/LeaveReview/DefaultView.aspx?id=OP_5J2_0001__000002_WA37PG,0,0,
A.H. Mertons,OP_5J2_5608__000001_WA37PG,OPT,19 Dewhurst Road,Birchwood Shopping Centre,Birchwood,Warrington,Cheshire,WA3 7PG,Tel: 01925 810884, - ,,,No ratings yet Rate it yourself - /Services/opticians/LeaveReview/DefaultView.aspx?id=OP_5J2_5608__000001_WA37PG,0,0,
Asda Opticians,OP_5HG_14359__000002_WN50XA,OPT,Asda Stores Ltd,Soho Street,,Newtown,,WN5 0XA,Tel: 01942 243522, - ,,,No ratings yet Rate it yourself - /Services/opticians/LeaveReview/DefaultView.aspx?id=OP_5HG_14359__000002_WN50XA,0,0,
Boots Opticians,OPT_WN50UH_1,OPT,,37 Loire Drive,Robin Park,Wigan,,WN5 0UH,Tel: 01942 212773, - ,,,1 rating Rate it yourself - /Services/opticians/LeaveReview/DefaultView.aspx?id=OPT_WN50UH_1,,,
Martin & Kaye Opticians,OP_5HC_14726__000002_L242SE,OPT,19 Penketh Drive,Speke,Liverpool,,,L24 2WZ,Tel: 0151 486 3018, - ,,,No ratings yet Rate it yourself - /Services/opticians/LeaveReview/DefaultView.aspx?id=OP_5HC_14726__000002_L242SE,0,0,
Eyecall Opticians,OP_5HA_14743__000001_L125HP,OPT,"Unit 3,7/7a Almonds Green Parade",West Derby Village,Liverpool,,,L12 5HP,Tel: 0151 256 6060, - ,,,No ratings yet Rate it yourself - /Services/opticians/LeaveReview/DefaultView.aspx?id=OP_5HA_14743__000001_L125HP,0,0,
SPECSAVERS OLD SWAN,11912OLSWA__000003_L135XE,OPT,628 Prescot Road,Old Swan,Liverpool,Merseyside,,L13 5XE,Tel: 0151 250 6360, - ,,,1 rating Rate it yourself - /Services/opticians/LeaveReview/DefaultView.aspx?id=11912OLSWA__000003_L135XE,,,
Martin & Kaye Opticians,OP_5HA_262__000001_L135UX,OPT,585 Prescot Road,Old Swan,Liverpool,,,L13 5UX,Tel: 0151 220 6161, - ,,,No ratings yet Rate it yourself - /Services/opticians/LeaveReview/DefaultView.aspx?id=OP_5HA_262__000001_L135UX,0,0,
Millican Opticians,OP_5HA_8976__000002_L135XE,OPT,,589 Prescot Road,Old Swan,Liverpool,,L13 5UX,Tel: 0151 228 8561, - ,,,No ratings yet Rate it yourself - /Services/opticians/LeaveReview/DefaultView.aspx?id=OP_5HA_8976__000002_L135XE,0,0,
Batty and Dexter Hunts Cross,C2955NL__000003_L249GB,OPT,"Unit M, Hunts Cross Shopping Centre",Hunts Cross,,Liverpool,,L24 9GB,Tel: 01514489620, - ,,,No ratings yet Rate it yourself - /Services/opticians/LeaveReview/DefaultView.aspx?id=C2955NL__000003_L249GB,0,0,
Boots-Liverpool - Hunts Cross,OP_5HC_723__000001_L249GB,OPT,19 Hunts Cross Centre,"Asda Complex, Speke Hall Road",,Liverpool,Merseyside,L24 9GB,Tel: 0151 448 1992, - ,,,No ratings yet Rate it yourself - /Services/opticians/LeaveReview/DefaultView.aspx?id=OP_5HC_723__000001_L249GB,0,0,
T J Crompton Opticians,OP_5J2_4465__000001_WA34EG,OPT,6 Common Lane,Culcheth,Warrington,Cheshire,,WA3 4EG,Tel: 01925 766888, - ,,,No ratings yet Rate it yourself - /Services/opticians/LeaveReview/DefaultView.aspx?id=OP_5J2_4465__000001_WA34EG,0,0,
Asda Stores Ltd,OPT_L24 9WA,OPT,,Hunts Cross Shopping Centre,,Liverpool,,L24 9WA,Tel: 0151 728 4612, - ,,,No ratings yet Rate it yourself - /Services/opticians/LeaveReview/DefaultView.aspx?id=OPT_L24 9WA,0,0,
Boots-Wigan,WN1 1PJ_19173,OPT,,50 Market Place,,Wigan,Lancashire,WN1 1PJ,Tel: 01942 242015, - ,,,No ratings yet Rate it yourself - /Services/opticians/LeaveReview/DefaultView.aspx?id=WN1 1PJ_19173,0,0,
I Site Opticians,OP_5HG^3322__000005_WN11HX,OPT,42a Market Street,,Wigan,,,WN1 1HX,Tel: 01942 234499, - ,,,No ratings yet Rate it yourself - /Services/opticians/LeaveReview/DefaultView.aspx?id=OP_5HG^3322__000005_WN11HX,0,0,
Roberts Opticians,00012__000004_WN11HX,OPT,42 Market Street,,Wigan,,,WN1 1HX,Tel: 01942 247632, - ,,,No ratings yet Rate it yourself - /Services/opticians/LeaveReview/DefaultView.aspx?id=00012__000004_WN11HX,0,0,
Specsavers Opticians,OP_5HG_9259__000001_WN11JS,OPT,3-5 Standishgate,,,WIGAN,,WN1 1UE,Tel: 01942 824 480, - ,,,No ratings yet Rate it yourself - /Services/opticians/LeaveReview/DefaultView.aspx?id=OP_5HG_9259__000001_WN11JS,0,0,
The Spectacle Centre,00010__000004_WN13NH,OPT,Unit 9/10 Market Hall,,Wigan,,,WN1 1PW,Tel: 01942 236816, - ,,,No ratings yet Rate it yourself - /Services/opticians/LeaveReview/DefaultView.aspx?id=00010__000004_WN13NH,0,0,
Jacksons Opticians,OP_5HG_363__000001_WN11UW,OPT,44 Standish Gate,,,Wigan,Lancashire,WN1 1UW,Tel: 01942 242188, - ,,,2 ratings Rate it yourself - /Services/opticians/LeaveReview/DefaultView.aspx?id=OP_5HG_363__000001_WN11UW,,,no
Bennett & Batty,OP_5HA_3785__000002_L182DD,OPT,93 Allerton Road,Mossley Hill,,Liverpool,,L18 2DD,Tel: 0151 724 4144, - ,,,9 ratings Rate it yourself - /Services/opticians/LeaveReview/DefaultView.aspx?id=OP_5HA_3785__000002_L182DD,,,
Vision  Express UK Ltd,OP_5HG_6908__000001_WN11AS,OPT,Unit 63/64  Ashton Gallery,The Galleries Shopping Centre,Wigan,Lancashire,,WN1 1AF,Tel: 01942 495660, - ,,,No ratings yet Rate it yourself - /Services/opticians/LeaveReview/DefaultView.aspx?id=OP_5HG_6908__000001_WN11AS,0,0,
Millican Opticians,OP_5HA_14746__000001_L181LW,OPT,82-84 Allerton Road,,Liverpool,,,L18 1LW,Tel: 0151 734 5005, - ,,,No ratings yet Rate it yourself - /Services/opticians/LeaveReview/DefaultView.aspx?id=OP_5HA_14746__000001_L181LW,0,0,
Specsavers Opticians,11912__000001_L154HN,OPT,21/22 Smithdown Place,,Liverpool,,,L15 9EN,Tel: 0151 734 7555, - ,,,No ratings yet Rate it yourself - /Services/opticians/LeaveReview/DefaultView.aspx?id=11912__000001_L154HN,0,0,
Prebble Opticians,OP_5G9_4286__000001_L111DQ,OPT,4-8 Utting Avenue East,Norris Green,Liverpool,Liverpool,,L11 1DQ,Tel: 0151 256 1944, - ,,,2 ratings Rate it yourself - /Services/opticians/LeaveReview/DefaultView.aspx?id=OP_5G9_4286__000001_L111DQ,,,
Specsavers Opticians,OP_5G9_7432__000001_L111BX,OPT,11-13 Broadway,Norris Green,Liverpool,,,L11 1BX,Tel: 0151 226 6617, - ,,,1 rating Rate it yourself - /Services/opticians/LeaveReview/DefaultView.aspx?id=OP_5G9_7432__000001_L111BX,,,
Norris Green Specsavers Ltd,TP6PA,OPT,,"11-13 Broadway, Norris Green",,Liverpool,,L11 1BX,, - ,,,No ratings yet Rate it yourself - /Services/opticians/LeaveReview/DefaultView.aspx?id=TP6PA,0,0,
Robert Glass Opticians t/a Glasses 4 Less,OP_5G9_2452__000001_L111BZ,OPT,25 Broadway,Norris Green,Liverpool,Liverpool,,L11 1BX,Tel: 0151 256 1166, - ,,,No ratings yet Rate it yourself - /Services/opticians/LeaveReview/DefaultView.aspx?id=OP_5G9_2452__000001_L111BZ,0,0,
Barnes-Hazel (Opticians) Ltd,OP_5HG_7878__000002_WN23AY,OPT,102 Market Street,Hindley,Wigan,,,WN2 3AY,Tel: 01942 255695, - ,,,No ratings yet Rate it yourself - /Services/opticians/LeaveReview/DefaultView.aspx?id=OP_5HG_7878__000002_WN23AY,0,0,
The Spectacle Centre,4291956__000001_L154LP,OPT,254 Picton Road,,Liverpool,,,L15 4LP,Tel: 0151 734 4486, - ,,,No ratings yet Rate it yourself - /Services/opticians/LeaveReview/DefaultView.aspx?id=4291956__000001_L154LP,0,0,