Organisation Name,NACS Code,Organisation Type,Address1,Address2,Address3,Address4,Address5,PostCode,Telephone Number,Opening time,Value  (Opening time),Banding Classification  (Opening time),NHS.UK users rating,Value  (NHS.UK users rating),Banding Classification  (NHS.UK users rating),Car parking (Is there car parking at this organisation?)
Gregory & Seeley,OP_5L5_9748__000001_GU68AU,OPT,Tylers Building,High Street,Cranleigh,,,GU6 8AU,Tel: 01483 272 629, - ,,,No ratings yet Rate it yourself - /Services/opticians/LeaveReview/DefaultView.aspx?id=OP_5L5_9748__000001_GU68AU,0,0,
Batemans Opticians Ltd,OP_5L5_2968__000002_GU68AG,OPT,Dunford House,58 High Street,,Cranleigh,Surrey,GU6 8AG,Tel: 01483 272 750, - ,,,No ratings yet Rate it yourself - /Services/opticians/LeaveReview/DefaultView.aspx?id=OP_5L5_2968__000002_GU68AG,0,0,
Cranleigh Specsavers Ltd,TP8NR,OPT,,Specsavers Opticians,,"104 High Street, Cranleigh",,GU6 8AJ,, - ,,,No ratings yet Rate it yourself - /Services/opticians/LeaveReview/DefaultView.aspx?id=TP8NR,0,0,
Boots-Cranleigh,GU6 8RG__000001_GU68RG,OPT,Unit 3,Stocklund Square,170 High Street,Cranleigh,Surrey,GU6 8RG,Tel: 01483 276994, - ,,,No ratings yet Rate it yourself - /Services/opticians/LeaveReview/DefaultView.aspx?id=GU6 8RG__000001_GU68RG,0,0,
EMSLIE OPTICIANS,OP_5KP_14528__000001_RH41AY,OPT,62 High Street,,Dorking,Dorking,,RH4 1AY,Tel: 01306 875 201, - ,,,No ratings yet Rate it yourself - /Services/opticians/LeaveReview/DefaultView.aspx?id=OP_5KP_14528__000001_RH41AY,0,0,
Boots-Dorking,OP_5KP_10554__000003_RH41AW,OPT,83 High Street,,,Dorking,Surrey,RH4 1AW,Tel: 01306 882 176, - ,,,1 rating Rate it yourself - /Services/opticians/LeaveReview/DefaultView.aspx?id=OP_5KP_10554__000003_RH41AW,,,
Specsavers Opticians,OP_5KP_14662__000002_RH41BA,OPT,Specsavers,110 High Street,,Dorking,Surrey,RH4 1BA,Tel: 01306 745 350, - ,,,No ratings yet Rate it yourself - /Services/opticians/LeaveReview/DefaultView.aspx?id=OP_5KP_14662__000002_RH41BA,0,0,
Batemans (Opticians) Ltd,OP_5KP_11827__000001_RH41BA,OPT,,114 High Street,,Dorking,Surrey,RH4 1BA,Tel: 01306 882 787, - ,,,No ratings yet Rate it yourself - /Services/opticians/LeaveReview/DefaultView.aspx?id=OP_5KP_11827__000001_RH41BA,0,0,
Nicklins Opticians,OP_5L5_9270__000001_GU13JB,OPT,216 High Street,,,Guildford,,GU1 3JB,Tel: 01483 561 256, - ,,,No ratings yet Rate it yourself - /Services/opticians/LeaveReview/DefaultView.aspx?id=OP_5L5_9270__000001_GU13JB,0,0,
Batemans (Opticians) Ltd,OP_5L5_2184__000001_GU13HN,OPT,162 High Street,,Guildford,,,GU1 3HN,Tel: 01483 572 953, - ,,,No ratings yet Rate it yourself - /Services/opticians/LeaveReview/DefaultView.aspx?id=OP_5L5_2184__000001_GU13HN,0,0,
Optical Express,GU1 3EZ_11111,OPT,"Suite 3, 1 Milkhouse gate",,,Guildford,Surrey,GU1 3EZ,Tel: 0800 023 2020, - ,,,No ratings yet Rate it yourself - /Services/opticians/LeaveReview/DefaultView.aspx?id=GU1 3EZ_11111,0,0,
Dollond & Aitchison,OP_5L5_7322__000001_GU13HE,OPT,94 High Street,,Guildford,,,GU1 3HE,Tel: 01483 570 093, - ,,,No ratings yet Rate it yourself - /Services/opticians/LeaveReview/DefaultView.aspx?id=OP_5L5_7322__000001_GU13HE,0,0,
David Clulow Opticians,OP_GU13DP_89449,OPT,,103 High Street,,Guildford,,GU1 3DP,Tel: 01483 453339, - ,,,No ratings yet Rate it yourself - /Services/opticians/LeaveReview/DefaultView.aspx?id=OP_GU13DP_89449,0,0,
Boots-Guildford - Swan Lane,OP_5L5_629__000001_GU14EQ,OPT,22-24 Swan Lane,,,Guildford,Surrey,GU1 4EQ,Tel: 01483 573637, - ,,,No ratings yet Rate it yourself - /Services/opticians/LeaveReview/DefaultView.aspx?id=OP_5L5_629__000001_GU14EQ,0,0,
Boots Optician Ltd,OPT_GU14EQ_1,OPT,,22-24 Swan Lane,,Guildford,Surrey,GU1 4EQ,Tel: 01483 573637, - ,,,No ratings yet Rate it yourself - /Services/opticians/LeaveReview/DefaultView.aspx?id=OPT_GU14EQ_1,0,0,
Vision Express (UK) Ltd,OP_5L5_719__000002_GU13DY,OPT,51 High Street,,,Guildford,,GU1 3DY,Tel: 01483 300 344, - ,,,No ratings yet Rate it yourself - /Services/opticians/LeaveReview/DefaultView.aspx?id=OP_5L5_719__000002_GU13DY,0,0,
Bayfields Opticians,OP_5L5_4821__000001_GU13DY,OPT,37 High Street,,Guildford,Guildford,,GU1 3DY,Tel: 01483 575 650, - ,,,2 ratings Rate it yourself - /Services/opticians/LeaveReview/DefaultView.aspx?id=OP_5L5_4821__000001_GU13DY,,,
Specsavers Opticians,OP_5L5_8367__000001_GU14EH,OPT,23 Friary Street,,,Guildford,,GU1 4EH,Tel: 01483 452 225, - ,,,No ratings yet Rate it yourself - /Services/opticians/LeaveReview/DefaultView.aspx?id=OP_5L5_8367__000001_GU14EH,0,0,
Donner Optometrists,,OPT,,9 Church Rd,,Great Bookham Leatherhead,,KT23 3PD,Tel: 01372 458318, - ,,,N/A - Data not available,,,
Community Eye Care,OP_5L5_3088__000001_GU236EW,OPT,"Suite A, Astra",Vicarage Lane,"Send, Woking",Surrey,,GU23 7JN,Tel: 01483 224914, - ,,,No ratings yet Rate it yourself - /Services/opticians/LeaveReview/DefaultView.aspx?id=OP_5L5_3088__000001_GU236EW,0,0,
Chandlers Eyecare,B5V5J,OPT,,40 High Street,,Godalming,Surrey,GU7 1DY,Tel: 01483 418 020, - ,,,No ratings yet Rate it yourself - /Services/opticians/LeaveReview/DefaultView.aspx?id=B5V5J,0,0,
Batemans  Opticians,OP_5L5_10443__000001_GU71AW,OPT,,37 High Street,,Godalming,Surrey,GU7 1AU,Tel: 01483 414 953, - ,,,No ratings yet Rate it yourself - /Services/opticians/LeaveReview/DefaultView.aspx?id=OP_5L5_10443__000001_GU71AW,0,0,
Boots-Godalming,GU7 1AU__000002_GU71AU,OPT,33 High Street,,,Godalming,Surrey,GU7 1AU,Tel: 01483 425087, - ,,,No ratings yet Rate it yourself - /Services/opticians/LeaveReview/DefaultView.aspx?id=GU7 1AU__000002_GU71AU,0,0,
iSpy Opticians,TP2DG,OPT,,67 High street,,Godalming,Surrey,GU7 1AW,Tel: 01483 414168, - ,,,No ratings yet Rate it yourself - /Services/opticians/LeaveReview/DefaultView.aspx?id=TP2DG,0,0,
Vision Express ,OP_5L7_6926__000001_GU211GD,OPT,,46 Wolsey Walk,,Woking,Surrey,GU2 6GH,Tel: 01483 767 141, - ,,,No ratings yet Rate it yourself - /Services/opticians/LeaveReview/DefaultView.aspx?id=OP_5L7_6926__000001_GU211GD,0,0,
Thomas H. Collison Ltd,OP_5L5_9284__000001_GU25XX,OPT,The Royal Surrey County Hospital,Egerton Road,,Guildford,Surrey,GU2 5XX,Tel: 01483 571122 (ext. 2144), - ,,,No ratings yet Rate it yourself - /Services/opticians/LeaveReview/DefaultView.aspx?id=OP_5L5_9284__000001_GU25XX,0,0,
Specsavers Opticians,OPT_KT228AH_1,OPT,,12 The Swan Centre,,Leatherhead,Surrey,KT22 8AH,Tel: 01372 227740, - ,,,No ratings yet Rate it yourself - /Services/opticians/LeaveReview/DefaultView.aspx?id=OPT_KT228AH_1,0,0,
Leightons Opticians & Hearing Care,OP_5KP_3130__000001_KT112LR,OPT,,Unit 5,1-7 Holly Parade,Cobham,Surrey,KT11 3EB,Tel: 01932 867 890, - ,,,No ratings yet Rate it yourself - /Services/opticians/LeaveReview/DefaultView.aspx?id=OP_5KP_3130__000001_KT112LR,0,0,
The Optical Co. ,TP9G6,OPT,,3 High Street,,Cobham,Surrey,KT11 3DH,Tel: 01932 867565, - ,,,No ratings yet Rate it yourself - /Services/opticians/LeaveReview/DefaultView.aspx?id=TP9G6,0,0,
David Clulow Opticians,KT11 2LR__000002_KT112LR,OPT,21 Oakdene Parade,,Cobham,Surrey,,KT11 2LR,Tel: 01932 590415, - ,,,No ratings yet Rate it yourself - /Services/opticians/LeaveReview/DefaultView.aspx?id=KT11 2LR__000002_KT112LR,0,0,
Bayfields Opticians,OP_5L7_9872__000001_GU211XU,OPT,,35 Commercial Way,,Woking,,GU21 6XR,Tel: 01483 766 800, - ,,,No ratings yet Rate it yourself - /Services/opticians/LeaveReview/DefaultView.aspx?id=OP_5L7_9872__000001_GU211XU,0,0,
Specsavers Opticians,OP_5L7_375__000001_GU211XS,OPT,,17-19 Wolsey Walk,Wolsey Place Shopping Centre,Woking,Surrey,GU21 6XU,Tel: 01483 767 170, - ,,,No ratings yet Rate it yourself - /Services/opticians/LeaveReview/DefaultView.aspx?id=OP_5L7_375__000001_GU211XS,0,0,
Boots Opticians Woking ,OP_5L7_6031__000002_GU211YA,OPT,1-9 Commercial Way,"10 Wolsey Walk, Wolsey Place Shopping Centre",,Woking,Surrey,GU21 6XU,Tel: 01483 761640, - ,,,1 rating Rate it yourself - /Services/opticians/LeaveReview/DefaultView.aspx?id=OP_5L7_6031__000002_GU211YA,,,
Dollond & Aitchison,OP_5L7_3550__000001_GU211XX,OPT,35 Wolsey Walk,,Woking,,,GU21 6YH,Tel: 01483 761 495, - ,,,No ratings yet Rate it yourself - /Services/opticians/LeaveReview/DefaultView.aspx?id=OP_5L7_3550__000001_GU211XX,0,0,
Batemans (opticians),OP_5L7_11137__000001_KT146LF,OPT,,57 Old Woking Road,,West Byfleet,Surrey,KT14 6LF,Tel: 01932 343 732, - ,,,No ratings yet Rate it yourself - /Services/opticians/LeaveReview/DefaultView.aspx?id=OP_5L7_11137__000001_KT146LF,0,0,
Batemans Opticians,OP_5L7_12343__000001_GU215AG,OPT,55 Commercial Way,,Woking,,,GU21 3HN,Tel: 01483 760770, - ,,,No ratings yet Rate it yourself - /Services/opticians/LeaveReview/DefaultView.aspx?id=OP_5L7_12343__000001_GU215AG,0,0,
Asda Opticians,OPT_GU21 5SE,OPT,,Forsyth Road,,Sheerwater,,GU21 5SE,Tel: 01483220 955, - ,,,No ratings yet Rate it yourself - /Services/opticians/LeaveReview/DefaultView.aspx?id=OPT_GU21 5SE,0,0,
Asda Stores Ltd,OPT_GU215SE_1,OPT,Asda Opticians,Forsyth Road,,"Sheerwater, Woking",Surrey,GU21 5SE,Tel: 01483 702700, - ,,,No ratings yet Rate it yourself - /Services/opticians/LeaveReview/DefaultView.aspx?id=OPT_GU215SE_1,0,0,
T H Collison Ltd,OP_5L7_6600__000002_KT146NG,OPT,,15 Old Woking Road,,West Byfleet,Surrey,KT14 6LW,Tel: 01932 342 457, - ,,,No ratings yet Rate it yourself - /Services/opticians/LeaveReview/DefaultView.aspx?id=OP_5L7_6600__000002_KT146NG,0,0,
Ashtead Eye Clinic,OP_5KP_12937__000001_KT211AA,OPT,31-33 The Street,,Ashtead,,,KT21 1AA,Tel: 01372 274 348, - ,,,No ratings yet Rate it yourself - /Services/opticians/LeaveReview/DefaultView.aspx?id=OP_5KP_12937__000001_KT211AA,0,0,
Boots-Horsham - West St,OP_5MC_3630__000001_RH121PP,OPT,39 West Street,,Horsham,West Sussex,,RH12 1PP,Tel: 01403 253553, - ,,,1 rating Rate it yourself - /Services/opticians/LeaveReview/DefaultView.aspx?id=OP_5MC_3630__000001_RH121PP,,,
Opticial Express,OP_12345_RH12 1HQ,OPT,25 Swan Walk,,,Horsham,West Sussex,RH12 1HQ,Tel: 0800 023 2020, - ,,,No ratings yet Rate it yourself - /Services/opticians/LeaveReview/DefaultView.aspx?id=OP_12345_RH12 1HQ,0,0,
Vision Express,OP_5MC_12036__000001_RH121PB,OPT,23 West Street,,Horsham,West Sussex,,RH12 1PB,Tel: 01403 256636, - ,,,No ratings yet Rate it yourself - /Services/opticians/LeaveReview/DefaultView.aspx?id=OP_5MC_12036__000001_RH121PB,0,0,
Specsavers Opticians,OP_5P6_OPTICIAN SPECSAVERS HORSHAM__000001_RH121PL,OPT,57 West Street,,Horsham,West Sussex,,RH12 1PL,Tel: 01403 275115, - ,,,1 rating Rate it yourself - /Services/opticians/LeaveReview/DefaultView.aspx?id=OP_5P6_OPTICIAN SPECSAVERS HORSHAM__000001_RH121PL,,,
TESCO OPTICANS,KT13 0XF__000003_KT130XF,OPT,,Barnes Wallace Drive,,Weybridge,Surrey,KT13 0XF,Tel: 0345 601 3479, - ,,,No ratings yet Rate it yourself - /Services/opticians/LeaveReview/DefaultView.aspx?id=KT13 0XF__000003_KT130XF,0,0,
Louise Sloan Opticians,OPT_RH121EH_2,OPT,,1 Piries Place,,Horsham,,RH12 1EH,Tel: 01403 264682, - ,,,No ratings yet Rate it yourself - /Services/opticians/LeaveReview/DefaultView.aspx?id=OPT_RH121EH_2,0,0,
JOHN ROSE EYE CARE,KT11 1BQ__000001_KT111BQ,OPT,,1 Eden Street,,Kingston,Surrey,KT11 1BQ,Tel: 0208 546 9292, - ,,,1 rating Rate it yourself - /Services/opticians/LeaveReview/DefaultView.aspx?id=KT11 1BQ__000001_KT111BQ,,,
Specsavers Opticians,RH2 9AE__000001_RH29AE,OPT,39 High Street,,Reigate,Surrey,,RH2 9AE,Tel: 01737 227920, - ,,,1 rating Rate it yourself - /Services/opticians/LeaveReview/DefaultView.aspx?id=RH2 9AE__000001_RH29AE,,,
Bateman Opticians,OP_5KQ_9375__000001_RH27AD,OPT,,7 Bell Street,,Reigate,Surrey,RH2 7AD,Tel: 01737 242 789, - ,,,No ratings yet Rate it yourself - /Services/opticians/LeaveReview/DefaultView.aspx?id=OP_5KQ_9375__000001_RH27AD,0,0,
i-Contact,OP_5KQ_9977__000001_RH20AN,OPT,20 Church Street,,Reigate,,,RH2 0AN,Tel: 01737 242 754, - ,,,No ratings yet Rate it yourself - /Services/opticians/LeaveReview/DefaultView.aspx?id=OP_5KQ_9977__000001_RH20AN,0,0,
Whiteman Opticians,OP_5KQ_12938__000001_RH20AD,OPT,,20 Church Street,,Reigate,Surrey,RH2 0AN,Tel: 01737 223 202, - ,,,No ratings yet Rate it yourself - /Services/opticians/LeaveReview/DefaultView.aspx?id=OP_5KQ_12938__000001_RH20AD,0,0,
The Reigate Optical Rooms,TP9DV,OPT,,3 Pool House,,Reigate,Surrey,RH2 7RP,Tel: 01737 304090, - ,,,No ratings yet Rate it yourself - /Services/opticians/LeaveReview/DefaultView.aspx?id=TP9DV,0,0,
Boots-Reigate,OP_5KQ_10061__000002_RH20AD,OPT,25 Church Street,,,Reigate,Surrey,RH2 0AD,Tel: 01737 243 577, - ,,,No ratings yet Rate it yourself - /Services/opticians/LeaveReview/DefaultView.aspx?id=OP_5KQ_10061__000002_RH20AD,0,0,
Nethercott Opticians,OP_5KP_4172__000002_KT205AD,OPT,18 Station Approach,,Tadworth,Surrey,,KT20 5AD,Tel: 01737 813 600, - ,,,No ratings yet Rate it yourself - /Services/opticians/LeaveReview/DefaultView.aspx?id=OP_5KP_4172__000002_KT205AD,0,0,
Penny & Hayter,OP_5L7_10130__000001_GU212PS,OPT,3 Albion Parade,High Street,Woking,,,GU21 2PS,Tel: 01483 475 205, - ,,,No ratings yet Rate it yourself - /Services/opticians/LeaveReview/DefaultView.aspx?id=OP_5L7_10130__000001_GU212PS,0,0,
TESCO OPTICIANS,RH6 0AT__000001_RH60AT,OPT,Reigate Road,Hookwood,,Horley,Surrey,RH6 0AT,Tel: 01293 894 638, - ,,,No ratings yet Rate it yourself - /Services/opticians/LeaveReview/DefaultView.aspx?id=RH6 0AT__000001_RH60AT,0,0,
Park & Brown  ,OP_5L9_2765__000001_RH149PF,OPT,32 High Street,,Billingshurst,West Sussex,,RH14 9PF,Tel: 01403 784682, - ,,,13 ratings Rate it yourself - /Services/opticians/LeaveReview/DefaultView.aspx?id=OP_5L9_2765__000001_RH149PF,,,
Graham Johnson,OP_5L6_7561__000003_KT124HL,OPT,6 Hersham Centre,Hersham Green,,Hersham,Surrey,KT12 4HL,Tel: 01932 231 470, - ,,,No ratings yet Rate it yourself - /Services/opticians/LeaveReview/DefaultView.aspx?id=OP_5L6_7561__000003_KT124HL,0,0,yes
Eye Noor Limited,OPT_KT139UQ_1,OPT,,Weybridge Eye Clinic  83 Queens Road,,Weybridge,,KT13 9UQ,, - ,,,No ratings yet Rate it yourself - /Services/opticians/LeaveReview/DefaultView.aspx?id=OPT_KT139UQ_1,0,0,
Eyesite Opticians,OP_5L6_9625__000001_KT138DL,OPT,,60 Church Street,,Weybridge,Surrey,KT13 8DL,Tel: 01932 859 889, - ,,,No ratings yet Rate it yourself - /Services/opticians/LeaveReview/DefaultView.aspx?id=OP_5L6_9625__000001_KT138DL,0,0,
Boots-Epsom - Ashley Centre (in Boots UK),KT18 5DB__000003_KT185DB,OPT,57 Ashley Centre,,,Epsom,Surrey,KT18 5DB,Tel: 01372 747605, - ,,,7 ratings Rate it yourself - /Services/opticians/LeaveReview/DefaultView.aspx?id=KT18 5DB__000003_KT185DB,,,
Vision Express (UK) Ltd,OP_5KP_12653__000002_KT185DB,OPT,,16 Ashley Centre,,Epsom,Surrey,KT18 5DB,Tel: 01372 747 422, - ,,,No ratings yet Rate it yourself - /Services/opticians/LeaveReview/DefaultView.aspx?id=OP_5KP_12653__000002_KT185DB,0,0,
Leightons Opticians & Hearing Care,OP_5KP_3838__000001_KT198EH,OPT,88 High Street,,Epsom,Surrey,,KT19 8BJ,Tel: 01372 722 656, - ,,,No ratings yet Rate it yourself - /Services/opticians/LeaveReview/DefaultView.aspx?id=OP_5KP_3838__000001_KT198EH,0,0,
Henning & Henning Opticians,OP_5L6_9057__000001_KT138DX,OPT,14 Church Street,,Weybridge,,,KT13 8DX,Tel: 01932 829 868, - ,,,No ratings yet Rate it yourself - /Services/opticians/LeaveReview/DefaultView.aspx?id=OP_5L6_9057__000001_KT138DX,0,0,
Boots-Weybridge - High St,OP_5L6_5995__000002_KT138AX,OPT,23 High Street,,,Weybridge,Surrey,KT13 8AX,Tel: 01932 842725, - ,,,No ratings yet Rate it yourself - /Services/opticians/LeaveReview/DefaultView.aspx?id=OP_5L6_5995__000002_KT138AX,0,0,
Boots Opticians,TP97E,OPT,,2 The Lane,,Addlestone,,KT15 2GN,, - ,,,1 rating Rate it yourself - /Services/opticians/LeaveReview/DefaultView.aspx?id=TP97E,,,
Addlestone Specsavers Limited,T4J9A,OPT,,84 Station Road,Addlestone,Surrey,,KT15 2AD,Tel: 01932505027, - ,,,No ratings yet Rate it yourself - /Services/opticians/LeaveReview/DefaultView.aspx?id=T4J9A,0,0,
Leightons Opticians & Hearing Care,OP_5L6_11775__000002_KT152AF,OPT,,76 Station Road,,Addlestone,Surrey,KT15 2AF,Tel: 01932 853 199, - ,,,No ratings yet Rate it yourself - /Services/opticians/LeaveReview/DefaultView.aspx?id=OP_5L6_11775__000002_KT152AF,0,0,
Boots-Horley,OP_5KQ_5319__000002_RH67AY,OPT,,18/20 High Street,,Horley,Surrey,RH6 7AY,Tel: 01293 782 668, - ,,,1 rating Rate it yourself - /Services/opticians/LeaveReview/DefaultView.aspx?id=OP_5KQ_5319__000002_RH67AY,,,
Eyeworks,OP_5KQ_3954__000001_RH11QH,OPT,66 Station Road,,Redhill,,,RH1 1PL,Tel: 01737 778 877, - ,,,No ratings yet Rate it yourself - /Services/opticians/LeaveReview/DefaultView.aspx?id=OP_5KQ_3954__000001_RH11QH,0,0,
Specsavers Opticians,TP8G1,OPT,,71 Victoria Road,,Horley,Surrey,RH6 7QH,Tel: 01293 783018, - ,,,No ratings yet Rate it yourself - /Services/opticians/LeaveReview/DefaultView.aspx?id=TP8G1,0,0,
Tesco Opticians ,KT152AS060716,OPT,,117 Station Road,,Addlestone,Surrey,KT15 2AS,Tel: 0345 601 3479, - ,,,No ratings yet Rate it yourself - /Services/opticians/LeaveReview/DefaultView.aspx?id=KT152AS060716,0,0,
Redhill Eye Studio,OP_5KQ_14661__000001_RH11SA,OPT,Redhill Opticians,51 High Street,,Redhill,Surrey,RH1 1RX,Tel: 01737 789 924, - ,,,No ratings yet Rate it yourself - /Services/opticians/LeaveReview/DefaultView.aspx?id=OP_5KQ_14661__000001_RH11SA,0,0,
Vision Express (UK) LTD,OP_5KQ_12939__000001_RH11SE,OPT,46 The Belfry,Station Road,,Redhill,Surrey,RH1 1SE,Tel: 01737 768862, - ,,,1 rating Rate it yourself - /Services/opticians/LeaveReview/DefaultView.aspx?id=OP_5KQ_12939__000001_RH11SE,,,
Specsavers Opticians,OP_5KP_8008__000001_KT198AH,OPT,,24 High Street,,Epsom,Surrey,KT19 8AH,Tel: 01372 744 250, - ,,,No ratings yet Rate it yourself - /Services/opticians/LeaveReview/DefaultView.aspx?id=OP_5KP_8008__000001_KT198AH,0,0,
Boots-Redhill - High St,RH1 1RH__000002_RH11RH,OPT,24 High Street,,,Redhill,Surrey,RH1 1RH,Tel: 01737 765 600, - ,,,No ratings yet Rate it yourself - /Services/opticians/LeaveReview/DefaultView.aspx?id=RH1 1RH__000002_RH11RH,0,0,
Boots-Redhill - High St,OP_5KQ_1510__000001_RH11RH,OPT,12 High Street,,,Redhill,Surrey,RH1 1RH,Tel: 01737 763148, - ,,,No ratings yet Rate it yourself - /Services/opticians/LeaveReview/DefaultView.aspx?id=OP_5KQ_1510__000001_RH11RH,0,0,
Golding & Maud EyeCare,L8P4W ,OPT,Broadfield Health Centre,Coachmans Drive,,Crawley,Sussex,RH11 9YZ,Tel: 01293 542049, - ,,,No ratings yet Rate it yourself - /Services/opticians/LeaveReview/DefaultView.aspx?id=L8P4W,0,0,
Specsavers Opticians,OP_5KQ_514__000002_RH11QH,OPT,1 - 2 Central Parade,London Road,,Redhill,,RH1 1LY,Tel: 01737 772990, - ,,,No ratings yet Rate it yourself - /Services/opticians/LeaveReview/DefaultView.aspx?id=OP_5KQ_514__000002_RH11QH,0,0,
Chobham Eye Clinic,Y8Z7R,OPT,,24 High Street,,Chobham,,GU24 8AA,Tel: 01276 932884, - ,,,3 ratings Rate it yourself - /Services/opticians/LeaveReview/DefaultView.aspx?id=Y8Z7R,,,
Esher Eye Centre,OP_5KP_14521__000001_KT109QJ,OPT,122 High Street,,Esher,,,KT10 9QJ,Tel: 01372 464492, - ,,,No ratings yet Rate it yourself - /Services/opticians/LeaveReview/DefaultView.aspx?id=OP_5KP_14521__000001_KT109QJ,0,0,
Specsavers Opticians,OP_5P6_OPTICIAN SPECSAVERS CRAWLEY__000001_RH101ES,OPT,Unit 4 The Martlets,,,Crawley,,RH10 1ES,Tel: 01293 560646, - ,,,No ratings yet Rate it yourself - /Services/opticians/LeaveReview/DefaultView.aspx?id=OP_5P6_OPTICIAN SPECSAVERS CRAWLEY__000001_RH101ES,0,0,
Boots Opticians,OPT_RH101FX_1,OPT,,3 County Mall,,Crawley,,RH10 1FX,, - ,,,No ratings yet Rate it yourself - /Services/opticians/LeaveReview/DefaultView.aspx?id=OPT_RH101FX_1,0,0,
Boots-Crawley - County Mall,OP_5MA_12798__000002_RH101FX,OPT,3 County Mall,,Crawley,West Sussex,,RH10 1FX,Tel: 01293 524566, - ,,,No ratings yet Rate it yourself - /Services/opticians/LeaveReview/DefaultView.aspx?id=OP_5MA_12798__000002_RH101FX,0,0,
Vision Express,OP_5P6_OPTICIAN VISION EXPRESS CRAWLEY__000002_RH1,OPT,"Unit 40, County Mall",,,Crawley,West Sussex,RH10 1FF,Tel: 01293 618686, - ,,,5 ratings Rate it yourself - /Services/opticians/LeaveReview/DefaultView.aspx?id=OP_5P6_OPTICIAN VISION EXPRESS CRAWLEY__000002_RH1,,,
Optical Centre,OP_5L7_8334__000002_GU125AZ,OPT,5 The Parade,Wharf Road,Ash Vale,,,GU12 5AZ,Tel: 01252 314 332, - ,,,1 rating Rate it yourself - /Services/opticians/LeaveReview/DefaultView.aspx?id=OP_5L7_8334__000002_GU125AZ,,,
SeeAbility Ltd,CO-4941,OPT,,Newplan House,,Surrey,,KT17 1BL,, - ,,,No ratings yet Rate it yourself - /Services/opticians/LeaveReview/DefaultView.aspx?id=CO-4941,0,0,
Specsavers,OP_5L6_14625__000001_KT101BY,OPT,22 High Street,22 High Street,Walton-on-Thames,Surrey,,KT10 1DA,Tel: 01932 251 960, - ,,,No ratings yet Rate it yourself - /Services/opticians/LeaveReview/DefaultView.aspx?id=OP_5L6_14625__000001_KT101BY,0,0,
Visioncare,OP_5KP_849__000002_KT109RL,OPT,,17 High Street,,Esher,Surrey,KT10 9RL,Tel: 01372 462 401, - ,,,No ratings yet Rate it yourself - /Services/opticians/LeaveReview/DefaultView.aspx?id=OP_5KP_849__000002_KT109RL,0,0,
Haig Brown Opticians,OP_5KP_1837__000001_KT109PJ,OPT,Fairoak,Portsmouth Road,Esher,,,KT10 9PJ,Tel: 01372 466 762, - ,,,1 rating Rate it yourself - /Services/opticians/LeaveReview/DefaultView.aspx?id=OP_5KP_1837__000001_KT109PJ,,,
Specsavers Opticians,TP9GG,OPT,,Sainsburys,Kiln Lane,Epsom,Surrey,KT17 1EQ,Tel: 01372 677928, - ,,,No ratings yet Rate it yourself - /Services/opticians/LeaveReview/DefaultView.aspx?id=TP9GG,0,0,
R. Stone Opticians,OP_5L6_4153__000001_KT121BY,OPT,52 High Street,,,Walton-on-Thames,,KT12 1BY,Tel: 01932 225 076, - ,,,No ratings yet Rate it yourself - /Services/opticians/LeaveReview/DefaultView.aspx?id=OP_5L6_4153__000001_KT121BY,0,0,
Tesco Opticians,10001__000002_RH101GY,OPT,Hazelwick Avenue,,Crawley,West Sussex,,RH10 1GY,Tel: 0345 677 9179, - ,,,No ratings yet Rate it yourself - /Services/opticians/LeaveReview/DefaultView.aspx?id=10001__000002_RH101GY,0,0,
VISION EXPRESS (UK) LTD,KT12 1GH__000001_KT121GH,OPT,Unit 31 Heart Shopping Centre,New Zealand Avenue,,Walton On Thames,Surrey,KT12 1GH,Tel: 01932 254270, - ,,,No ratings yet Rate it yourself - /Services/opticians/LeaveReview/DefaultView.aspx?id=KT12 1GH__000001_KT121GH,0,0,
Boots Opticians,OPT_KT121DG_1,OPT,,25 High Street,,Walton-On-Thames,,KT12 1DG,, - ,,,No ratings yet Rate it yourself - /Services/opticians/LeaveReview/DefaultView.aspx?id=OPT_KT121DG_1,0,0,
Batemans (Opticians) Ltd,OP_5L6_5171__000001_KT122QS,OPT,,6 Church Street,,Walton-on-Thames,Surrey,KT12 2QS,Tel: 01932 221 524, - ,,,No ratings yet Rate it yourself - /Services/opticians/LeaveReview/DefaultView.aspx?id=OP_5L6_5171__000001_KT122QS,0,0,
Eyeworks ,OP_5L6_14622__000001_KT122QP,OPT,1 Church Street,Walton-on-Thames,Surrey,Surrey,,KT12 2QP,Tel: 01932 244 266, - ,,,No ratings yet Rate it yourself - /Services/opticians/LeaveReview/DefaultView.aspx?id=OP_5L6_14622__000001_KT122QP,0,0,
The Optical Gallery (Chessington),OP_5A5_5843__000001_KT91NU,OPT,340 Hook Road,Chessington,,Surrey,,KT9 1NU,Tel: 0208 391 0900, - ,,,No ratings yet Rate it yourself - /Services/opticians/LeaveReview/DefaultView.aspx?id=OP_5A5_5843__000001_KT91NU,0,0,
Batemans  Opticians Ltd,OP_5L5_5818__000002_GU272LA,OPT,68 High Street,,,Haslemere,Surrey,GU27 2LA,Tel: 01428 642 224, - ,,,No ratings yet Rate it yourself - /Services/opticians/LeaveReview/DefaultView.aspx?id=OP_5L5_5818__000002_GU272LA,0,0,
Chandlers Eyecare,M4G1X,OPT,2 Charter Walk,West Street,,Haslemere,Surrey,GU27 2AD,Tel: 01428 652 512, - ,,,No ratings yet Rate it yourself - /Services/opticians/LeaveReview/DefaultView.aspx?id=M4G1X,0,0,
Venturi Optics Limited,3928,OPT,,5 Petworth Road,,Haslemere,,GU27 2JB,, - ,,,No ratings yet Rate it yourself - /Services/opticians/LeaveReview/DefaultView.aspx?id=3928,0,0,
Venturi Optics Limited,OPT_GU272JB_1,OPT,,5 Petworth Road,,Haslemere,,GU27 2JB,, - ,,,No ratings yet Rate it yourself - /Services/opticians/LeaveReview/DefaultView.aspx?id=OPT_GU272JB_1,0,0,
Bayfields Opticians & Audiologists,X3N3Z,OPT,68 High Street,,Ewell,Surrey,,KT17 1RL,Tel: 020 8393 7711, - ,,,No ratings yet Rate it yourself - /Services/opticians/LeaveReview/DefaultView.aspx?id=X3N3Z,0,0,