Organisation Name,NACS Code,Organisation Type,Address1,Address2,Address3,Address4,Address5,PostCode,Telephone Number,Opening time,Value  (Opening time),Banding Classification  (Opening time),NHS.UK users rating,Value  (NHS.UK users rating),Banding Classification  (NHS.UK users rating),Car parking (Is there car parking at this organisation?)
D W Roberts,OP_5AC_9161__000001_NN126BT,OPT,6 Sponne House Shopping Centre,,Towcester,,,NN12 6BY,Tel: 01327 350240, - ,,,No ratings yet Rate it yourself - /Services/opticians/LeaveReview/DefaultView.aspx?id=OP_5AC_9161__000001_NN126BT,0,0,
John Carrington,OP_5AC_11760__000002_NN127BT,OPT,215 - 217 Watling Street,,,Towcester,,NN12 6BX,Tel: 01327 351998, - ,,,No ratings yet Rate it yourself - /Services/opticians/LeaveReview/DefaultView.aspx?id=OP_5AC_11760__000002_NN127BT,0,0,
D W Roberts Optometrists,OP_5CQ_435__000001_MK111AF,OPT,16 High Street,Stony Stratford,,Buckinghamshire,,MK11 1AF,Tel: 01908 562355, - ,,,No ratings yet Rate it yourself - /Services/opticians/LeaveReview/DefaultView.aspx?id=OP_5CQ_435__000001_MK111AF,0,0,
Lesley A Arkin Optometrist,OP_5CQ_9939__000001_MK111BY,OPT,7 Cofferidge Close,Stony Stratford,Milton Keynes,,,MK11 1BY,Tel: 01908 567672, - ,,,No ratings yet Rate it yourself - /Services/opticians/LeaveReview/DefaultView.aspx?id=OP_5CQ_9939__000001_MK111BY,0,0,
D W Roberts Optometrists,OP_5CQ_8647__000002_MK125DG,OPT,17 The Square,Wolverton,Milton Keynes,,,MK12 5DG,Tel: 01908 313338, - ,,,2 ratings Rate it yourself - /Services/opticians/LeaveReview/DefaultView.aspx?id=OP_5CQ_8647__000002_MK125DG,,,
T J Lodge,OP_5CQ_2956__000001_MK125DQ,OPT,13 The Square,Wolverton,Milton Keynes,,,MK12 5DQ,Tel: 01908 312130, - ,,,No ratings yet Rate it yourself - /Services/opticians/LeaveReview/DefaultView.aspx?id=OP_5CQ_2956__000001_MK125DQ,0,0,
Vision Express,OLOL/C030435QD__000004_MK181RS,OPT,,7 Meadow Walk,,Buckingham,Buckinghamshire,MK18 1RS,Tel: 01280 822204, - ,,,No ratings yet Rate it yourself - /Services/opticians/LeaveReview/DefaultView.aspx?id=OLOL/C030435QD__000004_MK181RS,0,0,
Specsavers  Buckingham,S0D4U,OPT,,11 Market Square,,Buckingham,Buckinghamshire,MK18 1NW,Tel: 01280 733081, - ,,,No ratings yet Rate it yourself - /Services/opticians/LeaveReview/DefaultView.aspx?id=S0D4U,0,0,
Specsavers Buckingham,S0D4U,OPT,,11 Market Square,,Buckingham,Buckinghamshire,MK18 1NW,Tel: 01280 733081, - ,,,No ratings yet Rate it yourself - /Services/opticians/LeaveReview/DefaultView.aspx?id=S0D4U,0,0,
Boots-Buckingham,OP_5DP_8514__000001_MK181NW,OPT,13 Market Square,,,Buckingham,Buckinghamshire,MK18 1NW,Tel: 01280 812166, - ,,,No ratings yet Rate it yourself - /Services/opticians/LeaveReview/DefaultView.aspx?id=OP_5DP_8514__000001_MK181NW,0,0,
S H Harrold (1937) Ltd,OP_5DP_2786__000001_MK181EL,OPT,3 Bridge Street,,,Buckingham,Buckinghamshire,MK18 1EL,Tel: 01280 813496, - ,,,No ratings yet Rate it yourself - /Services/opticians/LeaveReview/DefaultView.aspx?id=OP_5DP_2786__000001_MK181EL,0,0,
Wootton Opticians,OP_5LW_NN46FF__000002_NN46FF,OPT,"9 Tudor Court, Wootton Hope Drive",Wootton Fields,Northampton,Northamptonshire,,NN4 6FF,Tel: 01604 875111, - ,,,No ratings yet Rate it yourself - /Services/opticians/LeaveReview/DefaultView.aspx?id=OP_5LW_NN46FF__000002_NN46FF,0,0,
Mark Darling Opticians,OP_5LW _NN49DL__000001_NN49DL,OPT,29 St Leonards Road,Far Cotton,Northampton,Northamptonshire,,NN4 8DL,Tel: 01604 765855, - ,,,No ratings yet Rate it yourself - /Services/opticians/LeaveReview/DefaultView.aspx?id=OP_5LW _NN49DL__000001_NN49DL,0,0,
Specsavers Ltd,OP_5CQ_13331__000001_MK93AG,OPT,35-37 Silbury Arcade,,Central Milton Keynes,Buckinghamshire,,MK9 3AG,Tel: 01908 662 116, - ,,,No ratings yet Rate it yourself - /Services/opticians/LeaveReview/DefaultView.aspx?id=OP_5CQ_13331__000001_MK93AG,0,0,
Vision Express (UK) Ltd,OP_5CQ_2901__000001_MK93ES,OPT,18 Midsummer Arcade,,Milton Keynes,Buckinghamshire,,MK9 3ES,Tel: 01908 672 267, - ,,,No ratings yet Rate it yourself - /Services/opticians/LeaveReview/DefaultView.aspx?id=OP_5CQ_2901__000001_MK93ES,0,0,
Boots-Milton Keynes - Crown Walk,OP_5CQ_7002__000003_MK93AH,OPT,18 Crown Walk,,,Milton Keynes,Buckinghamshire,MK9 3AH,Tel: 01908 606618, - ,,,No ratings yet Rate it yourself - /Services/opticians/LeaveReview/DefaultView.aspx?id=OP_5CQ_7002__000003_MK93AH,0,0,
Boots-Milton Keynes - Midsummer Arcade,OP_5CQ_1888__000002_MK93BB,OPT,30 Midsummer Arcade,,,Central Milton Keynes,Buckinghamshire,MK9 3BB,Tel: 01908 234757, - ,,,No ratings yet Rate it yourself - /Services/opticians/LeaveReview/DefaultView.aspx?id=OP_5CQ_1888__000002_MK93BB,0,0,
Melson Wingate Ltd(Scrivens),OP_5CQ_11119__000001_MK93BA,OPT,172 Midsummer Arcade,,,Milton Keynes,Northamptonshire,MK9 3BA,Tel: 01908 606520, - ,,,No ratings yet Rate it yourself - /Services/opticians/LeaveReview/DefaultView.aspx?id=OP_5CQ_11119__000001_MK93BA,0,0,
Home Eyetest Ltd,OP_MK158PL_46766,OPT,,18 Lacy Drive,Bolbeck Park,Milton Keynes,Buckinghamshire,MK15 8PL,Tel: 01908 465611, - ,,,No ratings yet Rate it yourself - /Services/opticians/LeaveReview/DefaultView.aspx?id=OP_MK158PL_46766,0,0,
Clearsight Opticians,OP_5CQ_7471__000002_MK44DD,OPT,11 Barnsdale Drive,Westcroft,Milton Keynes,Milton Keynes,,MK4 4DD,Tel: 01908 504740, - ,,,10 ratings Rate it yourself - /Services/opticians/LeaveReview/DefaultView.aspx?id=OP_5CQ_7471__000002_MK44DD,,,
Chec Northampton,C5U5V,OPT,,Units 1A & 1B Sol,,Northampton,Northamptonshire,NN1 1SR,Tel: 0330 100 4730, - ,,,27 ratings Rate it yourself - /Services/opticians/LeaveReview/DefaultView.aspx?id=C5U5V,,,
Eyeclinic of Northampton,EYECLINIC__000001_NN11RS,OPT,24 Gold Street,,Northampton,Northamptonshire,,NN1 1RS,Tel: 01604 624723, - ,,,No ratings yet Rate it yourself - /Services/opticians/LeaveReview/DefaultView.aspx?id=EYECLINIC__000001_NN11RS,0,0,
Eye to Eye Opticians,OP_5LW_7343__000001_NN15BD,OPT,Northampton General Hospital NHS Trust,,Northampton,Northamptonshire,,NN1 5BD,Tel: 01604 545722, - ,,,No ratings yet Rate it yourself - /Services/opticians/LeaveReview/DefaultView.aspx?id=OP_5LW_7343__000001_NN15BD,0,0,
Mode Designer Eyewear,OP_5LW_NN11JW__000001_NN11JW,OPT,38 St Giles Street,,Northampton,Northamptonshire,,NN1 1JW,Tel: 01604 632600, - ,,,No ratings yet Rate it yourself - /Services/opticians/LeaveReview/DefaultView.aspx?id=OP_5LW_NN11JW__000001_NN11JW,0,0,
Boots-Northampton - The Parade,OP_5LW_563__000002_NN12BY,OPT,9 The Parade,,,Northampton,Northamptonshire,NN1 2BY,Tel: 01604 627781, - ,,,1 rating Rate it yourself - /Services/opticians/LeaveReview/DefaultView.aspx?id=OP_5LW_563__000002_NN12BY,,,
Vision Express Ltd,OP_5LW_265__000001_NN12EL,OPT,29-31 Princes Walk,Grosvenor Centre,Northampton,,,NN1 2EL,Tel: 01604 601366, - ,,,No ratings yet Rate it yourself - /Services/opticians/LeaveReview/DefaultView.aspx?id=OP_5LW_265__000001_NN12EL,0,0,
Punch Opticians,OP_5LW_1354__000002_NN56JF,OPT,42 Main Road,Duston,Northampton,,,NN5 6JF,Tel: 01604 758587, - ,,,1 rating Rate it yourself - /Services/opticians/LeaveReview/DefaultView.aspx?id=OP_5LW_1354__000002_NN56JF,,,
Specsavers,OP_5LW_1800__000001_NN12AD,OPT,50-52 Abington Street,,Northampton,,,NN1 2AP,Tel: 01604 604996, - ,,,No ratings yet Rate it yourself - /Services/opticians/LeaveReview/DefaultView.aspx?id=OP_5LW_1800__000001_NN12AD,0,0,
Inter Eyecare Optometrists,OP_5LW_12867__000001_NN12ER,OPT,20 The Friary,Grosvenor Centre,Northampton,,,NN1 2ER,Tel: 01604 602330, - ,,,No ratings yet Rate it yourself - /Services/opticians/LeaveReview/DefaultView.aspx?id=OP_5LW_12867__000001_NN12ER,0,0,
Optical Express,NN1 2BN_33345,OPT,Aquila House,St Giles Terrace,,Northampton,Northamptonshire,NN1 2BN,Tel: 0800 023 2020, - ,,,No ratings yet Rate it yourself - /Services/opticians/LeaveReview/DefaultView.aspx?id=NN1 2BN_33345,0,0,
3N Vision Centre,OP_5LW_NN55EZ__000002_NN55EZ,OPT,22 Spencer Bridge Road,,Northampton,Northamptonshire,,NN5 5EZ,Tel: 01604 753399, - ,,,No ratings yet Rate it yourself - /Services/opticians/LeaveReview/DefaultView.aspx?id=OP_5LW_NN55EZ__000002_NN55EZ,0,0,
Heron Opticians,OP_5CQ_1791__000002_MK168HE,OPT,56 High Street,Newport,Pagnell,Buckinghamshire,,MK16 8AQ,Tel: 01908 216477, - ,,,3 ratings Rate it yourself - /Services/opticians/LeaveReview/DefaultView.aspx?id=OP_5CQ_1791__000002_MK168HE,,,
Boots-Northampton - Abington St,OP_5LW_1076__000001_NN12BH,OPT,73a Abington Street,,Northampton,Northampton,,NN1 2BH,Tel: 01604 636864, - ,,,No ratings yet Rate it yourself - /Services/opticians/LeaveReview/DefaultView.aspx?id=OP_5LW_1076__000001_NN12BH,0,0,
SHEINMAN OPTICIANS,OP_5LW_2934__000001_NN12BP,OPT,Turville House,106-110 Abington Street,Northampton,,,NN1 2BP,Tel: 01604 626161, - ,,,No ratings yet Rate it yourself - /Services/opticians/LeaveReview/DefaultView.aspx?id=OP_5LW_2934__000001_NN12BP,0,0,
D W Roberts Optometrists,OP_5CQ_4166__000001_MK168HE,OPT,3 St. John Street,,Newport Pagnell,,,MK16 8HE,Tel: 01908 218121, - ,,,1 rating Rate it yourself - /Services/opticians/LeaveReview/DefaultView.aspx?id=OP_5CQ_4166__000001_MK168HE,,,
Dollond & Aitchison,OP_5CQ_2589__000001_MK168AR,OPT,31 High Street,,Newport Pagnell,,,MK16 8AR,Tel: 01908 610303, - ,,,No ratings yet Rate it yourself - /Services/opticians/LeaveReview/DefaultView.aspx?id=OP_5CQ_2589__000001_MK168AR,0,0,
Walford & Round Opticians,OP_5DV_4565__000001_NN136AU,OPT,4 Banbury Road,,Brackley,,,NN13 6AU,Tel: 01280 702338, - ,,,No ratings yet Rate it yourself - /Services/opticians/LeaveReview/DefaultView.aspx?id=OP_5DV_4565__000001_NN136AU,0,0,
Elite Eyecare,122260,OPT,,"182 Kettering Road, ",,Abington,,NN1 4BH,, - ,,,No ratings yet Rate it yourself - /Services/opticians/LeaveReview/DefaultView.aspx?id=122260,0,0,
"Tompkins, Knight & Son Optometrists",OP_5LW_6548__000001_NN27BL,OPT,Chichele House,42 Kingsley Road,Northampton,,,NN2 7BL,Tel: 01604 714413, - ,,,1 rating Rate it yourself - /Services/opticians/LeaveReview/DefaultView.aspx?id=OP_5LW_6548__000001_NN27BL,,,
Abington Eye Care Opticians,OP_5LW_1821__000002_NN32JG,OPT,Abington Health Complex,Beech Avenue,Northampton,Northampton,,NN3 2JG,Tel: 01604 791977, - ,,,No ratings yet Rate it yourself - /Services/opticians/LeaveReview/DefaultView.aspx?id=OP_5LW_1821__000002_NN32JG,0,0,yes
Greens Opticians,OP_5LW_12868__000002_NN27AZ,OPT,18 Harborough Road,Kingsthorpe,Northampton,,,NN2 7AZ,Tel: 01604 715721, - ,,,No ratings yet Rate it yourself - /Services/opticians/LeaveReview/DefaultView.aspx?id=OP_5LW_12868__000002_NN27AZ,0,0,
Punch Opticians,OP_5CQ_9607__000001_MK464AJ,OPT,27 Market Place,,Olney,,,MK46 4AJ,Tel: 01234 712860, - ,,,No ratings yet Rate it yourself - /Services/opticians/LeaveReview/DefaultView.aspx?id=OP_5CQ_9607__000001_MK464AJ,0,0,
Kingsthorpe Eyecare,EYECHECK__000004_NN27BD,OPT,4 Kingsthorpe Centre,Harborough Road,Northampton,,,NN2 7BD,Tel: 01604 716000, - ,,,3 ratings Rate it yourself - /Services/opticians/LeaveReview/DefaultView.aspx?id=EYECHECK__000004_NN27BD,,,
DAVIS Optometrists,OP_5CQ_14974__000001_MK464BE,OPT,58 High Street,,,Olney,Buckinghamshire,MK46 4BE,Tel: 01234 712500, - ,,,No ratings yet Rate it yourself - /Services/opticians/LeaveReview/DefaultView.aspx?id=OP_5CQ_14974__000001_MK464BE,0,0,
Boots-Northampton - Harborough Rd,OP_5LW_7211__000001_NN27SH,OPT,63 Harborough Road,,,Kingsthorpe Centre,Northamptonshire,NN2 7SH,Tel: 01604 720 121, - ,,,No ratings yet Rate it yourself - /Services/opticians/LeaveReview/DefaultView.aspx?id=OP_5LW_7211__000001_NN27SH,0,0,
Brian Clark,OP_5DP_3224__000001_MK183HB,OPT,42 High Street,Winslow,Buckingham,,,MK18 3HB,Tel: 01296 712043, - ,,,No ratings yet Rate it yourself - /Services/opticians/LeaveReview/DefaultView.aspx?id=OP_5DP_3224__000001_MK183HB,0,0,
Asda Opticians,OPT_MK1 1SR,OPT,,BLETCHAM WAY,BLETCHLEY,MILTON KEYNES,,MK1 1SR,Tel: 01908 362 520, - ,,,1 rating Rate it yourself - /Services/opticians/LeaveReview/DefaultView.aspx?id=OPT_MK1 1SR,,,
Burgess & Lewis Opticians,OP_5LW_5104__000002_NN27SL,OPT,7 Alexandra Terrace,Kingsthorpe,Northampton,,,NN2 7SJ,Tel: 01604 792930, - ,,,No ratings yet Rate it yourself - /Services/opticians/LeaveReview/DefaultView.aspx?id=OP_5LW_5104__000002_NN27SL,0,0,
Boots-Northampton - Weston Favell,OP_5LW_2967__000003_NN38JZ,OPT,10 Weston Favell Centre,,,Northampton,Northamptonshire,NN3 8JZ,Tel: 01604 411 776, - ,,,No ratings yet Rate it yourself - /Services/opticians/LeaveReview/DefaultView.aspx?id=OP_5LW_2967__000003_NN38JZ,0,0,
Tesco Opticians,OP_5LW_498__000002_NN38JZ,OPT,Tesco Extra 3377,12 Weston Favell Centre,,Northampton,Northamptonshire,NN3 8JZ,Tel: 01604 529838, - ,,,No ratings yet Rate it yourself - /Services/opticians/LeaveReview/DefaultView.aspx?id=OP_5LW_498__000002_NN38JZ,0,0,
Boots-Bletchley,OP_5CQ_6564__000001_MK22HE,OPT,4 The Concourse,Brunel Centre,,Bletchley,,MK2 2HE,Tel: 01908 270247, - ,,,No ratings yet Rate it yourself - /Services/opticians/LeaveReview/DefaultView.aspx?id=OP_5CQ_6564__000001_MK22HE,0,0,
D W Roberts Optometrists,OP_5CQ_8648__000001_MK22DR,OPT,63 Queensway,Bletchley,Milton Keynes,,,MK2 2DR,Tel: 01908 373131, - ,,,No ratings yet Rate it yourself - /Services/opticians/LeaveReview/DefaultView.aspx?id=OP_5CQ_8648__000001_MK22DR,0,0,
Costco Wholesale UK Ltd,CO-1833-13,OPT,,Mandeville Drive,Kingston,Milton Keynes,,MK10 0DB,Tel: 01908 285 035, - ,,,No ratings yet Rate it yourself - /Services/opticians/LeaveReview/DefaultView.aspx?id=CO-1833-13,0,0,
Specsavers Opticians,OP_5CQ_7450__000001_MK22RU,OPT,110 Queensway,Bletchley,Milton Keynes,,,MK2 2RU,Tel: 01908 365533, - ,,,2 ratings Rate it yourself - /Services/opticians/LeaveReview/DefaultView.aspx?id=OP_5CQ_7450__000001_MK22RU,,,
Tesco Opticians,OP_5CQ_14312__000002_MK100AH,OPT,1 Winchester Circle,,Kingston Centre,Milton Keynes,,MK10 0AH,Tel: 0345 601 3479, - ,,,No ratings yet Rate it yourself - /Services/opticians/LeaveReview/DefaultView.aspx?id=OP_5CQ_14312__000002_MK100AH,0,0,
Boots-Milton Keynes - Winchester Circle,OP_5CQ_13332__000001_MK100BA,OPT,32 Winchester Circle,Kingston Centre,,Milton Keynes,Buckinghamshire,MK10 0BA,Tel: 01908 281 221, - ,,,No ratings yet Rate it yourself - /Services/opticians/LeaveReview/DefaultView.aspx?id=OP_5CQ_13332__000001_MK100BA,0,0,
The Contact Lens Clinic,OP_5CQ_14311__000002_MK22EH,OPT,233 Queensway,,Bletchley,,,MK2 2EH,Tel: 01908 366882, - ,,,No ratings yet Rate it yourself - /Services/opticians/LeaveReview/DefaultView.aspx?id=OP_5CQ_14311__000002_MK22EH,0,0,
T J Lodge,OP_5CQ_2684__000001_MK22BA,OPT,58-60 Aylesbury Street,,Fenny Stratford,,,MK2 2BA,Tel: 01908 648565, - ,,,No ratings yet Rate it yourself - /Services/opticians/LeaveReview/DefaultView.aspx?id=OP_5CQ_2684__000001_MK22BA,0,0,
Specsavers,OP_5AC_8542__000003_NN114DR,OPT,The Regal Centre,Bowen Square,Daventry,,,NN11 4DR,Tel: 01327 879566, - ,,,No ratings yet Rate it yourself - /Services/opticians/LeaveReview/DefaultView.aspx?id=OP_5AC_8542__000003_NN114DR,0,0,
Haywards Opticians,OP_5AC_3479__000002_NN114DR,OPT,14 Bowen Square,,Daventry,,,NN11 4DR,Tel: 01327 703830, - ,,,No ratings yet Rate it yourself - /Services/opticians/LeaveReview/DefaultView.aspx?id=OP_5AC_3479__000002_NN114DR,0,0,
Anstee & Proctor,OP_5AC_8941__000001_NN114AA,OPT,47 Sheaf Street,,Daventry,,,NN11 4AA,Tel: 01327 702289, - ,,,No ratings yet Rate it yourself - /Services/opticians/LeaveReview/DefaultView.aspx?id=OP_5AC_8941__000001_NN114AA,0,0,
Eye to Eye Opticians,COL/CO-6890/5PD__000001_NN60ND,OPT,58 Broad Street,Earls Barton,Northampton,Northamptonshire,,NN6 0ND,Tel: 01604 810777, - ,,,1 rating Rate it yourself - /Services/opticians/LeaveReview/DefaultView.aspx?id=COL/CO-6890/5PD__000001_NN60ND,,,
T J Lodge,OLCO25455CQ__000001_MK178RQ,OPT,9a High Street,Woburn Sands,Milton Keynes,Buckinghamshire,,MK17 8RQ,Tel: 01908 281133, - ,,,No ratings yet Rate it yourself - /Services/opticians/LeaveReview/DefaultView.aspx?id=OLCO25455CQ__000001_MK178RQ,0,0,
M&S Opticians (Banbury),F7M6Y,OPT,,"M&S, Unit 11 Gateway Retail Park",Banbury,Oxfordshire,,OX16 3ER,Tel: 0129 523 4570, - ,,,No ratings yet Rate it yourself - /Services/opticians/LeaveReview/DefaultView.aspx?id=F7M6Y,0,0,
Dove & Conway Opticians,SM 009 / 4060 / 5QE,OPT,,100 Sheep Street,,Bicester,Oxfordshire,OX26 6LP,Tel: 01869 242740, - ,,,No ratings yet Rate it yourself - /Services/opticians/LeaveReview/DefaultView.aspx?id=SM 009 / 4060 / 5QE,0,0,
Dray's Eyecare,OLCO30425QE__000002_OX169YJ,OPT,,81 Chatsworth Drive,Cherwell Heights,Banbury,Oxfordshire,OX16 9YJ,Tel: 01295 261080, - ,,,5 ratings Rate it yourself - /Services/opticians/LeaveReview/DefaultView.aspx?id=OLCO30425QE__000002_OX169YJ,,,yes
Vision Express,VISIONEXPRESSBICESTER1,OPT,,47 Sheep Street,,Bicester,,OX26 6JJ,Tel: 01869 327035, - ,,,No ratings yet Rate it yourself - /Services/opticians/LeaveReview/DefaultView.aspx?id=VISIONEXPRESSBICESTER1,0,0,
Robert Stanley Opticians,ROBERTSTANLEYOPTICIANS1,OPT,,Unit EY4 Pioneer Square,Bure Place,Bicester,Oxfordshire,OX26 6FA,Tel: 01869 360557, - ,,,No ratings yet Rate it yourself - /Services/opticians/LeaveReview/DefaultView.aspx?id=ROBERTSTANLEYOPTICIANS1,0,0,
Specsavers,SPECSAVERSBANBURY1,OPT,,29-31 Bridge Street,,Banbury,,OX16 5PN,Tel: 01295 251251, - ,,,No ratings yet Rate it yourself - /Services/opticians/LeaveReview/DefaultView.aspx?id=SPECSAVERSBANBURY1,0,0,
Specsavers Opticians,OP_5DT_11808__000001_OX67HY,OPT,,26 Sheep Street,,Bicester,Oxfordshire,OX26 6JF,Tel: 01869 321422, - ,,,No ratings yet Rate it yourself - /Services/opticians/LeaveReview/DefaultView.aspx?id=OP_5DT_11808__000001_OX67HY,0,0,yes
Scrivens ,OP_5DT_9615__000001_OX266JF,OPT,Scrivens Opticians and Hearing Care,21 Sheep Street,,Bicester,Oxfordshire,OX26 6JF,Tel: 01869 253577, - ,,,No ratings yet Rate it yourself - /Services/opticians/LeaveReview/DefaultView.aspx?id=OP_5DT_9615__000001_OX266JF,0,0,
Boots-Bicester,OP_5DT_1929__000003_OX67HY,OPT,,Unit 6 Crown Walk,,Bicester,Oxfordshire,OX26 6HY,Tel: 01869 320027, - ,,,1 rating Rate it yourself - /Services/opticians/LeaveReview/DefaultView.aspx?id=OP_5DT_1929__000003_OX67HY,,,
Boots-Banbury,BOOTSOPTICIANBANBURY1,OPT,,19 Castle Quay,,Banbury,,OX16 5UH,Tel: 01295 262557, - ,,,No ratings yet Rate it yourself - /Services/opticians/LeaveReview/DefaultView.aspx?id=BOOTSOPTICIANBANBURY1,0,0,
Vision Express,VISIONEXPRESSBANBURY1,OPT,,"Unit 8,  Castle Centre",,Banbury,,OX16 8UH,Tel: 01295 709006, - ,,,No ratings yet Rate it yourself - /Services/opticians/LeaveReview/DefaultView.aspx?id=VISIONEXPRESSBANBURY1,0,0,
S H Harrold Ltd,OP_5DV_118__000001_OX165JE,OPT,92 High Street,,,Banbury,,OX16 5JE,Tel: 01295 266326, - ,,,No ratings yet Rate it yourself - /Services/opticians/LeaveReview/DefaultView.aspx?id=OP_5DV_118__000001_OX165JE,0,0,
Scrivens inc Melson Wingate,OP_5DT_10799__000001_OX165JJ,OPT,,5 High Street,,Banbury,Oxfordshire,OX16 5DZ,Tel: 01295 262 882, - ,,,No ratings yet Rate it yourself - /Services/opticians/LeaveReview/DefaultView.aspx?id=OP_5DT_10799__000001_OX165JJ,0,0,
Complete Eyecare,SPECSEXPRESS1,OPT,,13 High Street,,Banbury,Oxfordshire,OX16 5EE,Tel: 01295 262200, - ,,,No ratings yet Rate it yourself - /Services/opticians/LeaveReview/DefaultView.aspx?id=SPECSEXPRESS1,0,0,
Peepers Opticians,OP_5DV_3830__000001_OX165ER,OPT,,54 High Street,,Banbury,Oxfordshire,OX16 5JJ,Tel: 01295 262219, - ,,,No ratings yet Rate it yourself - /Services/opticians/LeaveReview/DefaultView.aspx?id=OP_5DV_3830__000001_OX165ER,0,0,
Walford & Round,OP_5DV_3485__000001_OX165LA,OPT,47 High Street,,,Banbury,,OX16 5LA,Tel: 01295 262501, - ,,,No ratings yet Rate it yourself - /Services/opticians/LeaveReview/DefaultView.aspx?id=OP_5DV_3485__000001_OX165LA,0,0,
Horton General Hospital,OP_5DV_3501__000001_OX169AL,OPT,Oxford Road,,Banbury,,,OX16 9AL,Tel: 01295 275500, - ,,,No ratings yet Rate it yourself - /Services/opticians/LeaveReview/DefaultView.aspx?id=OP_5DV_3501__000001_OX169AL,0,0,
Halsey & Parkinson Opticians,OP_5LV_5103__000001_NN81BL,OPT,2a Sheep Street,,,Wellingborough,Northamptonshire,NN8 1BL,Tel: 01933 224488, - ,,,No ratings yet Rate it yourself - /Services/opticians/LeaveReview/DefaultView.aspx?id=OP_5LV_5103__000001_NN81BL,0,0,
Specsavers,OP_5LV_656__000001_NN81EY,OPT,26 Spring Lane,Swansgate Shopping Centre,Wellingborough,,,NN8 1EY,Tel: 01933 228600, - ,,,No ratings yet Rate it yourself - /Services/opticians/LeaveReview/DefaultView.aspx?id=OP_5LV_656__000001_NN81EY,0,0,
Boots-Wellingborough - Swansgate Centre,OP_5LV_4626__000001_NN81HA,OPT,Unit 41,Swansgate Shopping Centre,23 Spring Lane,Wellingborough,,NN8 1EY,Tel: 01933 222539, - ,,,2 ratings Rate it yourself - /Services/opticians/LeaveReview/DefaultView.aspx?id=OP_5LV_4626__000001_NN81HA,,,
Boots-Wellingborough - Corn Lane,OP_5LV_2140__000002_NN81EY,OPT,73-76 Corn Lane,,,Wellingborough,Northamptonshire,NN8 1EZ,Tel: 01933 273334, - ,,,No ratings yet Rate it yourself - /Services/opticians/LeaveReview/DefaultView.aspx?id=OP_5LV_2140__000002_NN81EY,0,0,
BLINK,OP_5LV_3402__000001_NN81AT,OPT,20 Market Street,,Wellingborough,,,NN8 1AT,Tel: 01933 279203, - ,,,No ratings yet Rate it yourself - /Services/opticians/LeaveReview/DefaultView.aspx?id=OP_5LV_3402__000001_NN81AT,0,0,
Specsavers Opticians,OP_5GE___000001_LU71DH,OPT,18 Waterborne Walk,,Leighton Buzzard,Beds,,LU7 1DH,Tel: 01525 219030, - ,,,No ratings yet Rate it yourself - /Services/opticians/LeaveReview/DefaultView.aspx?id=OP_5GE___000001_LU71DH,0,0,
Juma Opticians,OP_5P2_18__000002_LU71DN,OPT,3 High Street,,Leighton Buzzard,Bedfordshire,,LU7 1DN,, - ,,,No ratings yet Rate it yourself - /Services/opticians/LeaveReview/DefaultView.aspx?id=OP_5P2_18__000002_LU71DN,0,0,
D King Opticians ,OP_5GE_9067__000001_LU77EN,OPT,,2 North Street,,Leighton Buzzard,,LU7 1EN,Tel: 01525 850312, - ,,,No ratings yet Rate it yourself - /Services/opticians/LeaveReview/DefaultView.aspx?id=OP_5GE_9067__000001_LU77EN,0,0,
Brian Clark Opticians,OP_5GE_2973__000001_LU77EA,OPT,38 High Street,,Leighton Buzzard,Beds,,LU7 7EA,Tel: 01525 372238, - ,,,No ratings yet Rate it yourself - /Services/opticians/LeaveReview/DefaultView.aspx?id=OP_5GE_2973__000001_LU77EA,0,0,
Allders Opticians,OP_5GE_11683__000002_LU77EU,OPT,1 Market Square,,Leighton Buzzard,Beds,,LU7 1EU,Tel: 01525 374191, - ,,,No ratings yet Rate it yourself - /Services/opticians/LeaveReview/DefaultView.aspx?id=OP_5GE_11683__000002_LU77EU,0,0,
Chis Archbold Optometrist,OP_5GD_3122__000001_MK428BH,OPT,158 Bedford Road,Kempston,Bedford,,,MK42 8BH,Tel: 01234 855822, - ,,,No ratings yet Rate it yourself - /Services/opticians/LeaveReview/DefaultView.aspx?id=OP_5GD_3122__000001_MK428BH,0,0,
Valerie Curtis,OP_5GD_8192__000001_MK428HP,OPT,142 Bedford Road,Kempston,Bedford,,,MK42 8BH,Tel: 01234 851873, - ,,,No ratings yet Rate it yourself - /Services/opticians/LeaveReview/DefaultView.aspx?id=OP_5GD_8192__000001_MK428HP,0,0,
Mawsley opticians,CO-4951,OPT,,Mawsley Village Surgery,,Mawsley,,NN14 1SN,, - ,,,No ratings yet Rate it yourself - /Services/opticians/LeaveReview/DefaultView.aspx?id=CO-4951,0,0,
J.B. Noble Opticians,OP_5LV_1555__000001_NN109YU,OPT,37 Church Street,,Rushden,,,NN10 9YU,Tel: 01933 312551, - ,,,No ratings yet Rate it yourself - /Services/opticians/LeaveReview/DefaultView.aspx?id=OP_5LV_1555__000001_NN109YU,0,0,
Scrivens Ltd,OP_5LV_3326__000002_NN100QE,OPT,55 High Street,,,Rushden,Northamptonshire,NN10 0QE,Tel: 01933 410554, - ,,,No ratings yet Rate it yourself - /Services/opticians/LeaveReview/DefaultView.aspx?id=OP_5LV_3326__000002_NN100QE,0,0,
Vision Express,OP_HP198BU_46733,OPT,,"Tesco Express, Broadfields Retail Park",,Aylesbury,Buckinghamshire,HP19 8BU,Tel: 0129 685 0228, - ,,,No ratings yet Rate it yourself - /Services/opticians/LeaveReview/DefaultView.aspx?id=OP_HP198BU_46733,0,0,
I-Care Opticians,OP_5LV_2360__000001_NN100PQ,OPT,104 High Street,,Rushden,,,NN10 0PQ,Tel: 01933 312632, - ,,,No ratings yet Rate it yourself - /Services/opticians/LeaveReview/DefaultView.aspx?id=OP_5LV_2360__000001_NN100PQ,0,0,