Organisation Name,NACS Code,Organisation Type,Address1,Address2,Address3,Address4,Address5,PostCode,Telephone Number,Opening time,Value  (Opening time),Banding Classification  (Opening time),NHS.UK users rating,Value  (NHS.UK users rating),Banding Classification  (NHS.UK users rating),Car parking (Is there car parking at this organisation?)
Vision Express Opticians,OP_5DC_13314__000001_CM201XW,OPT,33a Harvey Shopping Centre,,Harlow,Essex,,CM20 1XW,Tel: 01279 410346, - ,,,No ratings yet Rate it yourself - /Services/opticians/LeaveReview/DefaultView.aspx?id=OP_5DC_13314__000001_CM201XW,0,0,
Rose Optometrists,OP_5DC_8699__000001_CM201XR,OPT,15F The Harvey Centre,,Harlow,Essex,,CM20 1XR,Tel: 01279 443181, - ,,,No ratings yet Rate it yourself - /Services/opticians/LeaveReview/DefaultView.aspx?id=OP_5DC_8699__000001_CM201XR,0,0,
Boots-Harlow - Broadwalk,OP_5DC_1813__000002_CM201JA,OPT,37 Broadwalk,,Harlow,Essex,,CM20 1JA,Tel: 01279 439581, - ,,,No ratings yet Rate it yourself - /Services/opticians/LeaveReview/DefaultView.aspx?id=OP_5DC_1813__000002_CM201JA,0,0,
Dollond & Aitchison Proffessional Services 2 Ltd,OP_5DC_1594__000002_CM201HT,OPT,4 The Broadwalk,,Harlow,Essex,,CM20 1HT,Tel: 01279 438851, - ,,,No ratings yet Rate it yourself - /Services/opticians/LeaveReview/DefaultView.aspx?id=OP_5DC_1594__000002_CM201HT,0,0,
Specsavers Ltd,OP_5DC_2746__000001_CM201HP,OPT,,10-12 Broad Walk,Harlow,Essex,,CM20 1HT,Tel: 01279 410888, - ,,,No ratings yet Rate it yourself - /Services/opticians/LeaveReview/DefaultView.aspx?id=OP_5DC_2746__000001_CM201HP,0,0,
FR Loveday Opticians,OP_5DC_1995__000001_CM170DW,OPT,22 High Street,,Old Harlow,Essex,,CM17 0DW,Tel: 01279 415625, - ,,,No ratings yet Rate it yourself - /Services/opticians/LeaveReview/DefaultView.aspx?id=OP_5DC_1995__000001_CM170DW,0,0,
Aves Optometrists,OP_5AJ_8196__000002_CM164BL,OPT,,221 High Street,,Epping,Essex,CM16 4BL,Tel: 01992 572302, - ,,,No ratings yet Rate it yourself - /Services/opticians/LeaveReview/DefaultView.aspx?id=OP_5AJ_8196__000002_CM164BL,0,0,
Boots-Epping - High St,CM16 4AQ_19173,OPT,,188 Epping High Street,,Epping,Essex,CM16 4AQ,Tel: 01992 571986, - ,,,No ratings yet Rate it yourself - /Services/opticians/LeaveReview/DefaultView.aspx?id=CM16 4AQ_19173,0,0,
Pryor & Clacher,OP_5AJ_1464__000001_CM164BD,OPT,91 High Street,,Epping,Essex,,CM16 4BD,Tel: 01992 575999, - ,,,No ratings yet Rate it yourself - /Services/opticians/LeaveReview/DefaultView.aspx?id=OP_5AJ_1464__000001_CM164BD,0,0,
Appelman Charman Opticians ,180808__000001_EN118HD,OPT,90 High Street,,Hoddesdon,Hertfordshire,,EN11 8HD,Tel: 01992 447141, - ,,,No ratings yet Rate it yourself - /Services/opticians/LeaveReview/DefaultView.aspx?id=180808__000001_EN118HD,0,0,
Boots-Hoddesdon,OP_5GJ_6255__000001_EN118TA,OPT,47 High Street,,,Hoddesdon,Hertfordshire,EN11 8TA,Tel: 01992 463055, - ,,,No ratings yet Rate it yourself - /Services/opticians/LeaveReview/DefaultView.aspx?id=OP_5GJ_6255__000001_EN118TA,0,0,
Scrivens Opticians,OP_5GJ_13119__000003_EN118TJ,OPT,,7 Fawkon Walk,High Street,Hoddesdon,,EN11 8TJ,Tel: 01992 469 393, - ,,,No ratings yet Rate it yourself - /Services/opticians/LeaveReview/DefaultView.aspx?id=OP_5GJ_13119__000003_EN118TJ,0,0,
Eileen Gay Optometrists,OP_5GJ_7911__000001_EN107AA,OPT,8 Station Road,,,Broxbourne,Herefordshire,EN10 7QU,Tel: 01992 476300, - ,,,No ratings yet Rate it yourself - /Services/opticians/LeaveReview/DefaultView.aspx?id=OP_5GJ_7911__000001_EN107AA,0,0,
The i Practice,OP_5GJ_1225__000001_CM219AX,OPT,47 Knight Street,Sawbridgeworth,Hertfordshire,,,CM21 9AX,Tel: 01279 725332, - ,,,No ratings yet Rate it yourself - /Services/opticians/LeaveReview/DefaultView.aspx?id=OP_5GJ_1225__000001_CM219AX,0,0,
Tesco Opticians,EN8 0TA,OPT,,Brookfield Centre,,Cheshunt,,EN8 0TA,Tel: 0345 601 3479, - ,,,No ratings yet Rate it yourself - /Services/opticians/LeaveReview/DefaultView.aspx?id=EN8 0TA,0,0,
M&S Opticians,A0C1W,OPT,M&S,Brookfield Centre,,Cheshunt,Hertfordshire,EN8 0TZ,Tel: 01992 660 864, - ,,,No ratings yet Rate it yourself - /Services/opticians/LeaveReview/DefaultView.aspx?id=A0C1W,0,0,
Sun Street Opticians,1909161410,OPT,,54 Sun Street,,Waltham Abbey,Herefordshire,EN9 1EJ,Tel: 01992 669669, - ,,,No ratings yet Rate it yourself - /Services/opticians/LeaveReview/DefaultView.aspx?id=1909161410,0,0,
Ware Eye Centre,OP_5GJ_79__000001_SG129HW,OPT,12 Amwell End,Ware,Hertfordshire,,,SG12 9HW,Tel: 01920 469978, - ,,,No ratings yet Rate it yourself - /Services/opticians/LeaveReview/DefaultView.aspx?id=OP_5GJ_79__000001_SG129HW,0,0,
Eye Deal Opticians,OP_5GJ_10215__000001_SG129BP,OPT,5 High Street,,Ware,,,SG12 9BP,Tel: 01920 460866, - ,,,No ratings yet Rate it yourself - /Services/opticians/LeaveReview/DefaultView.aspx?id=OP_5GJ_10215__000001_SG129BP,0,0,
Boots-Cheshunt,EN8 8NT_99912,OPT,,57A Turners Hill,Waltham Cross,Cheshunt,,EN8 8NT,Tel: 01992 638996, - ,,,No ratings yet Rate it yourself - /Services/opticians/LeaveReview/DefaultView.aspx?id=EN8 8NT_99912,0,0,
Ernest Aves & Partners,OP_5GJ_10894__000002_SG129AD,OPT,61 High Street,,Ware,,,SG12 9AD,Tel: 01920 462751, - ,,,No ratings yet Rate it yourself - /Services/opticians/LeaveReview/DefaultView.aspx?id=OP_5GJ_10894__000002_SG129AD,0,0,
Crystal Eyecare,OP_5GJ_9521__000002_EN87BY,OPT,Unit 28 Shopping Pavilion,High Street,,Waltham Cross,Hertfordshire,EN8 7BY,Tel: 01992 717555, - ,,,No ratings yet Rate it yourself - /Services/opticians/LeaveReview/DefaultView.aspx?id=OP_5GJ_9521__000002_EN87BY,0,0,
Vaid Optometrists,12052009__000001_EN87BX,OPT,108 High Street,,Waltham Cross,Hertfordshire,,EN8 7BX,Tel: 01992 718451, - ,,,No ratings yet Rate it yourself - /Services/opticians/LeaveReview/DefaultView.aspx?id=12052009__000001_EN87BX,0,0,
Scher & Ward Opticians,OP_5AJ_2908__000001_IG101BR,OPT,278 High Road,,Loughton,Essex,,IG10 1RB,Tel: 020 8508 5852, - ,,,No ratings yet Rate it yourself - /Services/opticians/LeaveReview/DefaultView.aspx?id=OP_5AJ_2908__000001_IG101BR,0,0,
Eye Gee Opticians,OP_5AJ_13310__000003_IG103ST,OPT,66 The Broadway,Debden,,Loughton,,IG10 3ST,Tel: 0208 508 5092, - ,,,No ratings yet Rate it yourself - /Services/opticians/LeaveReview/DefaultView.aspx?id=OP_5AJ_13310__000003_IG103ST,0,0,
David Clulow Opticians,NEW WEPCT__000002_IG101AH,OPT,297 High Road,,Loughton,Essex,,IG10 1AH,Tel: 0208 502 5259, - ,,,No ratings yet Rate it yourself - /Services/opticians/LeaveReview/DefaultView.aspx?id=NEW WEPCT__000002_IG101AH,0,0,
Bird & Fairley,OP_5AJ_3042__000001_IG101AH,OPT,269 High Road,,,Loughton,Essex,IG10 1AH,Tel: 0208 508 4070, - ,,,No ratings yet Rate it yourself - /Services/opticians/LeaveReview/DefaultView.aspx?id=OP_5AJ_3042__000001_IG101AH,0,0,
Yourhomevisits Limited,OPL01-26347TAK,OPT,,8 Hodson Place,,Enfield,,EN3 6XE,, - ,,,No ratings yet Rate it yourself - /Services/opticians/LeaveReview/DefaultView.aspx?id=OPL01-26347TAK,0,0,
Hertford Opticians,OP_5GJ_3719__000001_SG137DZ,OPT,73 Railway Street,,Hertford,Hertfordshire,,SG14 1RP,Tel: 01992 551762, - ,,,No ratings yet Rate it yourself - /Services/opticians/LeaveReview/DefaultView.aspx?id=OP_5GJ_3719__000001_SG137DZ,0,0,
Boots-Loughton,IG10 1AD_19218,OPT,,247 High Road,,Loughton,Essex,IG10 1AD,Tel: 02085 087 497, - ,,,No ratings yet Rate it yourself - /Services/opticians/LeaveReview/DefaultView.aspx?id=IG10 1AD_19218,0,0,
Specsavers Opticians,OP_5AJ_14203__000001_IG101AD,OPT,231 High Road,,Loughton,Essex,,IG10 1AD,Tel: 0208 498 6740, - ,,,No ratings yet Rate it yourself - /Services/opticians/LeaveReview/DefaultView.aspx?id=OP_5AJ_14203__000001_IG101AD,0,0,
Boatmans Opticians,OP_5PV_01__000003_CM59JJ,OPT,182 High Street,,Ongar,Essex,,CM5 9JJ,Tel: 01277 366665, - ,,,No ratings yet Rate it yourself - /Services/opticians/LeaveReview/DefaultView.aspx?id=OP_5PV_01__000003_CM59JJ,0,0,
Pipkin Partnership Optometrists,OP_5AJ_4264__000001_CM59EB,OPT,96 High Street,,Ongar,Essex,,CM5 9EB,Tel: 01277 362192, - ,,,No ratings yet Rate it yourself - /Services/opticians/LeaveReview/DefaultView.aspx?id=OP_5AJ_4264__000001_CM59EB,0,0,
Stuart Davidson Opticians ,OP_5P3_1321__000002_SG141BN,OPT,22a Bircherley Green,Hertford,Herts,,,SG14 1BN,Tel: 01992 586 979, - ,,,No ratings yet Rate it yourself - /Services/opticians/LeaveReview/DefaultView.aspx?id=OP_5P3_1321__000002_SG141BN,0,0,
Atkinson Opticians Ltd,OP_5AJ_794__000001_IG101DX,OPT,24 Forest Road,,Loughton,,,IG10 1DX,Tel: 0208 508 1325, - ,,,No ratings yet Rate it yourself - /Services/opticians/LeaveReview/DefaultView.aspx?id=OP_5AJ_794__000001_IG101DX,0,0,
Boots-Hertford,OP_5GJ_4619__000001_SG141DW,OPT,27 Maidenhead Street,,,Hertford,Hertfordshire,SG14 1DW,Tel: 01992 583285, - ,,,No ratings yet Rate it yourself - /Services/opticians/LeaveReview/DefaultView.aspx?id=OP_5GJ_4619__000001_SG141DW,0,0,
"OSAGIE, HENRY",10036__000001_IG103HT,OPT,61 The Lindens,Loughton,Essex,,,IG10 3HT,Tel: 020 8965 6707, - ,,,No ratings yet Rate it yourself - /Services/opticians/LeaveReview/DefaultView.aspx?id=10036__000001_IG103HT,0,0,
"Charrington, Cross, Liversidge & Partners",OP_5C1_8770__000001_EN35UQ,OPT,555 Hertford Road,Enfield,London,Middx,,EN3 5UQ,Tel: 020 8804 1509, - ,,,No ratings yet Rate it yourself - /Services/opticians/LeaveReview/DefaultView.aspx?id=OP_5C1_8770__000001_EN35UQ,0,0,
Enfield Eye Care,OP_EN35UQ_46387,OPT,,555 Hertford Road,,Enfield,,EN3 5UQ,Tel: 0208 804 1509, - ,,,No ratings yet Rate it yourself - /Services/opticians/LeaveReview/DefaultView.aspx?id=OP_EN35UQ_46387,0,0,
Specsavers Opticians,OP_5GK_1413__000003_CM233AT,OPT,16a South Street,Bishops Stortford,Hertfordshire,,,CM23 3AT,Tel: 01279 656696, - ,,,No ratings yet Rate it yourself - /Services/opticians/LeaveReview/DefaultView.aspx?id=OP_5GK_1413__000003_CM233AT,0,0,
Boots-Bishops Stortford - South St,OP_5GK_6064__000002_CM233AT,OPT,22 South Street,,,Bishops Stortford,Hertfordshire,CM23 3AT,Tel: 01279 651436, - ,,,No ratings yet Rate it yourself - /Services/opticians/LeaveReview/DefaultView.aspx?id=OP_5GK_6064__000002_CM233AT,0,0,
Boots-Bishops Stortford - South St,OP_5GK_899__000001_CM233AB,OPT,1a South Street,,Bishops Stortford,Hertfordshire,,CM23 3AB,Tel: 01279 757329, - ,,,No ratings yet Rate it yourself - /Services/opticians/LeaveReview/DefaultView.aspx?id=OP_5GK_899__000001_CM233AB,0,0,
Martin Reynolds Opticians,5GK_27022006__000002_CM232LW,OPT,Martin Reynolds Opticians,24 North Street,,Bishop’s Stortford,Hertfordshire,CM23 2LW,Tel: 01279 757767, - ,,,No ratings yet Rate it yourself - /Services/opticians/LeaveReview/DefaultView.aspx?id=5GK_27022006__000002_CM232LW,0,0,yes
Ashwell & Barrie,OP_5GK_2223__000001_CM232LW,OPT,Ashwell and Barrie Optician Ltd,34-36 North Street,,Bishop's Stortford,Hertfordshire,CM23 2LW,Tel: 01279 652956, - ,,,No ratings yet Rate it yourself - /Services/opticians/LeaveReview/DefaultView.aspx?id=OP_5GK_2223__000001_CM232LW,0,0,yes
P S Mayo Opticians ,OP_5GK_8531__000002_CM233AL,OPT,34- 36 North Street,,Bishops Stortford,Hertfordshire,,CM23 2LW,Tel: 01279 654644, - ,,,No ratings yet Rate it yourself - /Services/opticians/LeaveReview/DefaultView.aspx?id=OP_5GK_8531__000002_CM233AL,0,0,
Loveday Opticians,OP_5GK_9877__000001_CM232QR,OPT,The Folly,18 Hadham Road,Bishops Stortford,,,CM23 2QR,Tel: 01279 54676, - ,,,No ratings yet Rate it yourself - /Services/opticians/LeaveReview/DefaultView.aspx?id=OP_5GK_9877__000001_CM232QR,0,0,
R. J. Mattes Opticians ,OP_5C1_13555__000001_EN35BA,OPT,8 Brick Lane,Enfield,London,Middx,,EN3 5BA,Tel: 020 8804 2818, - ,,,No ratings yet Rate it yourself - /Services/opticians/LeaveReview/DefaultView.aspx?id=OP_5C1_13555__000001_EN35BA,0,0,
Queens Road Opticians,OP_5AJ_5829__000001_IG95BU,OPT,55 Queens Road,,Buckhurst Hill,Essex,,IG9 5BU,Tel: 020 8504 5175, - ,,,No ratings yet Rate it yourself - /Services/opticians/LeaveReview/DefaultView.aspx?id=OP_5AJ_5829__000001_IG95BU,0,0,
VICKERY & UTTERIDGE LTD,OP_5NC34603__000001_E46AG,OPT,20 Station Road,Chingford,,London,Greater London,E4 7BE,Tel: 020 8529 1703, - ,,,No ratings yet Rate it yourself - /Services/opticians/LeaveReview/DefaultView.aspx?id=OP_5NC34603__000001_E46AG,0,0,
Tesco Opticians,EN3 4DP,OPT,,288 High Street,,Ponders End,,EN3 4DP,Tel: 0845 601 3479, - ,,,No ratings yet Rate it yourself - /Services/opticians/LeaveReview/DefaultView.aspx?id=EN3 4DP,0,0,
HD Jameson & Associates,OP_5AJ_13309__000001_IG96LN,OPT,46 Station Way,,Buckhurst Hill,Essex,,IG9 6LN,Tel: 0208 504 4830, - ,,,No ratings yet Rate it yourself - /Services/opticians/LeaveReview/DefaultView.aspx?id=OP_5AJ_13309__000001_IG96LN,0,0,
EYE CLINIC CHIGWELL LTD, TP2FH,OPT,The Opticians,173 Manor Road,,Chigwell,Essex,IG7 5QB,Tel: 0208 928 1500, - ,,,No ratings yet Rate it yourself - /Services/opticians/LeaveReview/DefaultView.aspx?id=TP2FH,0,0,
EYE CLINIC CHIGWELL LTD, TP2FH,OPT,,173 Manor Road,,Chigwell Essex,,IG7 5QB,, - ,,,No ratings yet Rate it yourself - /Services/opticians/LeaveReview/DefaultView.aspx?id=TP2FH,0,0,
SCRIVENS,OP_5NA45715__000001_IG74DJ,OPT,191 Manford Way,Chigwell,,London,,IG7 4DJ,Tel: 020 8500 2304, - ,,,No ratings yet Rate it yourself - /Services/opticians/LeaveReview/DefaultView.aspx?id=OP_5NA45715__000001_IG74DJ,0,0,
Boots-Enfield,OP_5C1_13666__000003_EN26EB,OPT,18 London Road,,Enfield,London,,EN2 6EB,Tel: 0208 367 1066, - ,,,No ratings yet Rate it yourself - /Services/opticians/LeaveReview/DefaultView.aspx?id=OP_5C1_13666__000003_EN26EB,0,0,
Specsavers Opticians,OP_5C1_3935__000001_EN26AF,OPT,25 Church Street,Enfield,London,Middx,,EN2 6AF,Tel: 020 8366 1030, - ,,,No ratings yet Rate it yourself - /Services/opticians/LeaveReview/DefaultView.aspx?id=OP_5C1_3935__000001_EN26AF,0,0,
 Gordon Thomas Good Looking Optics,OP_5C1_11296__000001_EN26AJ,OPT,43 Church Street,Enfield,,Middx,,EN2 6AJ,Tel: 020 83644444, - ,,,No ratings yet Rate it yourself - /Services/opticians/LeaveReview/DefaultView.aspx?id=OP_5C1_11296__000001_EN26AJ,0,0,
Vision Express (UK) Ltd,OP_5C1_9971__000001_EN26AB,OPT,,28 Palace Gardens Centre,,Enfield,,EN2 6SN,Tel: 020 8363 6225, - ,,,No ratings yet Rate it yourself - /Services/opticians/LeaveReview/DefaultView.aspx?id=OP_5C1_9971__000001_EN26AB,0,0,
Scrivens Opticians,OP_5C1_6830__000001_EN26BA,OPT,,33. Palace Garden Shopping Centre,Enfield,Middlesex,,EN2 6SN,Tel: 020 8367 0500, - ,,,No ratings yet Rate it yourself - /Services/opticians/LeaveReview/DefaultView.aspx?id=OP_5C1_6830__000001_EN26BA,0,0,
CHIGWELL MEDICAL CENTRE,20000__000001_IG62TA,OPT,300 Fencepiece Road,Hainault,Essex,,,IG6 2TA,, - ,,,No ratings yet Rate it yourself - /Services/opticians/LeaveReview/DefaultView.aspx?id=20000__000001_IG62TA,0,0,
JAMES SCOTT OPTICIANS LTD,OP_5NA45709__000001_IG88AJ,OPT,637a Chigwell Road,Woodford Bridge,London,,,IG8 8AJ,Tel: 020 8504 3292, - ,,,No ratings yet Rate it yourself - /Services/opticians/LeaveReview/DefaultView.aspx?id=OP_5NA45709__000001_IG88AJ,0,0,
KENNETH BIRD LTD,OP_5NC34583__000001_E48BX,OPT,94 Old Church Road,Chingford,London,,,E4 8BX,Tel: 020 8529 4878, - ,,,No ratings yet Rate it yourself - /Services/opticians/LeaveReview/DefaultView.aspx?id=OP_5NC34583__000001_E48BX,0,0,
Care Optics,01-15072-1,OPT,,14 The Broadway,,London,,IG8 0HL,, - ,,,No ratings yet Rate it yourself - /Services/opticians/LeaveReview/DefaultView.aspx?id=01-15072-1,0,0,yes
Scher and Lasky Opticians,10080__000005_IG87QF,OPT,4 Jubilee Parade,Snakes Lane East,Woodford Green,Essex,,IG8 7QF,Tel: 020 8504 9243, - ,,,No ratings yet Rate it yourself - /Services/opticians/LeaveReview/DefaultView.aspx?id=10080__000005_IG87QF,0,0,
Anthony Weyman,OP_5C1_13549__000001_EN27AF,OPT,71 Windmill Hill,Enfield,,London,Greater London,EN2 7AF,Tel: 020 8363 0939, - ,,,No ratings yet Rate it yourself - /Services/opticians/LeaveReview/DefaultView.aspx?id=OP_5C1_13549__000001_EN27AF,0,0,
C J PACKFORD OPTICIANS,OP_5NC34572__000002_E112RL,OPT,373 High Road,Woodford Green,Essex,,,IG8 0XQ,Tel: 020 8504 2296, - ,,,No ratings yet Rate it yourself - /Services/opticians/LeaveReview/DefaultView.aspx?id=OP_5NC34572__000002_E112RL,0,0,
SCRIVENS OPTICIANS,OP_5NC34596__000002_E46SJ,OPT,13 Old Church Road,Chingford,London,London,,E4 6SJ,Tel: 0208 529 8998, - ,,,No ratings yet Rate it yourself - /Services/opticians/LeaveReview/DefaultView.aspx?id=OP_5NC34596__000002_E46SJ,0,0,
E 4 EYES,OP_5NC34578__000001_E48DD,OPT,12 Old Church Road,Chingford,London,,,E4 8DD,Tel: 020 8529 1838, - ,,,No ratings yet Rate it yourself - /Services/opticians/LeaveReview/DefaultView.aspx?id=OP_5NC34578__000001_E48DD,0,0,
SPECSAVERS OPTICIANS,OP_5NC34600__000003_E48DD,OPT,26 Old Church Road,Chingford,London,,,E4 8DD,Tel: 0208 506 3780, - ,,,No ratings yet Rate it yourself - /Services/opticians/LeaveReview/DefaultView.aspx?id=OP_5NC34600__000003_E48DD,0,0,
AVES OPTICIAN (MRS GUPTA),10090__000001_IG62UE,OPT,49 New North Road,Hainult,Essex,,,IG6 2UE,Tel: 020 8502 7000, - ,,,No ratings yet Rate it yourself - /Services/opticians/LeaveReview/DefaultView.aspx?id=10090__000001_IG62UE,0,0,
DERMOTT EYECARE,OP_5NC34576__000003_E48LP,OPT,245 Chingford Mount Road,Chingford,,London,,E4 8LP,Tel: 0208 524 3737, - ,,,No ratings yet Rate it yourself - /Services/opticians/LeaveReview/DefaultView.aspx?id=OP_5NC34576__000003_E48LP,0,0,yes
"TUOMINEN, RICKY",10041__000001_IG89AR,OPT,17 Shenfield Road,Woodford Green,Essex,London,,IG8 9AR,Tel: 020 8504 1939, - ,,,No ratings yet Rate it yourself - /Services/opticians/LeaveReview/DefaultView.aspx?id=10041__000001_IG89AR,0,0,
Optom Solutions,10081__000003_IG89AR,OPT,17 Shenfield Road,Woodford Green,Essex,London,,IG8 9AR,Tel: 07968371368, - ,,,No ratings yet Rate it yourself - /Services/opticians/LeaveReview/DefaultView.aspx?id=10081__000003_IG89AR,0,0,
HENRY MORGAN OPTICIANS,10020__000001_E49LE,OPT,3 Bank Building,The Avenue,London,,,E4 9LE,Tel: 020 8923 1714, - ,,,No ratings yet Rate it yourself - /Services/opticians/LeaveReview/DefaultView.aspx?id=10020__000001_E49LE,0,0,
Specsavers Opticians,F85A120__000001_N90EJ,OPT,20 North Mall,Edmonton,London,London,,N9 0EJ,Tel: 020 8887 1300, - ,,,No ratings yet Rate it yourself - /Services/opticians/LeaveReview/DefaultView.aspx?id=F85A120__000001_N90EJ,0,0,
Scher & Marks,OP_5C1_2857__000001_N90EH,OPT,29 North Mall,Edmonton,,london,,N9 0EQ,Tel: 020 8807 2113, - ,,,No ratings yet Rate it yourself - /Services/opticians/LeaveReview/DefaultView.aspx?id=OP_5C1_2857__000001_N90EH,0,0,
Alfred Jay Opticians,OP_5C1_3426__000001_N90TY,OPT,5 The Concourse,Edmonton Green Shopping Centre,London,Edmonton Green,,N9 0TY,Tel: 020 8884 3870, - ,,,No ratings yet Rate it yourself - /Services/opticians/LeaveReview/DefaultView.aspx?id=OP_5C1_3426__000001_N90TY,0,0,
M.D. Cooper,OP_5C1_6138__000002_N99DP,OPT,1 Keats Parade,Church Street,London,Middx,,N9 9DP,Tel: 020 8807 5664, - ,,,No ratings yet Rate it yourself - /Services/opticians/LeaveReview/DefaultView.aspx?id=OP_5C1_6138__000002_N99DP,0,0,
Budget Eyewear Ltd,OL/2455-5C1__000001_N90QU,OPT,11 South Mall,Edmonton Green Shopping Centre,Edmonton,,,N9 0QU,, - ,,,No ratings yet Rate it yourself - /Services/opticians/LeaveReview/DefaultView.aspx?id=OL/2455-5C1__000001_N90QU,0,0,
"Debney, K. Opticians",OP_5A4_4835__000002_RM53PR,OPT,16 Chase Cross Road,Collier Row,Romford,,,RM5 3PR,Tel: 01708 737448, - ,,,No ratings yet Rate it yourself - /Services/opticians/LeaveReview/DefaultView.aspx?id=OP_5A4_4835__000002_RM53PR,0,0,
Homesight UK Ltd,OP_IG89NB_84735,OPT,,261 Hale end road,Woodford Green,London,Greater London,IG8 9NB,Tel: 02085314148, - ,,,No ratings yet Rate it yourself - /Services/opticians/LeaveReview/DefaultView.aspx?id=OP_IG89NB_84735,0,0,
KENNETH BIRD (OPTICIANS) LTD,OP_5NA45710__000001_E182QS,OPT,144 High Road,South Woodford,London,,,E18 2QS,Tel: 020 8504 8817, - ,,,No ratings yet Rate it yourself - /Services/opticians/LeaveReview/DefaultView.aspx?id=OP_5NA45710__000001_E182QS,0,0,
Costco Wholesale UK Ltd,CO-1833-7,OPT,,1 Shadbolt Avenue,Off Harbet Road,Chingford,,E4 8GP,Tel: 020 8501 9315, - ,,,No ratings yet Rate it yourself - /Services/opticians/LeaveReview/DefaultView.aspx?id=CO-1833-7,0,0,
Boots-Barkingside - High St,OP_5NA45695__000001_IG62DR,OPT,90 High Street,Barkingside,London,London,Essex,IG6 2DR,Tel: 0208 550 2920, - ,,,No ratings yet Rate it yourself - /Services/opticians/LeaveReview/DefaultView.aspx?id=OP_5NA45695__000001_IG62DR,0,0,
SPECSAVERS,50000__000004_IG62AD,OPT,45 High Street,Barkingside,Essex,,,IG6 2AD,Tel: 0208 418 2480, - ,,,No ratings yet Rate it yourself - /Services/opticians/LeaveReview/DefaultView.aspx?id=50000__000004_IG62AD,0,0,
Rose Optical Services Ltd,106000__000001_E182JP,OPT,42-48 High Street,South Woodford,,London,,E18 2JP,Tel: 0800 731 0031, - ,,,No ratings yet Rate it yourself - /Services/opticians/LeaveReview/DefaultView.aspx?id=106000__000001_E182JP,0,0,
Boots-Barkingside - High St,OP_5NA45687__000001_IG62DF,OPT,10 High Street,Barkingside,London,London,Essex,IG6 2DF,Tel: 020 8550 7740, - ,,,No ratings yet Rate it yourself - /Services/opticians/LeaveReview/DefaultView.aspx?id=OP_5NA45687__000001_IG62DF,0,0,
ELLIS BASS OPTOMETRISTS,5NA_0121__000001_IG62AA,OPT,"Unit 4c, 3-19 High Street",Barkingside,Ilford,Essex,,IG6 2AA,Tel: 020 8550 9288, - ,,,No ratings yet Rate it yourself - /Services/opticians/LeaveReview/DefaultView.aspx?id=5NA_0121__000001_IG62AA,0,0,
Bayfields Opticians and Audiologists (South Woodford),M1O9B,OPT,,135a George Lane,,South Woodford,,E18 1AN,Tel: 0208 9891996, - ,,,No ratings yet Rate it yourself - /Services/opticians/LeaveReview/DefaultView.aspx?id=M1O9B,0,0,
Homecall Optical Services (DOM),5LA_OPT_113__000003_E182QL,OPT,42-48 High Street,,London,,,E18 2QL,Tel: 0208 551 7512, - ,,,No ratings yet Rate it yourself - /Services/opticians/LeaveReview/DefaultView.aspx?id=5LA_OPT_113__000003_E182QL,0,0,
Eyes on Call,OP_N182UP_29653,OPT,,35 Park Avenue,,Edmonton,,N18 2UP,Tel: 0800 047 0425, - ,,,No ratings yet Rate it yourself - /Services/opticians/LeaveReview/DefaultView.aspx?id=OP_N182UP_29653,0,0,
Tesco Opticians,C/OL2453__000002_N183HF,OPT,Tesco Pharmacy,1 Glover Drive,Upper Edmonton,London,,N18 3HF,Tel: 0345 677 9691, - ,,,No ratings yet Rate it yourself - /Services/opticians/LeaveReview/DefaultView.aspx?id=C/OL2453__000002_N183HF,0,0,
"Sames, J.P. Opticians",OP_5A4_241__000001_RM38DT,OPT,108 Hilldene Avenue,Harrold Hill,,Romford,Essex,RM3 8DT,Tel: 01708 377777, - ,,,No ratings yet Rate it yourself - /Services/opticians/LeaveReview/DefaultView.aspx?id=OP_5A4_241__000001_RM38DT,0,0,
Boots-Harold Hill,OP_5A4_9574__000002_RM38DX,OPT,16 Farnham Road,,Harold Hill,Romford,Essex,RM3 8DX,Tel: 01708 341 550, - ,,,No ratings yet Rate it yourself - /Services/opticians/LeaveReview/DefaultView.aspx?id=OP_5A4_9574__000002_RM38DX,0,0,
The Angel Opticians,OP_5C1_13557__000001_N182ND,OPT,188 Upper Fore Street,Edmonton,London	,,,N18 2JB,Tel: 0208 8078445, - ,,,No ratings yet Rate it yourself - /Services/opticians/LeaveReview/DefaultView.aspx?id=OP_5C1_13557__000001_N182ND,0,0,
M Wallace Opticians,OP_5C1_5648__000002_N144XA,OPT,191 Bramley Road,Oakwood,London,,,N14 4XA,Tel: 020 8367 3538, - ,,,No ratings yet Rate it yourself - /Services/opticians/LeaveReview/DefaultView.aspx?id=OP_5C1_5648__000002_N144XA,0,0,
Infocus Eye Care,OP_5C1_2928__000001_N182TW,OPT,89 Fore Street,Edmonton,London,Middx,,N18 2TW,Tel: 020 8807 2981, - ,,,No ratings yet Rate it yourself - /Services/opticians/LeaveReview/DefaultView.aspx?id=OP_5C1_2928__000001_N182TW,0,0,
Eye Deal Eyes Opticians,OP_5CP_12057__000001_EN65AP,OPT,2 Kemble Parade,High Street,Potters Bar,,,EN6 5AP,Tel: 01707 660808, - ,,,No ratings yet Rate it yourself - /Services/opticians/LeaveReview/DefaultView.aspx?id=OP_5CP_12057__000001_EN65AP,0,0,
D H Burns,OP_5C9_1611__000001_N170EY,OPT,830 High Road,Tottenham,London,,,N17 0EY,Tel: 020 8808 7910, - ,,,No ratings yet Rate it yourself - /Services/opticians/LeaveReview/DefaultView.aspx?id=OP_5C9_1611__000001_N170EY,0,0,