Organisation Name,NACS Code,Organisation Type,Address1,Address2,Address3,Address4,Address5,PostCode,Telephone Number,Opening time,Value  (Opening time),Banding Classification  (Opening time),NHS.UK users rating,Value  (NHS.UK users rating),Banding Classification  (NHS.UK users rating),Car parking (Is there car parking at this organisation?)
TESCO OPTICIANS,RH6 0AT__000001_RH60AT,OPT,Reigate Road,Hookwood,,Horley,Surrey,RH6 0AT,Tel: 01293 894 638, - ,,,No ratings yet Rate it yourself - /Services/opticians/LeaveReview/DefaultView.aspx?id=RH6 0AT__000001_RH60AT,0,0,
EMSLIE OPTICIANS,OP_5KP_14528__000001_RH41AY,OPT,62 High Street,,Dorking,Dorking,,RH4 1AY,Tel: 01306 875 201, - ,,,No ratings yet Rate it yourself - /Services/opticians/LeaveReview/DefaultView.aspx?id=OP_5KP_14528__000001_RH41AY,0,0,
Batemans (Opticians) Ltd,OP_5KP_11827__000001_RH41BA,OPT,,114 High Street,,Dorking,Surrey,RH4 1BA,Tel: 01306 882 787, - ,,,No ratings yet Rate it yourself - /Services/opticians/LeaveReview/DefaultView.aspx?id=OP_5KP_11827__000001_RH41BA,0,0,
Specsavers Opticians,OP_5KP_14662__000002_RH41BA,OPT,Specsavers,110 High Street,,Dorking,Surrey,RH4 1BA,Tel: 01306 745 350, - ,,,No ratings yet Rate it yourself - /Services/opticians/LeaveReview/DefaultView.aspx?id=OP_5KP_14662__000002_RH41BA,0,0,
Boots-Dorking,OP_5KP_10554__000003_RH41AW,OPT,83 High Street,,,Dorking,Surrey,RH4 1AW,Tel: 01306 882 176, - ,,,1 rating Rate it yourself - /Services/opticians/LeaveReview/DefaultView.aspx?id=OP_5KP_10554__000003_RH41AW,,,
Specsavers Opticians,RH2 9AE__000001_RH29AE,OPT,39 High Street,,Reigate,Surrey,,RH2 9AE,Tel: 01737 227920, - ,,,1 rating Rate it yourself - /Services/opticians/LeaveReview/DefaultView.aspx?id=RH2 9AE__000001_RH29AE,,,
Boots-Horley,OP_5KQ_5319__000002_RH67AY,OPT,,18/20 High Street,,Horley,Surrey,RH6 7AY,Tel: 01293 782 668, - ,,,1 rating Rate it yourself - /Services/opticians/LeaveReview/DefaultView.aspx?id=OP_5KQ_5319__000002_RH67AY,,,
Specsavers Opticians,TP8G1,OPT,,71 Victoria Road,,Horley,Surrey,RH6 7QH,Tel: 01293 783018, - ,,,No ratings yet Rate it yourself - /Services/opticians/LeaveReview/DefaultView.aspx?id=TP8G1,0,0,
Bateman Opticians,OP_5KQ_9375__000001_RH27AD,OPT,,7 Bell Street,,Reigate,Surrey,RH2 7AD,Tel: 01737 242 789, - ,,,No ratings yet Rate it yourself - /Services/opticians/LeaveReview/DefaultView.aspx?id=OP_5KQ_9375__000001_RH27AD,0,0,
The Reigate Optical Rooms,TP9DV,OPT,,3 Pool House,,Reigate,Surrey,RH2 7RP,Tel: 01737 304090, - ,,,No ratings yet Rate it yourself - /Services/opticians/LeaveReview/DefaultView.aspx?id=TP9DV,0,0,
Whiteman Opticians,OP_5KQ_12938__000001_RH20AD,OPT,,20 Church Street,,Reigate,Surrey,RH2 0AN,Tel: 01737 223 202, - ,,,No ratings yet Rate it yourself - /Services/opticians/LeaveReview/DefaultView.aspx?id=OP_5KQ_12938__000001_RH20AD,0,0,
i-Contact,OP_5KQ_9977__000001_RH20AN,OPT,20 Church Street,,Reigate,,,RH2 0AN,Tel: 01737 242 754, - ,,,No ratings yet Rate it yourself - /Services/opticians/LeaveReview/DefaultView.aspx?id=OP_5KQ_9977__000001_RH20AN,0,0,
Boots-Reigate,OP_5KQ_10061__000002_RH20AD,OPT,25 Church Street,,,Reigate,Surrey,RH2 0AD,Tel: 01737 243 577, - ,,,No ratings yet Rate it yourself - /Services/opticians/LeaveReview/DefaultView.aspx?id=OP_5KQ_10061__000002_RH20AD,0,0,
Specsavers Opticians,OP_5P6_OPTICIAN SPECSAVERS CRAWLEY__000001_RH101ES,OPT,Unit 4 The Martlets,,,Crawley,,RH10 1ES,Tel: 01293 560646, - ,,,No ratings yet Rate it yourself - /Services/opticians/LeaveReview/DefaultView.aspx?id=OP_5P6_OPTICIAN SPECSAVERS CRAWLEY__000001_RH101ES,0,0,
Boots-Crawley - County Mall,OP_5MA_12798__000002_RH101FX,OPT,3 County Mall,,Crawley,West Sussex,,RH10 1FX,Tel: 01293 524566, - ,,,No ratings yet Rate it yourself - /Services/opticians/LeaveReview/DefaultView.aspx?id=OP_5MA_12798__000002_RH101FX,0,0,
Boots Opticians,OPT_RH101FX_1,OPT,,3 County Mall,,Crawley,,RH10 1FX,, - ,,,No ratings yet Rate it yourself - /Services/opticians/LeaveReview/DefaultView.aspx?id=OPT_RH101FX_1,0,0,
Vision Express,OP_5P6_OPTICIAN VISION EXPRESS CRAWLEY__000002_RH1,OPT,"Unit 40, County Mall",,,Crawley,West Sussex,RH10 1FF,Tel: 01293 618686, - ,,,5 ratings Rate it yourself - /Services/opticians/LeaveReview/DefaultView.aspx?id=OP_5P6_OPTICIAN VISION EXPRESS CRAWLEY__000002_RH1,,,
Redhill Eye Studio,OP_5KQ_14661__000001_RH11SA,OPT,Redhill Opticians,51 High Street,,Redhill,Surrey,RH1 1RX,Tel: 01737 789 924, - ,,,No ratings yet Rate it yourself - /Services/opticians/LeaveReview/DefaultView.aspx?id=OP_5KQ_14661__000001_RH11SA,0,0,
Eyeworks,OP_5KQ_3954__000001_RH11QH,OPT,66 Station Road,,Redhill,,,RH1 1PL,Tel: 01737 778 877, - ,,,No ratings yet Rate it yourself - /Services/opticians/LeaveReview/DefaultView.aspx?id=OP_5KQ_3954__000001_RH11QH,0,0,
Vision Express (UK) LTD,OP_5KQ_12939__000001_RH11SE,OPT,46 The Belfry,Station Road,,Redhill,Surrey,RH1 1SE,Tel: 01737 768862, - ,,,1 rating Rate it yourself - /Services/opticians/LeaveReview/DefaultView.aspx?id=OP_5KQ_12939__000001_RH11SE,,,
Boots-Redhill - High St,OP_5KQ_1510__000001_RH11RH,OPT,12 High Street,,,Redhill,Surrey,RH1 1RH,Tel: 01737 763148, - ,,,No ratings yet Rate it yourself - /Services/opticians/LeaveReview/DefaultView.aspx?id=OP_5KQ_1510__000001_RH11RH,0,0,
Boots-Redhill - High St,RH1 1RH__000002_RH11RH,OPT,24 High Street,,,Redhill,Surrey,RH1 1RH,Tel: 01737 765 600, - ,,,No ratings yet Rate it yourself - /Services/opticians/LeaveReview/DefaultView.aspx?id=RH1 1RH__000002_RH11RH,0,0,
Specsavers Opticians,OP_5KQ_514__000002_RH11QH,OPT,1 - 2 Central Parade,London Road,,Redhill,,RH1 1LY,Tel: 01737 772990, - ,,,No ratings yet Rate it yourself - /Services/opticians/LeaveReview/DefaultView.aspx?id=OP_5KQ_514__000002_RH11QH,0,0,
Tesco Opticians,10001__000002_RH101GY,OPT,Hazelwick Avenue,,Crawley,West Sussex,,RH10 1GY,Tel: 0345 677 9179, - ,,,No ratings yet Rate it yourself - /Services/opticians/LeaveReview/DefaultView.aspx?id=10001__000002_RH101GY,0,0,
Golding & Maud EyeCare,L8P4W ,OPT,Broadfield Health Centre,Coachmans Drive,,Crawley,Sussex,RH11 9YZ,Tel: 01293 542049, - ,,,No ratings yet Rate it yourself - /Services/opticians/LeaveReview/DefaultView.aspx?id=L8P4W,0,0,
Nethercott Opticians,OP_5KP_4172__000002_KT205AD,OPT,18 Station Approach,,Tadworth,Surrey,,KT20 5AD,Tel: 01737 813 600, - ,,,No ratings yet Rate it yourself - /Services/opticians/LeaveReview/DefaultView.aspx?id=OP_5KP_4172__000002_KT205AD,0,0,
Donner Optometrists,,OPT,,9 Church Rd,,Great Bookham Leatherhead,,KT23 3PD,Tel: 01372 458318, - ,,,N/A - Data not available,,,
Specsavers Opticians,OPT_KT228AH_1,OPT,,12 The Swan Centre,,Leatherhead,Surrey,KT22 8AH,Tel: 01372 227740, - ,,,No ratings yet Rate it yourself - /Services/opticians/LeaveReview/DefaultView.aspx?id=OPT_KT228AH_1,0,0,
Opticial Express,OP_12345_RH12 1HQ,OPT,25 Swan Walk,,,Horsham,West Sussex,RH12 1HQ,Tel: 0800 023 2020, - ,,,No ratings yet Rate it yourself - /Services/opticians/LeaveReview/DefaultView.aspx?id=OP_12345_RH12 1HQ,0,0,
Louise Sloan Opticians,OPT_RH121EH_2,OPT,,1 Piries Place,,Horsham,,RH12 1EH,Tel: 01403 264682, - ,,,No ratings yet Rate it yourself - /Services/opticians/LeaveReview/DefaultView.aspx?id=OPT_RH121EH_2,0,0,
Boots-Horsham - West St,OP_5MC_3630__000001_RH121PP,OPT,39 West Street,,Horsham,West Sussex,,RH12 1PP,Tel: 01403 253553, - ,,,1 rating Rate it yourself - /Services/opticians/LeaveReview/DefaultView.aspx?id=OP_5MC_3630__000001_RH121PP,,,
Specsavers Opticians,OP_5P6_OPTICIAN SPECSAVERS HORSHAM__000001_RH121PL,OPT,57 West Street,,Horsham,West Sussex,,RH12 1PL,Tel: 01403 275115, - ,,,1 rating Rate it yourself - /Services/opticians/LeaveReview/DefaultView.aspx?id=OP_5P6_OPTICIAN SPECSAVERS HORSHAM__000001_RH121PL,,,
Vision Express,OP_5MC_12036__000001_RH121PB,OPT,23 West Street,,Horsham,West Sussex,,RH12 1PB,Tel: 01403 256636, - ,,,No ratings yet Rate it yourself - /Services/opticians/LeaveReview/DefaultView.aspx?id=OP_5MC_12036__000001_RH121PB,0,0,
Ashtead Eye Clinic,OP_5KP_12937__000001_KT211AA,OPT,31-33 The Street,,Ashtead,,,KT21 1AA,Tel: 01372 274 348, - ,,,No ratings yet Rate it yourself - /Services/opticians/LeaveReview/DefaultView.aspx?id=OP_5KP_12937__000001_KT211AA,0,0,
Batemans Opticians Ltd,OP_5L5_2968__000002_GU68AG,OPT,Dunford House,58 High Street,,Cranleigh,Surrey,GU6 8AG,Tel: 01483 272 750, - ,,,No ratings yet Rate it yourself - /Services/opticians/LeaveReview/DefaultView.aspx?id=OP_5L5_2968__000002_GU68AG,0,0,
Gregory & Seeley,OP_5L5_9748__000001_GU68AU,OPT,Tylers Building,High Street,Cranleigh,,,GU6 8AU,Tel: 01483 272 629, - ,,,No ratings yet Rate it yourself - /Services/opticians/LeaveReview/DefaultView.aspx?id=OP_5L5_9748__000001_GU68AU,0,0,
Cranleigh Specsavers Ltd,TP8NR,OPT,,Specsavers Opticians,,"104 High Street, Cranleigh",,GU6 8AJ,, - ,,,No ratings yet Rate it yourself - /Services/opticians/LeaveReview/DefaultView.aspx?id=TP8NR,0,0,
Boots-Cranleigh,GU6 8RG__000001_GU68RG,OPT,Unit 3,Stocklund Square,170 High Street,Cranleigh,Surrey,GU6 8RG,Tel: 01483 276994, - ,,,No ratings yet Rate it yourself - /Services/opticians/LeaveReview/DefaultView.aspx?id=GU6 8RG__000001_GU68RG,0,0,
Eye-Care@Banstead Village,OP_5KP_9863__000001_SM72LJ,OPT,,20 High Street,,Banstead,Surrey,SM7 2LJ,Tel: 01737 353 225, - ,,,1 rating Rate it yourself - /Services/opticians/LeaveReview/DefaultView.aspx?id=OP_5KP_9863__000001_SM72LJ,,,
Boots Opticians,OPT_SM72NL_1,OPT,,103 High Street,,Banstead,,SM7 2NL,, - ,,,No ratings yet Rate it yourself - /Services/opticians/LeaveReview/DefaultView.aspx?id=OPT_SM72NL_1,0,0,
Specsavers Opticians,OPT_SM72NL_2,OPT,,105 High Street,,Banstead,Surrey,SM7 2NL,Tel: 01737 858940, - ,,,No ratings yet Rate it yourself - /Services/opticians/LeaveReview/DefaultView.aspx?id=OPT_SM72NL_2,0,0,
M S Kalsi Opticians,TP856,OPT,,75 High Street,,Banstead,Surrey,SM7 2NL,Tel: 01737 362011, - ,,,No ratings yet Rate it yourself - /Services/opticians/LeaveReview/DefaultView.aspx?id=TP856,0,0,
Boots-Banstead - High St ,OP_5KP_12811__000002_SM72NL,OPT,85-87 High Street,,Banstead,Banstead,Surrey,SM7 2NL,Tel: 01737 362948, - ,,,No ratings yet Rate it yourself - /Services/opticians/LeaveReview/DefaultView.aspx?id=OP_5KP_12811__000002_SM72NL,0,0,
DOLLOND & AITCHISON,SM7 2NL__000003_SM72NL,OPT,103 High Street,,Banstead,Surrey,,SM7 2NL,Tel: 01737 362948, - ,,,No ratings yet Rate it yourself - /Services/opticians/LeaveReview/DefaultView.aspx?id=SM7 2NL__000003_SM72NL,0,0,
Banstead Opticians,OPT_SM72NT_1,OPT,,157 High Street,,Banstead,,SM7 2NT,, - ,,,No ratings yet Rate it yourself - /Services/opticians/LeaveReview/DefaultView.aspx?id=OPT_SM72NT_1,0,0,
Boots-Epsom - Ashley Centre (in Boots UK),KT18 5DB__000003_KT185DB,OPT,57 Ashley Centre,,,Epsom,Surrey,KT18 5DB,Tel: 01372 747605, - ,,,7 ratings Rate it yourself - /Services/opticians/LeaveReview/DefaultView.aspx?id=KT18 5DB__000003_KT185DB,,,
Vision Express (UK) Ltd,OP_5KP_12653__000002_KT185DB,OPT,,16 Ashley Centre,,Epsom,Surrey,KT18 5DB,Tel: 01372 747 422, - ,,,No ratings yet Rate it yourself - /Services/opticians/LeaveReview/DefaultView.aspx?id=OP_5KP_12653__000002_KT185DB,0,0,
Leightons Opticians & Hearing Care,OP_5KP_3838__000001_KT198EH,OPT,88 High Street,,Epsom,Surrey,,KT19 8BJ,Tel: 01372 722 656, - ,,,No ratings yet Rate it yourself - /Services/opticians/LeaveReview/DefaultView.aspx?id=OP_5KP_3838__000001_KT198EH,0,0,
Specsavers Opticians,OP_5KP_8008__000001_KT198AH,OPT,,24 High Street,,Epsom,Surrey,KT19 8AH,Tel: 01372 744 250, - ,,,No ratings yet Rate it yourself - /Services/opticians/LeaveReview/DefaultView.aspx?id=OP_5KP_8008__000001_KT198AH,0,0,
SeeAbility Ltd,CO-4941,OPT,,Newplan House,,Surrey,,KT17 1BL,, - ,,,No ratings yet Rate it yourself - /Services/opticians/LeaveReview/DefaultView.aspx?id=CO-4941,0,0,
Eye Matrix Ltd,10007__000001_CR51HE,OPT,DOMICILIARY SERVICE ONLY,,,Old Coulsdon,Surrey,CR5 1HE,Tel: 0800 612 3144, - ,,,No ratings yet Rate it yourself - /Services/opticians/LeaveReview/DefaultView.aspx?id=10007__000001_CR51HE,0,0,
Boots-Caterham,CR3 6LB_18273,OPT,,15-17 Station Avenue,,Caterham,Surrey,CR3 6LB,Tel: 01883 337645, - ,,,No ratings yet Rate it yourself - /Services/opticians/LeaveReview/DefaultView.aspx?id=CR3 6LB_18273,0,0,
Boots Opticians (Caterham),OPT_CR36LB_1,OPT,,15-17 Station Avenue,,Caterham,Surrey,CR3 6LB,Tel: 01883 337645, - ,,,2 ratings Rate it yourself - /Services/opticians/LeaveReview/DefaultView.aspx?id=OPT_CR36LB_1,,,
Specsavers Opticians,00000831__000003_CR36RT,OPT,,10 Church Walk Shopping Centre,,Caterham,Surrey,CR3 6RT,Tel: 01883 333 830, - ,,,No ratings yet Rate it yourself - /Services/opticians/LeaveReview/DefaultView.aspx?id=00000831__000003_CR36RT,0,0,
Rawling & Sons (Opticians) Ltd,OP_5KQ_12732__000001_CR36QB,OPT,2-4 Croydon Road,,,Caterham,Surrey,CR3 6QB,Tel: 01883 343370, - ,,,No ratings yet Rate it yourself - /Services/opticians/LeaveReview/DefaultView.aspx?id=OP_5KQ_12732__000001_CR36QB,0,0,
Specsavers Opticians,TP9GG,OPT,,Sainsburys,Kiln Lane,Epsom,Surrey,KT17 1EQ,Tel: 01372 677928, - ,,,No ratings yet Rate it yourself - /Services/opticians/LeaveReview/DefaultView.aspx?id=TP9GG,0,0,
Lawrence Martin Opticians,OP_5KQ_4117__000001_RH76BW,OPT,14 East Grinstead Road,,,Lingfield,Surrey,RH7 6EP,Tel: 01342 833104, - ,,,No ratings yet Rate it yourself - /Services/opticians/LeaveReview/DefaultView.aspx?id=OP_5KQ_4117__000001_RH76BW,0,0,
Coulsdon Opticians,OP_5K9_7089__000001_CR52NJ,OPT,141 Brighton Road,,Coulsdon,,,CR5 2NJ,Tel: 020 8660 7343, - ,,,No ratings yet Rate it yourself - /Services/opticians/LeaveReview/DefaultView.aspx?id=OP_5K9_7089__000001_CR52NJ,0,0,
Bayfields Opticians & Audiologists,X3N3Z,OPT,68 High Street,,Ewell,Surrey,,KT17 1RL,Tel: 020 8393 7711, - ,,,No ratings yet Rate it yourself - /Services/opticians/LeaveReview/DefaultView.aspx?id=X3N3Z,0,0,
Leightons Opticians & Hearing Care,OP_5KP_3130__000001_KT112LR,OPT,,Unit 5,1-7 Holly Parade,Cobham,Surrey,KT11 3EB,Tel: 01932 867 890, - ,,,No ratings yet Rate it yourself - /Services/opticians/LeaveReview/DefaultView.aspx?id=OP_5KP_3130__000001_KT112LR,0,0,
The Optical Co. ,TP9G6,OPT,,3 High Street,,Cobham,Surrey,KT11 3DH,Tel: 01932 867565, - ,,,No ratings yet Rate it yourself - /Services/opticians/LeaveReview/DefaultView.aspx?id=TP9G6,0,0,
David Clulow Opticians,KT11 2LR__000002_KT112LR,OPT,21 Oakdene Parade,,Cobham,Surrey,,KT11 2LR,Tel: 01932 590415, - ,,,No ratings yet Rate it yourself - /Services/opticians/LeaveReview/DefaultView.aspx?id=KT11 2LR__000002_KT112LR,0,0,
Alexander Opticians,OP_5FK_7452__000002_RH191EQ,OPT,97 London Road,,East Grinstead,West Sussex,,RH19 1EQ,Tel: 01342 323115, - ,,,No ratings yet Rate it yourself - /Services/opticians/LeaveReview/DefaultView.aspx?id=OP_5FK_7452__000002_RH191EQ,0,0,
Scrivens Opticians,OP_5FK_12754__000001_RH191EQ,OPT,71 London Road,,,East Grinstead,West Sussex,RH19 1EQ,Tel: 01342 321657, - ,,,No ratings yet Rate it yourself - /Services/opticians/LeaveReview/DefaultView.aspx?id=OP_5FK_12754__000001_RH191EQ,0,0,
Specsavers Opticians,SS001__000002_RH191AB,OPT,74 - 76 London Road,,East Grinstead,West Sussex,,RH19 1AB,Tel: 01342 335360, - ,,,No ratings yet Rate it yourself - /Services/opticians/LeaveReview/DefaultView.aspx?id=SS001__000002_RH191AB,0,0,
Boots-East Grinstead,OP_5FK_9105__000001_RH194DW,OPT,"Unit K, Queenswalk Shopping Centre",,,East Grinstead,Sussex,RH19 4DW,Tel: 01342 300708, - ,,,No ratings yet Rate it yourself - /Services/opticians/LeaveReview/DefaultView.aspx?id=OP_5FK_9105__000001_RH194DW,0,0,
JOHN ROSE EYE CARE,KT11 1BQ__000001_KT111BQ,OPT,,1 Eden Street,,Kingston,Surrey,KT11 1BQ,Tel: 0208 546 9292, - ,,,1 rating Rate it yourself - /Services/opticians/LeaveReview/DefaultView.aspx?id=KT11 1BQ__000001_KT111BQ,,,
Gordon Turner Optometrists,OP_5M7_0000__000001_SM38SG,OPT,,71 Station Way,Cheam,Surrey,,SM3 8SG,Tel: 020 8642 0563, - ,,,1 rating Rate it yourself - /Services/opticians/LeaveReview/DefaultView.aspx?id=OP_5M7_0000__000001_SM38SG,,,no
Optics Direct,OP_5M7_14655__000001_SM38BU,OPT,,18 Ewell Road,,Cheam,,SM3 8BU,Tel: 0208 642 2193, - ,,,No ratings yet Rate it yourself - /Services/opticians/LeaveReview/DefaultView.aspx?id=OP_5M7_14655__000001_SM38BU,0,0,
A M S Ophthalmic Opticians,OP_5K9_632__000002_CR82HA,OPT,15 Purley Road,,Purley,,,CR8 2HA,Tel: 020 8660 0472, - ,,,15 ratings Rate it yourself - /Services/opticians/LeaveReview/DefaultView.aspx?id=OP_5K9_632__000002_CR82HA,,,
Tesco Opticians,CR82HA060716,OPT,,8 Purley Road,,Purley,Surrey,CR8 2HA,Tel: 0208 218 9438, - ,,,No ratings yet Rate it yourself - /Services/opticians/LeaveReview/DefaultView.aspx?id=CR82HA060716,0,0,
Batemans (Opticians) Ltd,OP_5KQ_10850__000001_RH80QE,OPT,,149 Station Road East,,Oxted,Surrey,RH8 0QE,Tel: 01883 715 510, - ,,,No ratings yet Rate it yourself - /Services/opticians/LeaveReview/DefaultView.aspx?id=OP_5KQ_10850__000001_RH80QE,0,0,
Balham Eyecare Centre,OPT_CR82AA_1,OPT,,4 High Street,Purley,Croydon,,CR8 2AA,Tel: 0207 998 3595, - ,,,No ratings yet Rate it yourself - /Services/opticians/LeaveReview/DefaultView.aspx?id=OPT_CR82AA_1,0,0,
Specsavers,01-14901,OPT,,943 Brighton Road,,Purley,,CR8 2UN,Tel: 0208 6605129, - ,,,No ratings yet Rate it yourself - /Services/opticians/LeaveReview/DefaultView.aspx?id=01-14901,0,0,
Pursers Optometrists,OP_5K9_956__000001_CR82LA,OPT,,958 Brighton Road,Purley,Croydon,,CR8 2LP,Tel: 020 8660 2147, - ,,,No ratings yet Rate it yourself - /Services/opticians/LeaveReview/DefaultView.aspx?id=OP_5K9_956__000001_CR82LA,0,0,
Rawling & Sons Ltd,OP_5K9_10711__000001_CR22LP,OPT,946 Brighton Road,Purley,,Surrey,Surrey,CR8 2LP,Tel: 020 8660 3271, - ,,,No ratings yet Rate it yourself - /Services/opticians/LeaveReview/DefaultView.aspx?id=OP_5K9_10711__000001_CR22LP,0,0,
Leightons Opticians & Hearing Care,110520171021,OPT,,10 High Street,,Sutton,Surrey,SM1 1HN,Tel: 020 8642 2798, - ,,,No ratings yet Rate it yourself - /Services/opticians/LeaveReview/DefaultView.aspx?id=110520171021,0,0,
Thakar Opticians,OP_5KQ_14541__000001_RH80AX,OPT,,81 Station Road East,,Oxted,Surrey,RH8 0AX,Tel: 01883 714 696, - ,,,No ratings yet Rate it yourself - /Services/opticians/LeaveReview/DefaultView.aspx?id=OP_5KQ_14541__000001_RH80AX,0,0,
Jonathan Kerr Optometrists,TP454,OPT,80 Station Road East,80 Station Road East,Oxted,Surrey,,RH8 0PG,Tel: 01883 722 808, - ,,,No ratings yet Rate it yourself - /Services/opticians/LeaveReview/DefaultView.aspx?id=TP454,0,0,
The Optical Gallery (Chessington),OP_5A5_5843__000001_KT91NU,OPT,340 Hook Road,Chessington,,Surrey,,KT9 1NU,Tel: 0208 391 0900, - ,,,No ratings yet Rate it yourself - /Services/opticians/LeaveReview/DefaultView.aspx?id=OP_5A5_5843__000001_KT91NU,0,0,
Specsavers Opticians (Oxted),OPT_RH80BD_1,OPT,,25 Station Road East,,Oxted,Surrey,RH8 0BD,Tel: 01883 772288, - ,,,1 rating Rate it yourself - /Services/opticians/LeaveReview/DefaultView.aspx?id=OPT_RH80BD_1,,,
Specsavers Opticians,OP_5M7_9564__000001_SM11EZ,OPT,76 High Street,Sutton,,Surrey,,SM1 1EZ,Tel: 0208 643 3434, - ,,,5 ratings Rate it yourself - /Services/opticians/LeaveReview/DefaultView.aspx?id=OP_5M7_9564__000001_SM11EZ,,,
Community Eye Care,OP_5L5_3088__000001_GU236EW,OPT,"Suite A, Astra",Vicarage Lane,"Send, Woking",Surrey,,GU23 7JN,Tel: 01483 224914, - ,,,No ratings yet Rate it yourself - /Services/opticians/LeaveReview/DefaultView.aspx?id=OP_5L5_3088__000001_GU236EW,0,0,
Boots-Sutton - High St,SM1 1JG_11122,OPT,109-111 High Street,,,Sutton,Surrey,SM1 1JG,Tel: 0208 661 9488, - ,,,5 ratings Rate it yourself - /Services/opticians/LeaveReview/DefaultView.aspx?id=SM1 1JG_11122,,,
Vision Express,OP_5M7_10667__000001_SM11JH,OPT,,145 High Street,,Sutton,Surrey,SM1 1JH,Tel: 0208 661 0303, - ,,,No ratings yet Rate it yourself - /Services/opticians/LeaveReview/DefaultView.aspx?id=OP_5M7_10667__000001_SM11JH,0,0,
Park & Brown  ,OP_5L9_2765__000001_RH149PF,OPT,32 High Street,,Billingshurst,West Sussex,,RH14 9PF,Tel: 01403 784682, - ,,,13 ratings Rate it yourself - /Services/opticians/LeaveReview/DefaultView.aspx?id=OP_5L9_2765__000001_RH149PF,,,
SECOND SIGHT,SM1 2QN__000002_SM12QN,OPT,,,,.,Surrey,SM1 2QN,Tel: 0208 642 2798, - ,,,No ratings yet Rate it yourself - /Services/opticians/LeaveReview/DefaultView.aspx?id=SM1 2QN__000002_SM12QN,0,0,
Anthony Opticians,OPT_SM38HW_1,OPT,,526 London Road,,Cheam,Surrey,SM3 8HW,Tel: 020 8644 9915, - ,,,No ratings yet Rate it yourself - /Services/opticians/LeaveReview/DefaultView.aspx?id=OPT_SM38HW_1,0,0,
Nicklins Opticians,OP_5L5_9270__000001_GU13JB,OPT,216 High Street,,,Guildford,,GU1 3JB,Tel: 01483 561 256, - ,,,No ratings yet Rate it yourself - /Services/opticians/LeaveReview/DefaultView.aspx?id=OP_5L5_9270__000001_GU13JB,0,0,
For Your Eyes,OP_5M7_14651__000001_SM60LY,OPT,,116 Woodcote Road,,Wallington,Surrey,SM6 0LY,Tel: 0208 647 3644, - ,,,No ratings yet Rate it yourself - /Services/opticians/LeaveReview/DefaultView.aspx?id=OP_5M7_14651__000001_SM60LY,0,0,
Wallington Opticians,OPT_SM60LY_1,OPT,,116 Woodcote Road,,Wallington,Surrey,SM6 0LY,Tel: 020 8647 3644, - ,,,No ratings yet Rate it yourself - /Services/opticians/LeaveReview/DefaultView.aspx?id=OPT_SM60LY_1,0,0,
SPECSAVERS,SM6 0LY__000002_SM60LY,OPT,,76 Woodcote Road,,Wallington,Surrey,SM6 0LY,Tel: 0208 835 3680, - ,,,1 rating Rate it yourself - /Services/opticians/LeaveReview/DefaultView.aspx?id=SM6 0LY__000002_SM60LY,,,
Batemans (Opticians) Ltd,OP_5L5_2184__000001_GU13HN,OPT,162 High Street,,Guildford,,,GU1 3HN,Tel: 01483 572 953, - ,,,No ratings yet Rate it yourself - /Services/opticians/LeaveReview/DefaultView.aspx?id=OP_5L5_2184__000001_GU13HN,0,0,
Optical Express,GU1 3EZ_11111,OPT,"Suite 3, 1 Milkhouse gate",,,Guildford,Surrey,GU1 3EZ,Tel: 0800 023 2020, - ,,,No ratings yet Rate it yourself - /Services/opticians/LeaveReview/DefaultView.aspx?id=GU1 3EZ_11111,0,0,
Punch Opticians,OP_5LG_14644__000002_SM60NN,OPT,400 Garrett Lane,,Wandsworth,,,SM6 0NN,Tel: 0208 669 2631, - ,,,No ratings yet Rate it yourself - /Services/opticians/LeaveReview/DefaultView.aspx?id=OP_5LG_14644__000002_SM60NN,0,0,
Dollond & Aitchison,OP_5L5_7322__000001_GU13HE,OPT,94 High Street,,Guildford,,,GU1 3HE,Tel: 01483 570 093, - ,,,No ratings yet Rate it yourself - /Services/opticians/LeaveReview/DefaultView.aspx?id=OP_5L5_7322__000001_GU13HE,0,0,
David Clulow Opticians,OP_GU13DP_89449,OPT,,103 High Street,,Guildford,,GU1 3DP,Tel: 01483 453339, - ,,,No ratings yet Rate it yourself - /Services/opticians/LeaveReview/DefaultView.aspx?id=OP_GU13DP_89449,0,0,
Esher Eye Centre,OP_5KP_14521__000001_KT109QJ,OPT,122 High Street,,Esher,,,KT10 9QJ,Tel: 01372 464492, - ,,,No ratings yet Rate it yourself - /Services/opticians/LeaveReview/DefaultView.aspx?id=OP_5KP_14521__000001_KT109QJ,0,0,
Boots Optician Ltd,OPT_GU14EQ_1,OPT,,22-24 Swan Lane,,Guildford,Surrey,GU1 4EQ,Tel: 01483 573637, - ,,,No ratings yet Rate it yourself - /Services/opticians/LeaveReview/DefaultView.aspx?id=OPT_GU14EQ_1,0,0,
Boots-Guildford - Swan Lane,OP_5L5_629__000001_GU14EQ,OPT,22-24 Swan Lane,,,Guildford,Surrey,GU1 4EQ,Tel: 01483 573637, - ,,,No ratings yet Rate it yourself - /Services/opticians/LeaveReview/DefaultView.aspx?id=OP_5L5_629__000001_GU14EQ,0,0,
Bayfields Opticians,OP_5L5_4821__000001_GU13DY,OPT,37 High Street,,Guildford,Guildford,,GU1 3DY,Tel: 01483 575 650, - ,,,2 ratings Rate it yourself - /Services/opticians/LeaveReview/DefaultView.aspx?id=OP_5L5_4821__000001_GU13DY,,,
Vision Express (UK) Ltd,OP_5L5_719__000002_GU13DY,OPT,51 High Street,,,Guildford,,GU1 3DY,Tel: 01483 300 344, - ,,,No ratings yet Rate it yourself - /Services/opticians/LeaveReview/DefaultView.aspx?id=OP_5L5_719__000002_GU13DY,0,0,
Baileys Opticians,OP_5K9_7651__000002_CR29LA,OPT,1 Limpsfield Road,Sanderstead,,South Croydon,,CR2 9LA,Tel: 020 8657 3525, - ,,,No ratings yet Rate it yourself - /Services/opticians/LeaveReview/DefaultView.aspx?id=OP_5K9_7651__000002_CR29LA,0,0,