Organisation Name,NACS Code,Organisation Type,Address1,Address2,Address3,Address4,Address5,PostCode,Telephone Number,Opening time,Value  (Opening time),Banding Classification  (Opening time),NHS.UK users rating,Value  (NHS.UK users rating),Banding Classification  (NHS.UK users rating),Car parking (Is there car parking at this organisation?)
Sanders Opticians,OP_5KR_9297__000001_PL277DR,OPT,53a Molesworth Street,Wadebridge,Cornwall,,,PL27 7DR,Tel: 01208 812854, - ,,,1 rating Rate it yourself - /Services/opticians/LeaveReview/DefaultView.aspx?id=OP_5KR_9297__000001_PL277DR,,,
Specsavers Opticians,OP_5KR_2712__000001_PL312JB,OPT,51 Fore Street,Bodmin,Cornwall,,,PL31 2JB,Tel: 01208 72959, - ,,,2 ratings Rate it yourself - /Services/opticians/LeaveReview/DefaultView.aspx?id=OP_5KR_2712__000001_PL312JB,,,
Boots-Bodmin,OP_5KR_205__000001_PL312HQ,OPT,12 Fore Street,,,Bodmin,Cornwall,PL31 2HQ,Tel: 01208 72815, - ,,,No ratings yet Rate it yourself - /Services/opticians/LeaveReview/DefaultView.aspx?id=OP_5KR_205__000001_PL312HQ,0,0,
Varnals Opticians Ltd,OP_5KT_3947__000001_TR71DN,OPT,25 East Street,Newquay,Cornwall,,,TR7 1DN,Tel: 01637 872000, - ,,,No ratings yet Rate it yourself - /Services/opticians/LeaveReview/DefaultView.aspx?id=OP_5KT_3947__000001_TR71DN,0,0,
Specsavers Opticians,5KT 2798__000001_TR71DJ,OPT,37 Bank Street,,,Newquay,,TR7 1DJ,Tel: 01637 854400, - ,,,No ratings yet Rate it yourself - /Services/opticians/LeaveReview/DefaultView.aspx?id=5KT 2798__000001_TR71DJ,0,0,
Grant Reid Optometrist Ltd,OP_5KT_3763__000001_PL255AA,OPT,9 Grants Walk,St. Austell,Cornwall,,,PL25 5AA,Tel: 01726 73614, - ,,,2 ratings Rate it yourself - /Services/opticians/LeaveReview/DefaultView.aspx?id=OP_5KT_3763__000001_PL255AA,,,
Specsavers Opticians,OP_5KT_6991__000002_PL255PY,OPT,39 Fore Street,St. Austell,,Cornwall,,PL25 5PY,Tel: 01726 69633, - ,,,1 rating Rate it yourself - /Services/opticians/LeaveReview/DefaultView.aspx?id=OP_5KT_6991__000002_PL255PY,,,
Boots-St Austell - Fore St,OP_5KT_11626__000001_PL255PY,OPT,29 Fore Street,,,St Austell,Cornwall,PL25 5EP,Tel: 01726 75615, - ,,,1 rating Rate it yourself - /Services/opticians/LeaveReview/DefaultView.aspx?id=OP_5KT_11626__000001_PL255PY,,,
Boots Opticians Professional Services Ltd,OP_5KT_85__000001_PL255LJ,OPT,55 Aylmer Square,St. Austell,Cornwall,,,PL25 5LJ,Tel: 01726 73302, - ,,,1 rating Rate it yourself - /Services/opticians/LeaveReview/DefaultView.aspx?id=OP_5KT_85__000001_PL255LJ,,,
Asda Stores Ltd,OP_5KT_14200__000001_PL254PR,OPT,Cromwell Road,,St Austell,Cornwall,,PL25 4PR,Tel: 01726 223812, - ,,,No ratings yet Rate it yourself - /Services/opticians/LeaveReview/DefaultView.aspx?id=OP_5KT_14200__000001_PL254PR,0,0,
Luke Pascoe Mobile Optician,01-17801__000001_PL231EN,OPT,10 Hill Hay Close,Fowey,St Austell,Cornwall,,PL23 1EN,Tel: 01726 833223, - ,,,No ratings yet Rate it yourself - /Services/opticians/LeaveReview/DefaultView.aspx?id=01-17801__000001_PL231EN,0,0,
Standen Opticians,OP_5KT_11877__000001_TR12AA,OPT,2 Highshore House,New Bridge Street,Truro,Cornwall,,TR1 2AA,Tel: 01872 276644, - ,,,No ratings yet Rate it yourself - /Services/opticians/LeaveReview/DefaultView.aspx?id=OP_5KT_11877__000001_TR12AA,0,0,
Boots-Truro - River St,OP_5KT_11965__000001_TR12SJ,OPT,36 River Street,,,Truro,Cornwall,TR1 2SJ,Tel: 01872 223459, - ,,,No ratings yet Rate it yourself - /Services/opticians/LeaveReview/DefaultView.aspx?id=OP_5KT_11965__000001_TR12SJ,0,0,
Specsavers Opticians,OP_5KT_7567__000002_TR12SJ,OPT,33a River Street,Truro,Cornwall,,,TR1 2SJ,Tel: 01872 223818, - ,,,No ratings yet Rate it yourself - /Services/opticians/LeaveReview/DefaultView.aspx?id=OP_5KT_7567__000002_TR12SJ,0,0,
Vision Express UK Ltd,01-23183__000001_TR12RL,OPT,10 St Nicholas Street,10 St Nicholas Street,Truro,"Truro, Cornwall",,TR1 2RL,Tel: 01872 277747, - ,,,No ratings yet Rate it yourself - /Services/opticians/LeaveReview/DefaultView.aspx?id=01-23183__000001_TR12RL,0,0,
Ibuntu ,TP917_21_01_2019,OPT,,66 Lemon Street,,Truro,Cornwall,TR1 2PN,Tel: 01872 261 569, - ,,,3 ratings Rate it yourself - /Services/opticians/LeaveReview/DefaultView.aspx?id=TP917_21_01_2019,,,
Andrew Keirl,OP_5KR_4558__000001_PL146AF,OPT,The Parade,Liskeard,Cornwall,,,PL14 6AF,Tel: 01579 346694, - ,,,No ratings yet Rate it yourself - /Services/opticians/LeaveReview/DefaultView.aspx?id=OP_5KR_4558__000001_PL146AF,0,0,
Thompsons Opticians - Pike Street,TP3P9,OPT,Thompsons Opticians,4a Pike Street,,Liskeard,Cornwall,PL14 3JE,Tel: 01579 343348, - ,,,No ratings yet Rate it yourself - /Services/opticians/LeaveReview/DefaultView.aspx?id=TP3P9,0,0,
Bude Eye Centre,5KR  0118404__000001_EX238AY,OPT,13 Queen Street,,Bude,Cornwall,,EX23 0AY,Tel: 01288 350041, - ,,,No ratings yet Rate it yourself - /Services/opticians/LeaveReview/DefaultView.aspx?id=5KR  0118404__000001_EX238AY,0,0,
Thompsons Opticians - The Quay,TP9JF,OPT,,2 The Quay,,West Looe,,PL13 2BX,, - ,,,No ratings yet Rate it yourself - /Services/opticians/LeaveReview/DefaultView.aspx?id=TP9JF,0,0,
Specsavers (Redruth),TP714,OPT,,70 Fore Street,,Redruth,,TR15 2AF,, - ,,,No ratings yet Rate it yourself - /Services/opticians/LeaveReview/DefaultView.aspx?id=TP714,0,0,
The Bond Street Optician,OP_5FM_4846__000001_TR152QB,OPT,6 Bond Street,Redruth,Cornwall,,,TR15 2QB,Tel: 01209 216900, - ,,,No ratings yet Rate it yourself - /Services/opticians/LeaveReview/DefaultView.aspx?id=OP_5FM_4846__000001_TR152QB,0,0,
Specsavers Opticians,OP_5KR_1112__000002_PL158AP,OPT,12 Church Street,Launceston,Cornwall,,,PL15 8AP,Tel: 01566 774354, - ,,,No ratings yet Rate it yourself - /Services/opticians/LeaveReview/DefaultView.aspx?id=OP_5KR_1112__000002_PL158AP,0,0,
Vision Express (UK) Ltd,OP_5KR_5157__000001_PL158AP,OPT,16 Church Street,Launceston,Cornwall,,,PL15 8AP,Tel: 01566 775544, - ,,,No ratings yet Rate it yourself - /Services/opticians/LeaveReview/DefaultView.aspx?id=OP_5KR_5157__000001_PL158AP,0,0,
Vision Express (UK) Ltd,OP_5KR_607__000002_EX238JS,OPT,22 Belle Vue,Bude,Cornwall,,,EX23 8JS,Tel: 01288 352302, - ,,,No ratings yet Rate it yourself - /Services/opticians/LeaveReview/DefaultView.aspx?id=OP_5KR_607__000002_EX238JS,0,0,
Bude Eye Centre,C/0002/5QQ/A__000002_EX238AY,OPT,7 Queen Street,,Bude,Cornwall,,EX23 8AY,Tel: 01288 350041, - ,,,No ratings yet Rate it yourself - /Services/opticians/LeaveReview/DefaultView.aspx?id=C/0002/5QQ/A__000002_EX238AY,0,0,
Histed & Roberts Ltd,CO-3437__000003_TR108BH,OPT,96 Lower Market Street,,Penryn,Cornwall,,TR10 8BH,Tel: 01326 373837, - ,,,No ratings yet Rate it yourself - /Services/opticians/LeaveReview/DefaultView.aspx?id=CO-3437__000003_TR108BH,0,0,
Specsavers Opticians,OP_5FM_13796__000002_TR148AA,OPT,4 Trelowarren Street,Camborne,Cornwall,,,TR14 8AA,Tel: 01209 710022, - ,,,No ratings yet Rate it yourself - /Services/opticians/LeaveReview/DefaultView.aspx?id=OP_5FM_13796__000002_TR148AA,0,0,
Vision Express Ltd,C/0047/5QQ/M(2)__000004_EX226BB,OPT,4 Bodmin Street,,Holsworthy,Devon,,EX22 6BB,, - ,,,No ratings yet Rate it yourself - /Services/opticians/LeaveReview/DefaultView.aspx?id=C/0047/5QQ/M(2)__000004_EX226BB,0,0,
G C Bateman Ltd,OP_5FQ_3241__000001_EX226BB,OPT,4 Bodmin Street,,Holsworthy,,,EX22 6BB,Tel: 01409 253215, - ,,,No ratings yet Rate it yourself - /Services/opticians/LeaveReview/DefaultView.aspx?id=OP_5FQ_3241__000001_EX226BB,0,0,
FL & I Keast,OP_5FM_4588__000001_TR274DG,OPT,18 Commercial Road,Hayle,Cornwall,,,TR27 4DG,Tel: 01736 753145, - ,,,No ratings yet Rate it yourself - /Services/opticians/LeaveReview/DefaultView.aspx?id=OP_5FM_4588__000001_TR274DG,0,0,
Noakes Habermehl & Kerr Opticians,,OPT,,Chy-An-Gweal St Ives Road,,Carbis Bay,Cornwall,TR26 2RS,Tel: 01736 798495, - ,,,N/A - Data not available,,,
