Organisation Name,NACS Code,Organisation Type,Address1,Address2,Address3,Address4,Address5,PostCode,Telephone Number,Opening time,Value  (Opening time),Banding Classification  (Opening time),NHS.UK users rating,Value  (NHS.UK users rating),Banding Classification  (NHS.UK users rating),Car parking (Is there car parking at this organisation?)
Rawlinsons Optometrists,OP_5N9_0096__000001_PE252AH,OPT,,1 Lumley Avenue,,Skegness,Lincolnshire,PE25 2AH,Tel: 01754 766773, - ,,,2 ratings Rate it yourself - /Services/opticians/LeaveReview/DefaultView.aspx?id=OP_5N9_0096__000001_PE252AH,,,no
Specsavers Opticians,OP_5H9_12159__000002_PE253NG,OPT,66 Lumley Road,,Skegness,,,PE25 3NG,Tel: 01754 898000, - ,,,No ratings yet Rate it yourself - /Services/opticians/LeaveReview/DefaultView.aspx?id=OP_5H9_12159__000002_PE253NG,0,0,
Boots-Skegness,OP_5H9_10633__000001_PE253NU,OPT,Unit 7,The Hildreds Shopping Centre,,Skegness,Lincolnshire,PE25 3NU,Tel: 01754 763 146, - ,,,1 rating Rate it yourself - /Services/opticians/LeaveReview/DefaultView.aspx?id=OP_5H9_10633__000001_PE253NU,,,
Alford Opticians (Garry Crome),OP_5H9_6976__000001_LN139AF,OPT,,1 South Street,,Alford,Lincolnshire,LN13 9AF,Tel: 01507 462992, - ,,,3 ratings Rate it yourself - /Services/opticians/LeaveReview/DefaultView.aspx?id=OP_5H9_6976__000001_LN139AF,,,no
Spilsby Opticians,OP_5H9_8478__000001_PE235EF,OPT,6 Church Street,,Spilsby,,,PE23 5EF,Tel: 01790 753948, - ,,,No ratings yet Rate it yourself - /Services/opticians/LeaveReview/DefaultView.aspx?id=OP_5H9_8478__000001_PE235EF,0,0,no
G J Drew & Partners,OP_5H9_8302__000001_LN122AF,OPT,47 Victoria Road,,Mablethorpe,,,LN12 2AF,Tel: 01507 473202, - ,,,No ratings yet Rate it yourself - /Services/opticians/LeaveReview/DefaultView.aspx?id=OP_5H9_8302__000001_LN122AF,0,0,
Lydia Hayes Opticians,C-0105-Q59,OPT,,1 & 2 Regents Mews,Victoria Road,Lincolnshire,Lincolnshire,LN12 2AQ,Tel: 01507 472842, - ,,,7 ratings Rate it yourself - /Services/opticians/LeaveReview/DefaultView.aspx?id=C-0105-Q59,,,
Hunstanton EyeCare,OP_5CY_7973__000001_PE365HD,OPT,Hunstanton Eyecare,44 Church Street,,Hunstanton,Norfolk,PE36 5HD,Tel: 01485 532326, - ,,,No ratings yet Rate it yourself - /Services/opticians/LeaveReview/DefaultView.aspx?id=OP_5CY_7973__000001_PE365HD,0,0,
Specsavers Hunstanton,TP98K,OPT,,29 High Street,,Hunstanton,,PE36 5AB,Tel: 01485 500490, - ,,,No ratings yet Rate it yourself - /Services/opticians/LeaveReview/DefaultView.aspx?id=TP98K,0,0,
Anglia Regional Co-operative Society Ltd,5PQ0001__000001_PE365EP,OPT,69 Westgate,,Hunstanton,Norfolk,,PE36 5EP,Tel: 01485 532381, - ,,,No ratings yet Rate it yourself - /Services/opticians/LeaveReview/DefaultView.aspx?id=5PQ0001__000001_PE365EP,0,0,
Horncastle Opticians (Garry Crome),OP_5H9_8477__000002_LN95BL,OPT,,6a High Street,,Horncastle,Lincolnshire,LN9 5BL,Tel: 01507 526205, - ,,,No ratings yet Rate it yourself - /Services/opticians/LeaveReview/DefaultView.aspx?id=OP_5H9_8477__000002_LN95BL,0,0,no
Boots-Horncastle,OP_5H9_5286__000001_LN95HZ,OPT,,10 Bridge Street,Horncastle,Lincolnshire,,LN9 5HZ,Tel: 01507 527044, - ,,,No ratings yet Rate it yourself - /Services/opticians/LeaveReview/DefaultView.aspx?id=OP_5H9_5286__000001_LN95HZ,0,0,
David Hallgate Optometrists (I.O.E Ltd),OP_5H9_13813__000001_PE216SE,OPT,,86/88 Wide Bargate,,Boston,Lincolnshire,PE21 6SE,Tel: 01205 310 710, - ,,,1 rating Rate it yourself - /Services/opticians/LeaveReview/DefaultView.aspx?id=OP_5H9_13813__000001_PE216SE,,,yes
Enderbys of Boston,OP_5H9_13814__000002_PE216SE,OPT,,84 Wide Bargate,,Boston,,PE21 6SE,Tel: 01205 311181, - ,,,1 rating Rate it yourself - /Services/opticians/LeaveReview/DefaultView.aspx?id=OP_5H9_13814__000002_PE216SE,,,no
Peebles & Hilton,OP_5H9_2503__000002_PE216PA,OPT,Lyndon,Tawney Street,,Boston,,PE21 6PA,Tel: 01205 365395, - ,,,No ratings yet Rate it yourself - /Services/opticians/LeaveReview/DefaultView.aspx?id=OP_5H9_2503__000002_PE216PA,0,0,yes
R & T Opticians,OP_5H9_2127__000001_PE216EU,OPT,30-32 Dolphin Lane,,Boston,,,PE21 6EU,Tel: 01205 355550, - ,,,1 rating Rate it yourself - /Services/opticians/LeaveReview/DefaultView.aspx?id=OP_5H9_2127__000001_PE216EU,,,yes
Dollond & Aitchison,OP_5H9_5271__000001_PE216LS,OPT,8 Market Place,Boston,Lincolnshire,,,PE21 6LS,Tel: 01205 351414, - ,,,No ratings yet Rate it yourself - /Services/opticians/LeaveReview/DefaultView.aspx?id=OP_5H9_5271__000001_PE216LS,0,0,
Specsavers Opticians,OP_5H9_1081__000002_PE216EH,OPT,29a Market Place,,Boston,,,PE21 6EH,Tel: 01205 353263, - ,,,No ratings yet Rate it yourself - /Services/opticians/LeaveReview/DefaultView.aspx?id=OP_5H9_1081__000002_PE216EH,0,0,
Boots-Boston,OP_PE216LS_17891,OPT,,8 Market Place,,Boston,Lincolnshire,PE21 6EH,Tel: 01205 351414, - ,,,No ratings yet Rate it yourself - /Services/opticians/LeaveReview/DefaultView.aspx?id=OP_PE216LS_17891,0,0,
Louth Vision Centre,OP_5H9_13828__000001_LN119NR,OPT,,Louth Vision Centre,4 Market Place,Louth,Lincolnshire,LN11 9NR,Tel: 01507 609499, - ,,,3 ratings Rate it yourself - /Services/opticians/LeaveReview/DefaultView.aspx?id=OP_5H9_13828__000001_LN119NR,,,
Stephen Hewitt eyecare,OP_5H9_13823__000001_LN119JG,OPT,21 Mercer Row,Louth,,.,,LN11 9JG,Tel: 01507 607276, - ,,,No ratings yet Rate it yourself - /Services/opticians/LeaveReview/DefaultView.aspx?id=OP_5H9_13823__000001_LN119JG,0,0,
Peebles & Hilton,OP_5H9_2611__000002_LN44SG,OPT,,16 Silver Street,,Coningsby,Lincolnshire,LN4 4SG,Tel: 01526 344556, - ,,,No ratings yet Rate it yourself - /Services/opticians/LeaveReview/DefaultView.aspx?id=OP_5H9_2611__000002_LN44SG,0,0,no
Opticks Opticians,OP_5H9_2501__000001_LN106QL,OPT,,7 Station Road,Woodhall Spa,Lincolnshire,,LN10 6QL,Tel: 01526 352236, - ,,,No ratings yet Rate it yourself - /Services/opticians/LeaveReview/DefaultView.aspx?id=OP_5H9_2501__000001_LN106QL,0,0,
Wigram & Ware Ltd,OP_5CY_14944__000001_PE314HH,OPT,4 Jubilee Court,Dersingham,Norfolk,,,PE31 6HH,Tel: 01485 544850, - ,,,1 rating Rate it yourself - /Services/opticians/LeaveReview/DefaultView.aspx?id=OP_5CY_14944__000001_PE314HH,,,
Richards Optometrists,OP_5JM_3774__000002_NR231AG,OPT,15 Station Road,,Wells-Next-The-Sea,,,NR23 1AG,Tel: 01328 711014, - ,,,No ratings yet Rate it yourself - /Services/opticians/LeaveReview/DefaultView.aspx?id=OP_5JM_3774__000002_NR231AG,0,0,
Holbeach Optical Ltd,0925011216,OPT,,38 High Street,,Holbeach,,PE12 7DY,, - ,,,No ratings yet Rate it yourself - /Services/opticians/LeaveReview/DefaultView.aspx?id=0925011216,0,0,
Stradling Opticians,OP_5H9_8187__000001_PE127LW,OPT,12 West End,Holbeach,Spalding,,,PE12 7LW,Tel: 01406 423239, - ,,,No ratings yet Rate it yourself - /Services/opticians/LeaveReview/DefaultView.aspx?id=OP_5H9_8187__000001_PE127LW,0,0,
Clark Family Eyecare Ltd,OP_PE114ST_46350,OPT,Clark Family Eyecare,20 Market Place,Donington,Spalding,Lincolnshire,PE11 4ST,Tel: 01775 821888, - ,,,No ratings yet Rate it yourself - /Services/opticians/LeaveReview/DefaultView.aspx?id=OP_PE114ST_46350,0,0,yes
"Keen, King & Jones",OP_5AN_7360__000001_DN370LS,OPT,4 Kirkgate,Waltham,Grimsby,,,DN37 0LS,Tel: 01472 824643, - ,,,No ratings yet Rate it yourself - /Services/opticians/LeaveReview/DefaultView.aspx?id=OP_5AN_7360__000001_DN370LS,0,0,
Scrivens Opticians & Hearing Care,OP_5JM_4716__000001_NR219AF,OPT,25 Norwich Street,25 Norwich Street,,Fakenham,Norfolk,NR21 9AF,Tel: 01328 862216, - ,,,No ratings yet Rate it yourself - /Services/opticians/LeaveReview/DefaultView.aspx?id=OP_5JM_4716__000001_NR219AF,0,0,
Boots-Fakenham,OP_5JM_14136__000001_NR219AG,OPT,3 Bridge Street,,,Fakenham,Norfolk,NR21 9AG,Tel: 01328 862760, - ,,,No ratings yet Rate it yourself - /Services/opticians/LeaveReview/DefaultView.aspx?id=OP_5JM_14136__000001_NR219AG,0,0,
Boots Opticians Ltd,OP_5JM_5671__000001_NR210JH,OPT,3 Bridge Street,,Fakenham,,,NR21 0JH,Tel: 01328 862760, - ,,,1 rating Rate it yourself - /Services/opticians/LeaveReview/DefaultView.aspx?id=OP_5JM_5671__000001_NR210JH,,,
