Organisation Name,NACS Code,Organisation Type,Address1,Address2,Address3,Address4,Address5,PostCode,Telephone Number,Opening time,Value  (Opening time),Banding Classification  (Opening time),NHS.UK users rating,Value  (NHS.UK users rating),Banding Classification  (NHS.UK users rating),Car parking (Is there car parking at this organisation?)
Taylor's Opticians,OP_5H3_13914__000001_WA66QS,OPT,4 Eddisbury Square,,Frodsham,Cheshire,Cheshire,WA6 6QS,Tel: 01928 732255, - ,,,No ratings yet Rate it yourself - /Services/opticians/LeaveReview/DefaultView.aspx?id=OP_5H3_13914__000001_WA66QS,0,0,
Boots-Frodsham,OP_5H3_10421__000001_WA66QW,OPT,32 Church Street,,Frodsham,Cheshire,,WA6 6QW,Tel: 01928 735341, - ,,,No ratings yet Rate it yourself - /Services/opticians/LeaveReview/DefaultView.aspx?id=OP_5H3_10421__000001_WA66QW,0,0,
M E Cook,OP_5H3_13362__000001_WA66PN,OPT,33 Church Street,,Frodsham,Cheshire,,WA6 6PN,Tel: 01928 733609, - ,,,No ratings yet Rate it yourself - /Services/opticians/LeaveReview/DefaultView.aspx?id=OP_5H3_13362__000001_WA66PN,0,0,
Mullens Opticians,OP_5J1_9152__000002_WA72BX,OPT,98 River Walk,Halton Lea,Runcorn,Cheshire,,WA7 2BX,Tel: 01928 790083, - ,,,No ratings yet Rate it yourself - /Services/opticians/LeaveReview/DefaultView.aspx?id=OP_5J1_9152__000002_WA72BX,0,0,
Specsavers Opticians,OP_5J1_4930__000001_WA72BY,OPT,104 Bridge Walk,Halton Lea,Runcorn,Cheshire,,WA7 2BY,Tel: 01928 716200, - ,,,No ratings yet Rate it yourself - /Services/opticians/LeaveReview/DefaultView.aspx?id=OP_5J1_4930__000001_WA72BY,0,0,
P & A Morgan Opticians,OP_5J1_3675__000001_WA71NA,OPT,2 Alcock Street,,,Runcorn,Cheshire,WA7 1NA,Tel: 01928 572177, - ,,,1 rating Rate it yourself - /Services/opticians/LeaveReview/DefaultView.aspx?id=OP_5J1_3675__000001_WA71NA,,,
Taylors Opticians,5J1 2583__000002_WA71LX,OPT,33 Church Street,,Runcorn,Cheshire,,WA7 1LX,Tel: 01928 574535, - ,,,No ratings yet Rate it yourself - /Services/opticians/LeaveReview/DefaultView.aspx?id=5J1 2583__000002_WA71LX,0,0,
Specs 2 U (MBOS Ltd),OP_WA88TL_29557,OPT,,Unit 7,St Michael's Industrial Estate,Widnes,Cheshire,WA8 8TL,Tel: 0151 420 0007, - ,,,No ratings yet Rate it yourself - /Services/opticians/LeaveReview/DefaultView.aspx?id=OP_WA88TL_29557,0,0,
Merton Beck Opticians,OP_5J1_7606__000001_WA86AZ,OPT,39 Widnes Road,,Widnes,,,WA8 6AZ,Tel: 0151 424 2141, - ,,,No ratings yet Rate it yourself - /Services/opticians/LeaveReview/DefaultView.aspx?id=OP_5J1_7606__000001_WA86AZ,0,0,
Vision Express (UK) Ltd,OP_5J1_6727__000001_WA86UD,OPT,10  Green Oaks Shopping Centre,Widnes,Cheshire,,,WA8 6UD,Tel: 0151 257 9559, - ,,,No ratings yet Rate it yourself - /Services/opticians/LeaveReview/DefaultView.aspx?id=OP_5J1_6727__000001_WA86UD,0,0,
Specsavers Opticians,OP_5J1_4210__000002_WA86JA,OPT,47 Albert Road,Widnes,Cheshire,,,WA8 6JA,Tel: 0151 495 3040, - ,,,No ratings yet Rate it yourself - /Services/opticians/LeaveReview/DefaultView.aspx?id=OP_5J1_4210__000002_WA86JA,0,0,
i-Care Opticians,OP_5J1_0002__000001_WA86UE,OPT,"Unit G4, Widnes Market Hall",Green Oaks,Bradley Way,Widnes,Cheshire,WA8 6UE,Tel: 0151 4236324, - ,,,1 rating Rate it yourself - /Services/opticians/LeaveReview/DefaultView.aspx?id=OP_5J1_0002__000001_WA86UE,,,
Scrivens Ltd,OP_5J1_10784__000001_WA86JW,OPT,,4,Albert Square,Widnes,Cheshire,WA8 6JW,Tel: 0151 424 3207, - ,,,No ratings yet Rate it yourself - /Services/opticians/LeaveReview/DefaultView.aspx?id=OP_5J1_10784__000001_WA86JW,0,0,
Looking Ahead,OP_5H4_4160__000002_CW83EU,OPT,37 Northwich Road,Weaverham,Nr Northwich,Cheshire,,CW8 3EU,Tel: 01606 853300, - ,,,No ratings yet Rate it yourself - /Services/opticians/LeaveReview/DefaultView.aspx?id=OP_5H4_4160__000002_CW83EU,0,0,
Martin & Kaye Opticians,OP_5HC_14726__000002_L242SE,OPT,19 Penketh Drive,Speke,Liverpool,,,L24 2WZ,Tel: 0151 486 3018, - ,,,No ratings yet Rate it yourself - /Services/opticians/LeaveReview/DefaultView.aspx?id=OP_5HC_14726__000002_L242SE,0,0,
Rosenburgh Opticians Ltd,OP_5J2_2525__000004_WA52EY,OPT,15 Honiton Way,Penketh,Warrington,Cheshire,,WA5 2EY,Tel: 01925 724000, - ,,,No ratings yet Rate it yourself - /Services/opticians/LeaveReview/DefaultView.aspx?id=OP_5J2_2525__000004_WA52EY,0,0,
PSM VIsion Services Ltd,OL/CO-3338/5J2__000002_WA46SR,OPT,Walton Lodge,Hill Cliffe Road,Walton,Warrington,,WA4 6NU,Tel: 01925 210006, - ,,,No ratings yet Rate it yourself - /Services/opticians/LeaveReview/DefaultView.aspx?id=OL/CO-3338/5J2__000002_WA46SR,0,0,
Asda Stores Limited,CH65 0BZ__000001_CH650BZ,OPT,Wellington Road,,Ellesmere Port,Cheshire,,CH65 0BZ,Tel: 0151 348 6120, - ,,,No ratings yet Rate it yourself - /Services/opticians/LeaveReview/DefaultView.aspx?id=CH65 0BZ__000001_CH650BZ,0,0,
J M Bennett,OP_5HC_13836__000001_L250NN,OPT,281 Speke Road,Woolton,Liverpool,,,L25 0NN,Tel: 0151 486 4121, - ,,,No ratings yet Rate it yourself - /Services/opticians/LeaveReview/DefaultView.aspx?id=OP_5HC_13836__000001_L250NN,0,0,
Boots-Ellesmere Port,OP_5H6_10570__000001_CH650AL,OPT,33 Marina Drive,,,Ellesmere Port,Cheshire,CH65 0AL,Tel: 0151 357 2464, - ,,,No ratings yet Rate it yourself - /Services/opticians/LeaveReview/DefaultView.aspx?id=OP_5H6_10570__000001_CH650AL,0,0,
Ellesmere Optical Ltd t/a Orrell Opticians,OP_5H6_10095__000001_CH650AA,OPT,,68 Whitby Road,,Ellesmere Port,Cheshire,CH65 0AA,Tel: 0151 355 1077, - ,,,1 rating Rate it yourself - /Services/opticians/LeaveReview/DefaultView.aspx?id=OP_5H6_10095__000001_CH650AA,,,
Ellesmere Port Visionplus Limited,OP_5H6_13343__000001_CH650BH,OPT,15 Marina Walk,Port Arcades,Ellesmere Port,,,CH65 0BH,Tel: 0151 355 3331, - ,,,No ratings yet Rate it yourself - /Services/opticians/LeaveReview/DefaultView.aspx?id=OP_5H6_13343__000001_CH650BH,0,0,
Boots-Liverpool - Hunts Cross,OP_5HC_723__000001_L249GB,OPT,19 Hunts Cross Centre,"Asda Complex, Speke Hall Road",,Liverpool,Merseyside,L24 9GB,Tel: 0151 448 1992, - ,,,No ratings yet Rate it yourself - /Services/opticians/LeaveReview/DefaultView.aspx?id=OP_5HC_723__000001_L249GB,0,0,
Batty and Dexter Hunts Cross,C2955NL__000003_L249GB,OPT,"Unit M, Hunts Cross Shopping Centre",Hunts Cross,,Liverpool,,L24 9GB,Tel: 01514489620, - ,,,No ratings yet Rate it yourself - /Services/opticians/LeaveReview/DefaultView.aspx?id=C2955NL__000003_L249GB,0,0,
Asda Stores Ltd,OPT_L24 9WA,OPT,,Hunts Cross Shopping Centre,,Liverpool,,L24 9WA,Tel: 0151 728 4612, - ,,,No ratings yet Rate it yourself - /Services/opticians/LeaveReview/DefaultView.aspx?id=OPT_L24 9WA,0,0,
Mullens Opticians,OP_5J2_9150__000003_WA46HW,OPT,10 The Forge Shopping Centre,London Road,Stockton Heath,Warrington,,WA4 6HW,Tel: 01925 268608, - ,,,2 ratings Rate it yourself - /Services/opticians/LeaveReview/DefaultView.aspx?id=OP_5J2_9150__000003_WA46HW,,,
Integrated Optical Limited,OP_5J2_9746__000001_WA11SL,OPT,10 The Forge Shopping Centre,London Road,Stockton Heath,Warrington,,WA4 6HW,Tel: 01925 630018, - ,,,No ratings yet Rate it yourself - /Services/opticians/LeaveReview/DefaultView.aspx?id=OP_5J2_9746__000001_WA11SL,0,0,
Martin J. Berry Opticians,OP_5J2_11173__000003_WA46SG,OPT,33 London Road,Stockton Heath,Warrington,Cheshire,,WA4 6SG,Tel: 01925 861851, - ,,,No ratings yet Rate it yourself - /Services/opticians/LeaveReview/DefaultView.aspx?id=OP_5J2_11173__000003_WA46SG,0,0,
BOS Optical,OPT_CW81HH_1,OPT,,79 Chester Road,,Northwich,Cheshire,CW8 1HH,Tel: 01606 782 330, - ,,,1 rating Rate it yourself - /Services/opticians/LeaveReview/DefaultView.aspx?id=OPT_CW81HH_1,,,
IN-HOUSE MOBILE OPTICIANS,5NG8069__000001_WA46SR,OPT,Exec Suite 16,St James Business Centre,Wilderspool Causeway,Warrington,Cheshire,WA4 6PS,Tel: 01925 210006, - ,,,40 ratings Rate it yourself - /Services/opticians/LeaveReview/DefaultView.aspx?id=5NG8069__000001_WA46SR,,,
SPECS2U,OPL/01-25762/5NN,OPT,,Unit 21 Evans Business Centre,,Ellesmere Port ,,CH65 1AE,Tel: 0151 3573456, - ,,,No ratings yet Rate it yourself - /Services/opticians/LeaveReview/DefaultView.aspx?id=OPL/01-25762/5NN,0,0,
David Lundstram Opticians,OP_WA11SL_30098,OPT,,45 Sankey Street,,Warrington,,WA1 1SL,Tel: 01925 630018, - ,,,7 ratings Rate it yourself - /Services/opticians/LeaveReview/DefaultView.aspx?id=OP_WA11SL_30098,,,
R A Shaw Opticians,OP_5J2_1007__000001_WA11DN,OPT,7 Bold Street,Warrington,Cheshire,,,WA1 1DN,Tel: 01925 632516, - ,,,No ratings yet Rate it yourself - /Services/opticians/LeaveReview/DefaultView.aspx?id=OP_5J2_1007__000001_WA11DN,0,0,
Specsavers Opticians,OP_5J2_507__000001_WA11TD,OPT,34 Sankey Street,Golden Square Shopping Centre,Warrington,Cheshire,,WA1 1TD,Tel: 01925 240351, - ,,,2 ratings Rate it yourself - /Services/opticians/LeaveReview/DefaultView.aspx?id=OP_5J2_507__000001_WA11TD,,,
Northwich Visionplus Limited,OP_5H4_13471__000001_CW95DD,OPT,Unit 2,39/47 High Street,Northwich,,,CW9 5DD,Tel: 01606 49779, - ,,,No ratings yet Rate it yourself - /Services/opticians/LeaveReview/DefaultView.aspx?id=OP_5H4_13471__000001_CW95DD,0,0,
Vision Express,OPT_WA11QP_1,OPT,,Unit 43 The Mall,,Warrington,,WA1 1QP,Tel: 01925 633444, - ,,,No ratings yet Rate it yourself - /Services/opticians/LeaveReview/DefaultView.aspx?id=OPT_WA11QP_1,0,0,
Boots-Warrington - Golden Sq,OP_5J2_12288__000001_WA12LJ,OPT,"Unit SU35, Golden Square",,,Warrington,Cheshire,WA1 1QP,Tel: 01925 413999, - ,,,No ratings yet Rate it yourself - /Services/opticians/LeaveReview/DefaultView.aspx?id=OP_5J2_12288__000001_WA12LJ,0,0,
Julie Hatchell Opticians,OP_5HC_6617__000001_L255JD,OPT,34 Woolton Street,Woolton,Liverpool,,,L25 5JD,Tel: 0151 428 4040, - ,,,4 ratings Rate it yourself - /Services/opticians/LeaveReview/DefaultView.aspx?id=OP_5HC_6617__000001_L255JD,,,
Vision Express Ltd,OP_5H4_13485__000001_CW95AU,OPT,70 High Street,,Northwich,Cheshire,,CW9 5AU,Tel: 01606 41155, - ,,,No ratings yet Rate it yourself - /Services/opticians/LeaveReview/DefaultView.aspx?id=OP_5H4_13485__000001_CW95AU,0,0,
A1 Vision,00082__000003_CH35LB,OPT,64 Green Lane,Vicars Cross,Chester,Cheshire,,CH3 5LB,Tel: 01244 329292, - ,,,No ratings yet Rate it yourself - /Services/opticians/LeaveReview/DefaultView.aspx?id=00082__000003_CH35LB,0,0,
Boots-Northwich - Witton St,OP_5H4_13528__000001_CW95DE,OPT,55-55a Witton Street,,Northwich,Cheshire,,CW9 5DE,Tel: 01606 40799, - ,,,No ratings yet Rate it yourself - /Services/opticians/LeaveReview/DefaultView.aspx?id=OP_5H4_13528__000001_CW95DE,0,0,
Conway Phillips Ltd,OP_5J2_4589__000001_WA12LZ,OPT,31 Buttermarket Street,Warrington,Cheshire,,,WA1 2LZ,Tel: 01925 633746, - ,,,No ratings yet Rate it yourself - /Services/opticians/LeaveReview/DefaultView.aspx?id=OP_5J2_4589__000001_WA12LZ,0,0,
Glasses123,OP_L192PA_29486,OPT,,30 Speke Road,,Liverpool,,L19 2PA,Tel: 0151 494 1121, - ,,,3 ratings Rate it yourself - /Services/opticians/LeaveReview/DefaultView.aspx?id=OP_L192PA_29486,,,
Dollond & Aitchison Professional Services Ltd,OP_5H4_5366__000001_CW95AG,OPT,38 Witton Street,,Northwich,Cheshire,,CW9 5AG,Tel: 01606 43087, - ,,,No ratings yet Rate it yourself - /Services/opticians/LeaveReview/DefaultView.aspx?id=OP_5H4_5366__000001_CW95AG,0,0,
KS Opticians,232323__000001_WA12AP,OPT,Cockhedge Shopping Park,Unit 11,Cockhedge Way,Warrington,Cheshire,WA1 2QQ,Tel: 01925 232918, - ,,,No ratings yet Rate it yourself - /Services/opticians/LeaveReview/DefaultView.aspx?id=232323__000001_WA12AP,0,0,
Asda Opticians,OPT_WA1 2QA,OPT,,COCKHEDGE CENTRE,TILLY LANE,WARRINGTON,,WA1 2QA,Tel: 00000 000000, - ,,,1 rating Rate it yourself - /Services/opticians/LeaveReview/DefaultView.aspx?id=OPT_WA1 2QA,,,
Optical Opticians,OP_5J2_11015__000002_WA41JY,OPT,715 Knutsford Road,Warrington,Cheshire,,,WA4 1JY,Tel: 01925 636696, - ,,,No ratings yet Rate it yourself - /Services/opticians/LeaveReview/DefaultView.aspx?id=OP_5J2_11015__000002_WA41JY,0,0,
Tesco Opticians,OP_5J2_12289__000001_WA27NE,OPT,,Winwick Road,Warrington,Cheshire,,WA2 7NE,Tel: 0345 6779805, - ,,,5 ratings Rate it yourself - /Services/opticians/LeaveReview/DefaultView.aspx?id=OP_5J2_12289__000001_WA27NE,,,
Asda Opticians (Westbrook),C/2058/Q44,OPT,,501 Westbrook Centre,,Warrington,,WA5 8UQ,Tel: 01925 646801, - ,,,1 rating Rate it yourself - /Services/opticians/LeaveReview/DefaultView.aspx?id=C/2058/Q44,,,
R D Wilkes (Optometrists) Ltd,OP_5J3_6795__000001_L354LU,OPT,15 Dane Court,Rainhill,Prescot,,,L35 4LU,Tel: 0151 426 2214, - ,,,No ratings yet Rate it yourself - /Services/opticians/LeaveReview/DefaultView.aspx?id=OP_5J3_6795__000001_L354LU,0,0,
Houghton Opticians,OP_5H3_3612__000001_CH23AZ,OPT,14 Charles Street,Hoole,Chester,Cheshire,,CH2 3AZ,Tel: 01244 325969, - ,,,No ratings yet Rate it yourself - /Services/opticians/LeaveReview/DefaultView.aspx?id=OP_5H3_3612__000001_CH23AZ,0,0,
Rainhill Designer Spectacles,C/227/5NM__000001_L350LP,OPT,11 Station Street,,Rainhill,Merseyside,,L35 0LP,, - ,,,1 rating Rate it yourself - /Services/opticians/LeaveReview/DefaultView.aspx?id=C/227/5NM__000001_L350LP,,,
Worden Optometrists,OP_5H3_3936__000001_CW60DX,OPT,42 High Street,,,Tarporley,,CW6 0DX,Tel: 01829 732501, - ,,,3 ratings Rate it yourself - /Services/opticians/LeaveReview/DefaultView.aspx?id=OP_5H3_3936__000001_CW60DX,,,
Ellesmere Optical Ltd,OP_5H6_4876__000001_CH663PH,OPT,6 Whetstone Hey,,Great Sutton,Cheshire,,CH66 3PH,Tel: 0151 339 5577, - ,,,No ratings yet Rate it yourself - /Services/opticians/LeaveReview/DefaultView.aspx?id=OP_5H6_4876__000001_CH663PH,0,0,
Specsavers Belle Vale,C/293/5NL__000001_L252XT,OPT,Unit 3 Belle Vale Shopping Centre,Belle Vale,Liverpool,,,L25 2XT,, - ,,,No ratings yet Rate it yourself - /Services/opticians/LeaveReview/DefaultView.aspx?id=C/293/5NL__000001_L252XT,0,0,
In-Style Opticians,OP_5HC_3689__000001_L252RQ,OPT,Unit 22,Belle Vale Shopping Centre,Belle Vale,,,L25 2RF,Tel: 0151 487 3713, - ,,,No ratings yet Rate it yourself - /Services/opticians/LeaveReview/DefaultView.aspx?id=OP_5HC_3689__000001_L252RQ,0,0,
John Prebble Opticians,OP_5HC_9800__000001_L252RG,OPT,Unit 21,Belle Vale Shopping Centre,Belle Vale,Liverpool,Merseyside,L25 2RG,Tel: 0151 487 5228, - ,,,12 ratings Rate it yourself - /Services/opticians/LeaveReview/DefaultView.aspx?id=OP_5HC_9800__000001_L252RG,,,
Sinply Opticians,3099K__000002_L360UB,OPT,43 Manor Farm Road,Huyton,Liverpool,,,L36 0UB,Tel: 0151 489 7618, - ,,,No ratings yet Rate it yourself - /Services/opticians/LeaveReview/DefaultView.aspx?id=3099K__000002_L360UB,0,0,
I Wear Opticians Ltd,OL/CO-2071/5NN__000001_CW6OAT,OPT,72 High Street,Tarporley,Nr Chester,Cheshire,,CW6 0AT,Tel: 01829 733661, - ,,,No ratings yet Rate it yourself - /Services/opticians/LeaveReview/DefaultView.aspx?id=OL/CO-2071/5NN__000001_CW6OAT,0,0,
Costco Wholesale UK Ltd,OP_CH16LT_84858,OPT,,Dunkirk Trading Estate,Chester Gates,Chester,,CH1 6LT,Tel: 01244 852 085, - ,,,No ratings yet Rate it yourself - /Services/opticians/LeaveReview/DefaultView.aspx?id=OP_CH16LT_84858,0,0,
Boots-Chester - Foregate St,OP_5H3_500__000002_CH11NA,OPT,47-55 Foregate Street,,,Chester,Cheshire,CH1 1NA,Tel: 01244 312843, - ,,,No ratings yet Rate it yourself - /Services/opticians/LeaveReview/DefaultView.aspx?id=OP_5H3_500__000002_CH11NA,0,0,
Boots-Chester - Frodsham St,OP_5H3_2734__000001_CH11HD,OPT,7 Frodsham Street,,Chester,Cheshire,,CH1 3JJ,Tel: 01244 321636, - ,,,No ratings yet Rate it yourself - /Services/opticians/LeaveReview/DefaultView.aspx?id=OP_5H3_2734__000001_CH11HD,0,0,
Specsavers Opticians,OP_5J4_5817__000001_L365SF,OPT,16 Huyton Hey Road,Huyton,Liverpool,,,L36 5RT,Tel: 0151 481 0241, - ,,,No ratings yet Rate it yourself - /Services/opticians/LeaveReview/DefaultView.aspx?id=OP_5J4_5817__000001_L365SF,0,0,
Optical Express,CH11DD_12348,OPT,,"The Exchange, Suite 2, 1st Floor, St John Street",,Chester,,CH1 1DD,Tel: 0800 0232020, - ,,,No ratings yet Rate it yourself - /Services/opticians/LeaveReview/DefaultView.aspx?id=CH11DD_12348,0,0,
Bayfields Opticians and Audiologists (Chester),O3M3N,OPT,,29 St Werburgh Street,,Chester,Cheshire,CH1 2DY,Tel: 01244 315112, - ,,,No ratings yet Rate it yourself - /Services/opticians/LeaveReview/DefaultView.aspx?id=O3M3N,0,0,
Jonathan Bryan Opticians,OP_5H3_13193__000002_CH12DY,OPT,St Oswalds Chambers,20-22 St Werburgh Street,Chester,Cheshire,,CH1 2DY,Tel: 01244 321045, - ,,,No ratings yet Rate it yourself - /Services/opticians/LeaveReview/DefaultView.aspx?id=OP_5H3_13193__000002_CH12DY,0,0,
ASDA Huyton,2058H__000001_L367TX,OPT,Huyton Lane,,,Huyton,,L36 7TX,Tel: 0151 449 4620, - ,,,1 rating Rate it yourself - /Services/opticians/LeaveReview/DefaultView.aspx?id=2058H__000001_L367TX,,,
Millican Opticians,OP_5J4_8614__000002_L369UJ,OPT,,44 Derby Road,Huyton,Liverpool,Merseyside,L36 9UJ,Tel: 0151 489 1845, - ,,,No ratings yet Rate it yourself - /Services/opticians/LeaveReview/DefaultView.aspx?id=OP_5J4_8614__000002_L369UJ,0,0,
Winsford Eye & Foot Care,OPT_CW72LX_1,OPT,,27 Delamere Street,,Winsford,,CW7 2LX,Tel: 01606 599 030, - ,,,No ratings yet Rate it yourself - /Services/opticians/LeaveReview/DefaultView.aspx?id=OPT_CW72LX_1,0,0,
Chester Visionplus Limited,OP_5H3_3003__000004_CH12HA,OPT,40 Northgate Street,Chester,Cheshire,,,CH1 2HA,Tel: 01244 310 832, - ,,,No ratings yet Rate it yourself - /Services/opticians/LeaveReview/DefaultView.aspx?id=OP_5H3_3003__000004_CH12HA,0,0,
Vision Express UK Ltd,OP_5H3_12941__000003_CH12HA,OPT,42/48 Northgate Street,,Chester,Cheshire,,CH1 2HA,Tel: 01244 409138, - ,,,No ratings yet Rate it yourself - /Services/opticians/LeaveReview/DefaultView.aspx?id=OP_5H3_12941__000003_CH12HA,0,0,
"G Uddin Ltd, T/A The Eye Emporium Ltd",OP_5H3_13511__000001_CH11EF,OPT,10 St Michaels Row,,Chester,Cheshire,,CH1 1EF,Tel: 01244 341116, - ,,,No ratings yet Rate it yourself - /Services/opticians/LeaveReview/DefaultView.aspx?id=OP_5H3_13511__000001_CH11EF,0,0,
"H T Churchman, T/A J D Siddall",OP_5H3_13447__000001_CH11XR,OPT,The Cross,4 Bridge Street,Chester,Cheshire,,CH1 1NQ,Tel: 01244 320222, - ,,,No ratings yet Rate it yourself - /Services/opticians/LeaveReview/DefaultView.aspx?id=OP_5H3_13447__000001_CH11XR,0,0,
Nightingale Opticians,5J5 839,OPT,,16 Lawnhurst Grove,Aigburth,Liverpool,,L17 6ES,Tel: 0151 494 9375, - ,,,No ratings yet Rate it yourself - /Services/opticians/LeaveReview/DefaultView.aspx?id=5J5 839,0,0,
Specs 2U,OPT_WA28QP_1,OPT,,Unit 2 Clarendon Court,Winwick Quay,Warrington,,WA2 8QP,Tel: 01925 633433, - ,,,No ratings yet Rate it yourself - /Services/opticians/LeaveReview/DefaultView.aspx?id=OPT_WA28QP_1,0,0,
Winsford Visionplus Limited,CW7 1AE__000003_CW71AE,OPT,4 Queens Parade,,Winsford,Cheshire,,CW7 1AE,Tel: 01606 541510, - ,,,No ratings yet Rate it yourself - /Services/opticians/LeaveReview/DefaultView.aspx?id=CW7 1AE__000003_CW71AE,0,0,
L R & E A Taylor,OP_5H4_10968__000002_CW71AE,OPT,,4 Dene Drive,Winsford,Cheshire,,CW7 1BP,Tel: 01606 551093, - ,,,No ratings yet Rate it yourself - /Services/opticians/LeaveReview/DefaultView.aspx?id=OP_5H4_10968__000002_CW71AE,0,0,yes
Taylors Optometrists,OPT_CW71BP_1,OPT,,4 Dene Drive,,Winsford,,CW7 1BP,Tel: 01606 551 093, - ,,,No ratings yet Rate it yourself - /Services/opticians/LeaveReview/DefaultView.aspx?id=OPT_CW71BP_1,0,0,
I CARE OPTICIANS,5NMC385__000003_WA95PE,OPT,i care opticians,128 Thatto Heath Road,Thatto Heath,St.Helens,,WA9 5PE,Tel: 01744 811890, - ,,,3 ratings Rate it yourself - /Services/opticians/LeaveReview/DefaultView.aspx?id=5NMC385__000003_WA95PE,,,yes
ASDA opticians,CW71BD041116,OPT,,The drumber,,Winsford,,CW7 1BD,Tel: 01606 596 412, - ,,,No ratings yet Rate it yourself - /Services/opticians/LeaveReview/DefaultView.aspx?id=CW71BD041116,0,0,
Millican Opticians,OP_5J4_5746__000001_L345QA,OPT,29-31 Eccleston Street,Prescot,Merseyside,,,L34 5QA,Tel: 0151 426 6286, - ,,,No ratings yet Rate it yourself - /Services/opticians/LeaveReview/DefaultView.aspx?id=OP_5J4_5746__000001_L345QA,0,0,
Bennett & Batty,OP_5HA_3785__000002_L182DD,OPT,93 Allerton Road,Mossley Hill,,Liverpool,,L18 2DD,Tel: 0151 724 4144, - ,,,9 ratings Rate it yourself - /Services/opticians/LeaveReview/DefaultView.aspx?id=OP_5HA_3785__000002_L182DD,,,
S Wilcox,OP_5HA_13841__000001_L167QQ,OPT,169 Dunbabin Road,Childwall,Childwall,,,L16 7QQ,Tel: 0151 722 1182, - ,,,No ratings yet Rate it yourself - /Services/opticians/LeaveReview/DefaultView.aspx?id=OP_5HA_13841__000001_L167QQ,0,0,
Price & Ankers,OP_5J4_9247__000001_L345QP,OPT,2 Leyland Street,Prescot,Merseyside,,,L34 5QP,Tel: 0151 430 9187, - ,,,No ratings yet Rate it yourself - /Services/opticians/LeaveReview/DefaultView.aspx?id=OP_5J4_9247__000001_L345QP,0,0,
Asda Opticians,OPT_CH1 4QQ,OPT,,"UNIT 33, GREYHOUND RETAIL PARK",CHASER COURT,CHESTER,,CH1 4QQ,Tel: 01244 360 816, - ,,,1 rating Rate it yourself - /Services/opticians/LeaveReview/DefaultView.aspx?id=OPT_CH1 4QQ,,,
Bramwells Opticians,OP_5H4_2399__000001_CW72AD,OPT,62 High Street,,Winsford,Cheshire,,CW7 2AD,Tel: 01606 593270, - ,,,No ratings yet Rate it yourself - /Services/opticians/LeaveReview/DefaultView.aspx?id=OP_5H4_2399__000001_CW72AD,0,0,
Millican Opticians,OP_5HA_14746__000001_L181LW,OPT,82-84 Allerton Road,,Liverpool,,,L18 1LW,Tel: 0151 734 5005, - ,,,No ratings yet Rate it yourself - /Services/opticians/LeaveReview/DefaultView.aspx?id=OP_5HA_14746__000001_L181LW,0,0,
Specsavers Opticians,11912__000001_L154HN,OPT,21/22 Smithdown Place,,Liverpool,,,L15 9EN,Tel: 0151 734 7555, - ,,,No ratings yet Rate it yourself - /Services/opticians/LeaveReview/DefaultView.aspx?id=11912__000001_L154HN,0,0,
Asda Opticians,OPT_CH62 3PL,OPT,,WELTON ROAD,CROFT BUSINESS PARK,BROMBOROUGH,,CH62 3PL,Tel: 0151 346 2512, - ,,,No ratings yet Rate it yourself - /Services/opticians/LeaveReview/DefaultView.aspx?id=OPT_CH62 3PL,0,0,
Houghtons Opticians,OP_5F8_3955__000001_CH627HH,OPT,47 Allport Lane Precinct,Bromborough,Wirral,,,CH62 7HH,Tel: 0151 334 2805, - ,,,No ratings yet Rate it yourself - /Services/opticians/LeaveReview/DefaultView.aspx?id=OP_5F8_3955__000001_CH627HH,0,0,
R A Carr,OP_5J3_1196__000002_WA101AJ,OPT,101 Church Street,,,St Helens,Merseyside,WA10 1AJ,Tel: 01744 23955, - ,,,No ratings yet Rate it yourself - /Services/opticians/LeaveReview/DefaultView.aspx?id=OP_5J3_1196__000002_WA101AJ,0,0,
Kays Opticians Ltd,OP_5J3_10072__000001_WA101AJ,OPT,95 Church Street,St Helens,Merseyside,,,WA10 1AJ,Tel: 01744 23672, - ,,,No ratings yet Rate it yourself - /Services/opticians/LeaveReview/DefaultView.aspx?id=OP_5J3_10072__000001_WA101AJ,0,0,
Vision Express (UK) Ltd,OP_5J3_13090__000002_WA101BN,OPT,6 La Grange Arcade,Church Square Shopping Centre,St Helens,,,WA10 1BN,Tel: 01744 737993, - ,,,No ratings yet Rate it yourself - /Services/opticians/LeaveReview/DefaultView.aspx?id=OP_5J3_13090__000002_WA101BN,0,0,
Specsavers Opticians,OP_5J3_383__000001_WA101NW,OPT,2-4 Bridge Street,St Helens,Merseyside,,,WA10 1NW,Tel: 01744 453 665, - ,,,1 rating Rate it yourself - /Services/opticians/LeaveReview/DefaultView.aspx?id=OP_5J3_383__000001_WA101NW,,,
Boots-St Helens - La Grange Arcade (in Boots UK),OP_5J3_12056__000001_WA10,OPT,La Grange Arcade,24 Church Street,,St Helens,Merseyside,WA10 1BD,Tel: 0174 4751087, - ,,,2 ratings Rate it yourself - /Services/opticians/LeaveReview/DefaultView.aspx?id=OP_5J3_12056__000001_WA10,,,
The Eyeworks,OP_5F8_11733__000002_CH626BB,OPT,,"128, Allport Road",Bromborough,Wirral,,CH62 6BB,Tel: 0151 343 0044, - ,,,No ratings yet Rate it yourself - /Services/opticians/LeaveReview/DefaultView.aspx?id=OP_5F8_11733__000002_CH626BB,0,0,yes
Industrial Eyecare Opticians,OP_WA102PF_46199,OPT,,51-55 Eccleston Street,,St.Helens,,WA10 2PF,, - ,,,No ratings yet Rate it yourself - /Services/opticians/LeaveReview/DefaultView.aspx?id=OP_WA102PF_46199,0,0,
Smithdown Eyecare Limited,OP_5HA_14742__000001_L152JT,OPT,Smithdown Eyecare,"188, Smithdown Road",Wavertree,Liverpool,Merseyside,L15 3JT,Tel: 0151 280 7777, - ,,,No ratings yet Rate it yourself - /Services/opticians/LeaveReview/DefaultView.aspx?id=OP_5HA_14742__000001_L152JT,0,0,