Organisation Name,NACS Code,Organisation Type,Address1,Address2,Address3,Address4,Address5,PostCode,Telephone Number,Opening time,Value  (Opening time),Banding Classification  (Opening time),NHS.UK users rating,Value  (NHS.UK users rating),Banding Classification  (NHS.UK users rating),Car parking (Is there car parking at this organisation?)
John Tomlinson Mobile Optician,OP_5E3_13036__000001_HU152UB,OPT,Mobile Optician,Village Hall Car Park,Gilberdyke,,,HU15 2UB,Tel: 07976 567487, - ,,,No ratings yet Rate it yourself - /Services/opticians/LeaveReview/DefaultView.aspx?id=OP_5E3_13036__000001_HU152UB,0,0,
John Tomlinson Mobile Optician,OP_5E3_13031__000001_HU152PR,OPT,Mobile Unit,Recreation Club (Thur Pm Alt),,"Main Street, Newport",,HU15 2PR,Tel: 07976 567487, - ,,,No ratings yet Rate it yourself - /Services/opticians/LeaveReview/DefaultView.aspx?id=OP_5E3_13031__000001_HU152PR,0,0,
Eye Deal,OP_5E3_13039__000002_DN145DL,OPT,17 Paradise Place,,Goole,E Yorkshire,,DN14 5DL,Tel: 01405 767705, - ,,,No ratings yet Rate it yourself - /Services/opticians/LeaveReview/DefaultView.aspx?id=OP_5E3_13039__000002_DN145DL,0,0,
Michael James,OP_5E3_3140__000001_DN145DE,OPT,28 Boothferry Road,,Goole,,,DN14 5DA,Tel: 01405 761387, - ,,,No ratings yet Rate it yourself - /Services/opticians/LeaveReview/DefaultView.aspx?id=OP_5E3_3140__000001_DN145DE,0,0,
Specsavers Opticians,OP_5E3_13041__000001_DN145BT,OPT,68 Boothferry Road,,Goole,E Yorkshire,,DN14 5BT,Tel: 01405 760699, - ,,,No ratings yet Rate it yourself - /Services/opticians/LeaveReview/DefaultView.aspx?id=OP_5E3_13041__000001_DN145BT,0,0,
Blenkinsop Opticians,OP_5E3_12767__000001_DN146BP,OPT,71-73 Pasture Road,,Goole,,,DN14 6BP,Tel: 01405 763439, - ,,,No ratings yet Rate it yourself - /Services/opticians/LeaveReview/DefaultView.aspx?id=OP_5E3_12767__000001_DN146BP,0,0,
Smith & Walker (Optometrists) Ltd,OP_5EF_8151__000001_DN159PU,OPT,1 High Street,,Winterton,North Lincolnshire,,DN15 9PU,Tel: 01724 733754, - ,,,No ratings yet Rate it yourself - /Services/opticians/LeaveReview/DefaultView.aspx?id=OP_5EF_8151__000001_DN159PU,0,0,
Tesco Opticians,OPT-5EF-019__000001_DN158GR,OPT,Gallagher Park,Doncaster Road,Scunthorpe,North Lincolnshire,,DN15 8GR,Tel: 0345 677 9664, - ,,,No ratings yet Rate it yourself - /Services/opticians/LeaveReview/DefaultView.aspx?id=OPT-5EF-019__000001_DN158GR,0,0,
Sightcare UK Ltd,BROUGH1__000001_HU151AF,OPT,Welton Road,,Brough,E Yorkshire,,HU15 1AF,Tel: 01482 665999, - ,,,No ratings yet Rate it yourself - /Services/opticians/LeaveReview/DefaultView.aspx?id=BROUGH1__000001_HU151AF,0,0,
Edwards Opticians,OP_5E3_4047__000001_HU151HW,OPT,1 Stockbridge Road,,Elloughton,E Yorkshire,,HU15 1HW,Tel: 01482 668712, - ,,,No ratings yet Rate it yourself - /Services/opticians/LeaveReview/DefaultView.aspx?id=OP_5E3_4047__000001_HU151HW,0,0,
Sutherland Optical Associates,OP_5EF_11493__000001_DN156LA,OPT,123 Mary Street,,Scunthorpe,North Lincolnshire,,DN15 6LA,Tel: 01724 865248, - ,,,No ratings yet Rate it yourself - /Services/opticians/LeaveReview/DefaultView.aspx?id=OP_5EF_11493__000001_DN156LA,0,0,
Vision Express (UK) Ltd,OP_5EF_13991__000001_DN156SD,OPT,78 High Street,,Scunthorpe,North Lincolnshire,,DN15 6SD,Tel: 01724 276220, - ,,,No ratings yet Rate it yourself - /Services/opticians/LeaveReview/DefaultView.aspx?id=OP_5EF_13991__000001_DN156SD,0,0,
Vision Value,OPT-5EF021__000002_DN156SD,OPT,70 High Street,The Foundry,Scunthorpe,,,DN15 6SD,, - ,,,No ratings yet Rate it yourself - /Services/opticians/LeaveReview/DefaultView.aspx?id=OPT-5EF021__000002_DN156SD,0,0,
Boots-Scunthorpe - High St,OP_5EF_2181__000001_DN156LY,OPT,103 High Street,,,Scunthorpe,Lincolnshire,DN15 6LY,Tel: 01724 847 710, - ,,,No ratings yet Rate it yourself - /Services/opticians/LeaveReview/DefaultView.aspx?id=OP_5EF_2181__000001_DN156LY,0,0,
Specsavers Opticians,OP_5EF_6742__000001_DN156TG,OPT,54 High Street,,Scunthorpe,North Lincolnshire,,DN15 6SX,Tel: 01724 271451, - ,,,4 ratings Rate it yourself - /Services/opticians/LeaveReview/DefaultView.aspx?id=OP_5EF_6742__000001_DN156TG,,,
Peebles & Wayte,OP_5EF_8936__000001_DN156NG,OPT,2 Robert Street,,Scunthorpe,North Lincolnshire,,DN15 6NG,Tel: 01724 843528, - ,,,No ratings yet Rate it yourself - /Services/opticians/LeaveReview/DefaultView.aspx?id=OP_5EF_8936__000001_DN156NG,0,0,
Boots-Scunthorpe - Oswald Rd,OP_5EF_6059__000001_DN157PQ,OPT,40 Oswald Road,,,Scunthorpe,Lincolnshire,DN15 7PQ,Tel: 01724 843152, - ,,,No ratings yet Rate it yourself - /Services/opticians/LeaveReview/DefaultView.aspx?id=OP_5EF_6059__000001_DN157PQ,0,0,
Asda Vision Centre,OP_5EF_13988__000001_DN172XE,OPT,Burringham Road,,,Scunthorpe,,DN17 2XF,Tel: 01724 407220, - ,,,No ratings yet Rate it yourself - /Services/opticians/LeaveReview/DefaultView.aspx?id=OP_5EF_13988__000001_DN172XE,0,0,
Charles Irvine,OPT-5EF-022__000002_DN162RY,OPT,295 Ashby High Street,Ashby,Scunthorpe,,,DN16 2RY,, - ,,,6 ratings Rate it yourself - /Services/opticians/LeaveReview/DefaultView.aspx?id=OPT-5EF-022__000002_DN162RY,,,
Norfolk Optics Limited,OPT_5EF_018__000001_DN162SD,OPT,259 Ashby High Street,,Scunthorpe,North Lincolnshire,,DN16 2SD,Tel: 01724 867117, - ,,,1 rating Rate it yourself - /Services/opticians/LeaveReview/DefaultView.aspx?id=OPT_5EF_018__000001_DN162SD,,,
I S Merry,OP_5EF_2727__000001_DN162SF,OPT,Alexandra Road,Ashby,Scunthorpe,North Lincolnshire,,DN16 2SF,Tel: 01724 852987, - ,,,No ratings yet Rate it yourself - /Services/opticians/LeaveReview/DefaultView.aspx?id=OP_5EF_2727__000001_DN162SF,0,0,
John Tomlinson Mobile Optician,OP_5E3_13034__000001_HU151QT,OPT,Mobile Unit,The Library Car Park,Church Street (Tues 9-12.15pm Alt),,,HU15 1QT,Tel: 07976 567487, - ,,,No ratings yet Rate it yourself - /Services/opticians/LeaveReview/DefaultView.aspx?id=OP_5E3_13034__000001_HU151QT,0,0,
John Tomlinson Mobile Optician,OP_5E3_13033__000001_YO433SN,OPT,Mobile Unit,Newbald Village Hall Car Park,Westgate (Thur 4.45pm-7pm Alt),,,YO43 4SE,Tel: 07976 567487, - ,,,No ratings yet Rate it yourself - /Services/opticians/LeaveReview/DefaultView.aspx?id=OP_5E3_13033__000001_YO433SN,0,0,
Parkhurst Opticians Ltd,OP_5EK_7517__000001_DN85DG,OPT,8 Finkle Street,Thorne,Doncaster,,,DN8 5DE,Tel: 01405 740095, - ,,,No ratings yet Rate it yourself - /Services/opticians/LeaveReview/DefaultView.aspx?id=OP_5EK_7517__000001_DN85DG,0,0,
Bell Brothers (Opticians) Ltd,OP_5EK_9712__000003_DN85DE,OPT,23 Finkle Street,Thorne,,Doncaster,South Yorkshire,DN8 5DE,Tel: 01405 812209, - ,,,No ratings yet Rate it yourself - /Services/opticians/LeaveReview/DefaultView.aspx?id=OP_5EK_9712__000003_DN85DE,0,0,
Michael James t/a Garner Opticians,OP_5E3_3141__000001_DN149HE,OPT,11 Market Place,SNAITH,,Goole,,DN14 9HE,Tel: 01405 862364, - ,,,No ratings yet Rate it yourself - /Services/opticians/LeaveReview/DefaultView.aspx?id=OP_5E3_3141__000001_DN149HE,0,0,
Edwards & Mahal,OP_5EF_9090__000002_DN91ER,OPT,12 Church Street,Epworth,Doncaster,,,DN9 1ER,Tel: 01427 873578, - ,,,No ratings yet Rate it yourself - /Services/opticians/LeaveReview/DefaultView.aspx?id=OP_5EF_9090__000002_DN91ER,0,0,
Edwards Opticians,OP_5E4_9059__000001_YO43AF,OPT,17-19 Southgate,,Market Weighton,E Yorkshire,,YO43 3AF,Tel: 01430 873288, - ,,,No ratings yet Rate it yourself - /Services/opticians/LeaveReview/DefaultView.aspx?id=OP_5E4_9059__000001_YO43AF,0,0,
Smith & Walker (Optometrists) Ltd,OP_5EF_3196__000003_DN185PD,OPT,16 High Street,,Barton-upon-Humber,North Lincolnshire,,DN18 5PD,Tel: 01652 632315, - ,,,6 ratings Rate it yourself - /Services/opticians/LeaveReview/DefaultView.aspx?id=OP_5EF_3196__000003_DN185PD,,,
Eyesite Opticians Ltd,OP_5EF_4393__000002_DN185PD,OPT,42 High Street,,Barton-upon-Humber,North Lincolnshire,,DN18 5PD,Tel: 01652 635997, - ,,,No ratings yet Rate it yourself - /Services/opticians/LeaveReview/DefaultView.aspx?id=OP_5EF_4393__000002_DN185PD,0,0,
Bush Opticians (Hull) Ltd,OP_5E3_8458__000001_HU130RU,OPT,18 The Weir,Hessle,,East Yorkshire,,HU13 0RU,Tel: 01482 648919, - ,,,No ratings yet Rate it yourself - /Services/opticians/LeaveReview/DefaultView.aspx?id=OP_5E3_8458__000001_HU130RU,0,0,
Specsavers Hessle,OP_5E3_3367__000001_HU130RD,OPT,44-46 Prestongate,,Hessle,,,HU13 0RE,Tel: 01482 640971, - ,,,3 ratings Rate it yourself - /Services/opticians/LeaveReview/DefaultView.aspx?id=OP_5E3_3367__000001_HU130RD,,,
Eye Contact Opticians,OP_5E3_4150__000002_HU130AA,OPT,8 The Orchard Centre,,Hessle,,,HU13 0AA,Tel: 01482 645369, - ,,,No ratings yet Rate it yourself - /Services/opticians/LeaveReview/DefaultView.aspx?id=OP_5E3_4150__000002_HU130AA,0,0,
Sight Care UK Ltd,OP_5E3_8924__000001_HU106BN,OPT,4 Kingston Road,,Willerby,,,HU10 6BN,Tel: 01482 658048, - ,,,1 rating Rate it yourself - /Services/opticians/LeaveReview/DefaultView.aspx?id=OP_5E3_8924__000001_HU106BN,,,
Jane Gray Eyecare Ltd,OP_5E3_8347__000001_HU107AN,OPT,7 Wilson Street,,Anlaby,E Yorkshire,,HU10 7AN,Tel: 01482 651531, - ,,,2 ratings Rate it yourself - /Services/opticians/LeaveReview/DefaultView.aspx?id=OP_5E3_8347__000001_HU107AN,,,
Rayner Opticians ,OP_5E2_10090__000001_YO84EA,OPT,,55 Micklegate,,Selby,North Yorkshire,YO8 4EA,Tel: 01757 702712, - ,,,No ratings yet Rate it yourself - /Services/opticians/LeaveReview/DefaultView.aspx?id=OP_5E2_10090__000001_YO84EA,0,0,
Selby Specsavers Ltd,OP_5E2_14397__000001_YO84ET,OPT,18/19 Market Place,,,Selby,North Yorkshire,YO8 4PB,Tel: 01757 293050, - ,,,No ratings yet Rate it yourself - /Services/opticians/LeaveReview/DefaultView.aspx?id=OP_5E2_14397__000001_YO84ET,0,0,
Colter Opticians,OP_5E2_6851__000001_YO84DT,OPT,25 Finkle Street,,Selby,,,YO8 4DT,Tel: 01757 705582, - ,,,No ratings yet Rate it yourself - /Services/opticians/LeaveReview/DefaultView.aspx?id=OP_5E2_6851__000001_YO84DT,0,0,
Brigg Optical,OPT_5EF_017__000001_DN208JZ,OPT,5 Chapel Court,,Brigg,North Lincolnshire,,DN20 8JZ,Tel: 01652 650400, - ,,,1 rating Rate it yourself - /Services/opticians/LeaveReview/DefaultView.aspx?id=OPT_5EF_017__000001_DN208JZ,,,
Boots-Selby,OP_5E2_5804__000001_YO80HE,OPT,9 Gowthorpe,,,Selby,North Yorkshire,YO8 4HE,Tel: 01757 701848, - ,,,No ratings yet Rate it yourself - /Services/opticians/LeaveReview/DefaultView.aspx?id=OP_5E2_5804__000001_YO80HE,0,0,
Vision Value Opticians,OP_5E2_10363__000001_YO80ET,OPT,10 Gowthorpe,,Selby,,,YO8 4ET,Tel: 01757 213773, - ,,,No ratings yet Rate it yourself - /Services/opticians/LeaveReview/DefaultView.aspx?id=OP_5E2_10363__000001_YO80ET,0,0,
Bingham & Wilson,OP_5E2_4792__000001_YO84AL,OPT,19 Brook Street,,Selby,,,YO8 4AL,Tel: 01757 703367, - ,,,No ratings yet Rate it yourself - /Services/opticians/LeaveReview/DefaultView.aspx?id=OP_5E2_4792__000001_YO84AL,0,0,
O'Brien's Opticians,OP_5EF_3276__000001_DN208JB,OPT,43-44 Wrawby Street,Brigg,Scunthorpe,North Lincolnshire,,DN20 8BS,Tel: 01652 653595, - ,,,No ratings yet Rate it yourself - /Services/opticians/LeaveReview/DefaultView.aspx?id=OP_5EF_3276__000001_DN208JB,0,0,
Buckingham Opticians,OP_5E3_3903__000001_HU164BB,OPT,183 Hallgate,,Cottingham,Cottingham,,HU16 4BB,Tel: 01482 841359, - ,,,No ratings yet Rate it yourself - /Services/opticians/LeaveReview/DefaultView.aspx?id=OP_5E3_3903__000001_HU164BB,0,0,
Scrivens Opticians,OP_5E3_5474__000002_HU164BD,OPT,160 Hallgate,,Cottingham,Nr Hull,Yorkshire(East Riding),HU16 4BD,Tel: 01482 845056, - ,,,No ratings yet Rate it yourself - /Services/opticians/LeaveReview/DefaultView.aspx?id=OP_5E3_5474__000002_HU164BD,0,0,
Eyesite Opticians,OP_5E3_13040__000003_HU165QE,OPT,96 King Street,,Cottingham,E Yorkshire,,HU16 5QE,Tel: 01482 845651, - ,,,1 rating Rate it yourself - /Services/opticians/LeaveReview/DefaultView.aspx?id=OP_5E3_13040__000003_HU165QE,,,
Coates Opticians,OP_5E3_4819__000002_HU165QE,OPT,,8 King Street,,Cottingham,East Yorkshire,HU16 5QE,Tel: 01482 840989, - ,,,No ratings yet Rate it yourself - /Services/opticians/LeaveReview/DefaultView.aspx?id=OP_5E3_4819__000002_HU165QE,0,0,
Asda Opticians,OP_5E6_14670__000001_HU34PE,OPT,Hessle Road,,,Hull,,HU3 4PE,Tel: 01482 596620, - ,,,No ratings yet Rate it yourself - /Services/opticians/LeaveReview/DefaultView.aspx?id=OP_5E6_14670__000001_HU34PE,0,0,
Rouse Opticians,OP_5E6_14674__000001_HU33SE,OPT,428 Hessle Road,,Hull,E Yorkshire,,HU3 3SE,Tel: 01482 323856, - ,,,No ratings yet Rate it yourself - /Services/opticians/LeaveReview/DefaultView.aspx?id=OP_5E6_14674__000001_HU33SE,0,0,
Buckingham Opticians,OP_5E6_452__000001_HU36AS,OPT,453 Anlaby Road,,Hull,Hull,,HU3 6AS,Tel: 01482 566451, - ,,,No ratings yet Rate it yourself - /Services/opticians/LeaveReview/DefaultView.aspx?id=OP_5E6_452__000001_HU36AS,0,0,
The Spectacle Shop,OP_5E6_14668__000001_HU34BE,OPT,271 Hessle Road,,Hull,E Yorkshire,,HU3 4BE,Tel: 01482 585083, - ,,,No ratings yet Rate it yourself - /Services/opticians/LeaveReview/DefaultView.aspx?id=OP_5E6_14668__000001_HU34BE,0,0,
Rose Eyecare Ltd,OP_5E6_2056__000002_HU32SE,OPT,275 Anlaby Road,,Hull,,,HU3 2SE,Tel: 01482 324414, - ,,,No ratings yet Rate it yourself - /Services/opticians/LeaveReview/DefaultView.aspx?id=OP_5E6_2056__000002_HU32SE,0,0,
Specsavers,TP730,OPT,,17-21 Market Place,,Pocklington,,YO42 2AS,, - ,,,No ratings yet Rate it yourself - /Services/opticians/LeaveReview/DefaultView.aspx?id=TP730,0,0,
Scrivens Opticians,OP_5E4_10770__000001_YO422DG,OPT,4 George Street,,Pocklington,E Yorkshire,,YO42 2DG,Tel: 01759 303150, - ,,,No ratings yet Rate it yourself - /Services/opticians/LeaveReview/DefaultView.aspx?id=OP_5E4_10770__000001_YO422DG,0,0,
Kirton in Lindsey Opticians,OP_5EF_3529__000002_DN214LU,OPT,6 High Street,Kirton Lindsey,Gainsborough,Lincolnshire,,DN21 4LU,Tel: 01652 649024, - ,,,No ratings yet Rate it yourself - /Services/opticians/LeaveReview/DefaultView.aspx?id=OP_5EF_3529__000002_DN214LU,0,0,
Andrew and Rogers,OP_5E3_13038__000001_HU178AJ,OPT,15 North Bar Within,,Beverley,E Yorkshire,,HU17 8AP,Tel: 01482 860362, - ,,,1 rating Rate it yourself - /Services/opticians/LeaveReview/DefaultView.aspx?id=OP_5E3_13038__000001_HU178AJ,,,
Beverley Vision Express,5NW VE__000003_HU179AJ,OPT,,12 Toll Gavel,,Beverley,Yorkshire(East Riding),HU17 9AJ,Tel: 01482 863547, - ,,,1 rating Rate it yourself - /Services/opticians/LeaveReview/DefaultView.aspx?id=5NW VE__000003_HU179AJ,,,
Eyesite,OPT_5E3_HARRODS__000003_HU178BB,OPT,13a Saturday Market Place,Beverley,,East Yorkshire,,HU17 8BB,Tel: 01482 868039, - ,,,1 rating Rate it yourself - /Services/opticians/LeaveReview/DefaultView.aspx?id=OPT_5E3_HARRODS__000003_HU178BB,,,
Edwards Opticians,OP_5E3_487__000002_HU178BB,OPT,8 Saturday Market,,Beverley,,,HU17 8BB,Tel: 01482 868428, - ,,,1 rating Rate it yourself - /Services/opticians/LeaveReview/DefaultView.aspx?id=OP_5E3_487__000002_HU178BB,,,
Boots-Beverley,OP_5E3_11631__000001_HU179AJ,OPT,43-45 Toll Gavel,,,Beverley,Yorkshire,HU17 9AA,Tel: 01482 872333, - ,,,No ratings yet Rate it yourself - /Services/opticians/LeaveReview/DefaultView.aspx?id=OP_5E3_11631__000001_HU179AJ,0,0,
Specsavers Opticians,OP_5E3_7142__000001_HU179BN,OPT,52 Toll Gavel,,Beverley,,,HU17 9BN,Tel: 01482 679933, - ,,,No ratings yet Rate it yourself - /Services/opticians/LeaveReview/DefaultView.aspx?id=OP_5E3_7142__000001_HU179BN,0,0,
Arthur Leach Opticians,OP_5EK_967__000001_DN33AE,OPT,8 The Parade,Church Street,Armthorpe,Doncaster,,DN3 3AE,Tel: 01302 830168, - ,,,No ratings yet Rate it yourself - /Services/opticians/LeaveReview/DefaultView.aspx?id=OP_5EK_967__000001_DN33AE,0,0,
Rouse Opticians,OP_5E6_2061__000001_HU52AA,OPT,95 Newland Avenue,95 Newland Avenue,,Hull,,HU5 2AA,Tel: 01482 346728, - ,,,No ratings yet Rate it yourself - /Services/opticians/LeaveReview/DefaultView.aspx?id=OP_5E6_2061__000001_HU52AA,0,0,
M & A Optics,OP_5E6_5538__000002_HU52ES,OPT,115 Newland Avenue,,Hull,,,HU5 2ES,Tel: 01482 472848, - ,,,No ratings yet Rate it yourself - /Services/opticians/LeaveReview/DefaultView.aspx?id=OP_5E6_5538__000002_HU52ES,0,0,
"Daniels, Turner & Associates",5NXDANIELS__000002_HU31AA,OPT,90 Spring Bank,,Hull,E Yorkshire,,HU3 1AA,Tel: 01482 228525, - ,,,No ratings yet Rate it yourself - /Services/opticians/LeaveReview/DefaultView.aspx?id=5NXDANIELS__000002_HU31AA,0,0,
Tesco Opticians,CO1998__000001_HU28RW,OPT,Park Street,,Hull,E Yorkshire,,HU2 8RW,Tel: 01482 303437, - ,,,No ratings yet Rate it yourself - /Services/opticians/LeaveReview/DefaultView.aspx?id=CO1998__000001_HU28RW,0,0,
Wheatcroft Opticians Ltd,OP_5E6_12554__000001_HU31AB,OPT,72 Spring Bank,,Hull,,,HU3 1AB,Tel: 01482 329545, - ,,,No ratings yet Rate it yourself - /Services/opticians/LeaveReview/DefaultView.aspx?id=OP_5E6_12554__000001_HU31AB,0,0,
Todd & Clarke,OP_5E6_3229__000001_HU13QH,OPT,,10 Anlaby Road,,Hull,East Yorkshire,HU1 2PA,Tel: 01482 223502, - ,,,No ratings yet Rate it yourself - /Services/opticians/LeaveReview/DefaultView.aspx?id=OP_5E6_3229__000001_HU13QH,0,0,
Optical Express,HU2 8PX_11111,OPT,Prospect Street,,,Hull,Yorkshire(East Riding),HU2 8PX,Tel: 0800 023 2020, - ,,,No ratings yet Rate it yourself - /Services/opticians/LeaveReview/DefaultView.aspx?id=HU2 8PX_11111,0,0,
Boots-Hull - Prospect Centre,OP_5E6_11583__000002_HU28PS,OPT,48-58 Prospect Centre,,,Hull,,HU2 8PS,Tel: 01482 323892, - ,,,1 rating Rate it yourself - /Services/opticians/LeaveReview/DefaultView.aspx?id=OP_5E6_11583__000002_HU28PS,,,
Specsavers Opticians,OP_5E6_12910__000001_HU13LS,OPT,50-52 Jameson Street,,Hull,,,HU1 3LS,Tel: 01482 324494, - ,,,No ratings yet Rate it yourself - /Services/opticians/LeaveReview/DefaultView.aspx?id=OP_5E6_12910__000001_HU13LS,0,0,
Bright Eyes,OP_5E6_14672__000001_HU28HH,OPT,3 Percy Street,,Hull,East Yorkshire,,HU2 8HH,Tel: 01482 210888, - ,,,No ratings yet Rate it yourself - /Services/opticians/LeaveReview/DefaultView.aspx?id=OP_5E6_14672__000001_HU28HH,0,0,
Vision Express (UK) Ltd,OP_5E6_8572__000002_HU12PQ,OPT,F14-15 Upper Deck,Princes Quay,Hull,,,HU1 2PQ,Tel: 01482 323333, - ,,,No ratings yet Rate it yourself - /Services/opticians/LeaveReview/DefaultView.aspx?id=OP_5E6_8572__000002_HU12PQ,0,0,
Aspec's Opticians,OP_5E6_14671__000001_HU28PP,OPT,Unit 4 Saville Row,18 Saville Street,,Hull,East Yorkshire,HU1 3EF,Tel: 01482 211115, - ,,,No ratings yet Rate it yourself - /Services/opticians/LeaveReview/DefaultView.aspx?id=OP_5E6_14671__000001_HU28PP,0,0,
R M Higson,OP_5E6_1131__000001_HU13EA,OPT,,44 Savile Street,,Hull,East Yorkshire,HU1 3EA,Tel: 01482 329122, - ,,,No ratings yet Rate it yourself - /Services/opticians/LeaveReview/DefaultView.aspx?id=OP_5E6_1131__000001_HU13EA,0,0,
Moorhouse Opticians (Northern) Ltd,OP_5EL_3727__000001_DN60JA,OPT,16 Station Road,Askern,Doncaster,,,DN6 0JA,Tel: 01302 700425, - ,,,No ratings yet Rate it yourself - /Services/opticians/LeaveReview/DefaultView.aspx?id=OP_5EL_3727__000001_DN60JA,0,0,
Vision Care at Home,CO-5051-1,OPT,,Unit 14 Heather Court,Shawood Business Park,Doncaster,Yorkshire,DN2 5YL,Tel: 01302 859 308, - ,,,No ratings yet Rate it yourself - /Services/opticians/LeaveReview/DefaultView.aspx?id=CO-5051-1,0,0,
Asda Opticians,OP_5E5_14668__000003_HU74HS,OPT,Asda Stores,Kingswood,,Hull,,HU7 4HS,Tel: 01482 370820, - ,,,3 ratings Rate it yourself - /Services/opticians/LeaveReview/DefaultView.aspx?id=OP_5E5_14668__000003_HU74HS,,,
Asda Opticians,OPT_HU9 2BN,OPT,,THE MOUNT RETAIL PARK,,HULL,,HU9 2BN,, - ,,,No ratings yet Rate it yourself - /Services/opticians/LeaveReview/DefaultView.aspx?id=OPT_HU9 2BN,0,0,
Vision Plus Opticians,OP_5E5_9519__000001_HU88TE,OPT,,283 Holderness Road,,Hull,,HU8 8TE,Tel: 01482 225545, - ,,,No ratings yet Rate it yourself - /Services/opticians/LeaveReview/DefaultView.aspx?id=OP_5E5_9519__000001_HU88TE,0,0,
Robert Higson Opticians,OP_5E5_3497__000001_HU88SH,OPT,323 Holderness Road,,,Hull,,HU8 8SH,Tel: 01482 329404, - ,,,4 ratings Rate it yourself - /Services/opticians/LeaveReview/DefaultView.aspx?id=OP_5E5_3497__000001_HU88SH,,,
Bush Opticians (Hull) Ltd,OP_5E5_7794__000001_HU88RD,OPT,337 Holderness Road,,Hull,E Yorkshire,,HU8 8RD,Tel: 01482 323443, - ,,,No ratings yet Rate it yourself - /Services/opticians/LeaveReview/DefaultView.aspx?id=OP_5E5_7794__000001_HU88RD,0,0,
Rouse Opticians,OP_5E5_2060__000004_HU74EE,OPT,5c North Point Shopping Centre,Goodhart Road,Hull,E Yorkshire,,HU7 4EE,Tel: 01482 833451, - ,,,No ratings yet Rate it yourself - /Services/opticians/LeaveReview/DefaultView.aspx?id=OP_5E5_2060__000004_HU74EE,0,0,
Winter Opticians,OP_5E5_14667__000001_HU89AL,OPT,,623 Holderness Road,,Hull,,HU8 9AL,Tel: 01482 375295, - ,,,4 ratings Rate it yourself - /Services/opticians/LeaveReview/DefaultView.aspx?id=OP_5E5_14667__000001_HU89AL,,,
Parkhurst Opticians Ltd,OP_5EL_5106__000001_DN50AT,OPT,110 High Street,Bentley,,Doncaster,,DN5 0AT,Tel: 01405 740095, - ,,,1 rating Rate it yourself - /Services/opticians/LeaveReview/DefaultView.aspx?id=OP_5EL_5106__000001_DN50AT,,,
The Partially Sighted Society,OPT_DN26AA_1,OPT,,1 Bennetthorpe,,Doncaster,,DN2 6AA,Tel: 01302 965195, - ,,,No ratings yet Rate it yourself - /Services/opticians/LeaveReview/DefaultView.aspx?id=OPT_DN26AA_1,0,0,
UH Ltd T/A A C Smith Opticians,OP_5CK_3183__000001_DN11NE,OPT,34 Market Place,,Doncaster,,,DN1 1NE,Tel: 01302 344569, - ,,,No ratings yet Rate it yourself - /Services/opticians/LeaveReview/DefaultView.aspx?id=OP_5CK_3183__000001_DN11NE,0,0,
Vision Call Yorkshire (Community Eyecare Limited),MOB/231/5N7__000001_DN13PE,OPT,Kelham House,Kelham Street,Doncaster,,,DN1 3PE,, - ,,,No ratings yet Rate it yourself - /Services/opticians/LeaveReview/DefaultView.aspx?id=MOB/231/5N7__000001_DN13PE,0,0,
H Dickinson & Co,OP_5CK_10070__000001_DN11ES,OPT,,,38 Scot Lane,Doncaster,,DN1 1ES,Tel: 01302 344811, - ,,,No ratings yet Rate it yourself - /Services/opticians/LeaveReview/DefaultView.aspx?id=OP_5CK_10070__000001_DN11ES,0,0,
The Cotler Practice,CO-2482__000002_DN11DW,OPT,18 High Street,,Doncaster,South Yorkshire,,DN1 1DW,Tel: 01302 361638, - ,,,No ratings yet Rate it yourself - /Services/opticians/LeaveReview/DefaultView.aspx?id=CO-2482__000002_DN11DW,0,0,
Pollard Optics,OP_WF118DH_29559,OPT,Delta House,Delta Business Park,Fernley Green,Knottingley,West Yorkshire,WF11 8DH,Tel: 01977 670787, - ,,,No ratings yet Rate it yourself - /Services/opticians/LeaveReview/DefaultView.aspx?id=OP_WF118DH_29559,0,0,
Opticial Express,OP_12345_DN1 1QQ,OPT,20/22 Frenchgate,,,Doncaster,South Yorkshire,DN1 1QQ,Tel: 0800 023 2020, - ,,,No ratings yet Rate it yourself - /Services/opticians/LeaveReview/DefaultView.aspx?id=OP_12345_DN1 1QQ,0,0,
Scrivens Ltd,OP_5CK_1079__000001_DN13JU,OPT,23 Printing Office Street,,,Doncaster,Yorkshire,DN1 1TP,Tel: 01302 323157, - ,,,No ratings yet Rate it yourself - /Services/opticians/LeaveReview/DefaultView.aspx?id=OP_5CK_1079__000001_DN13JU,0,0,
Rayner Opticians ,OP_5CK_5426__000001_DN11HQ,OPT,,37a  Printing Office Street,,Doncaster,South Yorkshire,DN1 1TP,Tel: 01302 323101, - ,,,No ratings yet Rate it yourself - /Services/opticians/LeaveReview/DefaultView.aspx?id=OP_5CK_5426__000001_DN11HQ,0,0,
Edwards & Walker,OP_5CK_11152__000001_DN11TR,OPT,Edwards and Walker Opticians,16 Priory Place,Doncaster,Doncaster,South Yorkshire,DN1 1BZ,Tel: 01302 349193, - ,,,1 rating Rate it yourself - /Services/opticians/LeaveReview/DefaultView.aspx?id=OP_5CK_11152__000001_DN11TR,,,
Bell Brothers (Opticians) Ltd,OP_5CK_13596__000001_DN11DB,OPT,Bell Brothers Opticians,27 St. Sepulchre Gate,,Doncaster,South Yorkshire,DN1 1TD,Tel: 01302 323619, - ,,,No ratings yet Rate it yourself - /Services/opticians/LeaveReview/DefaultView.aspx?id=OP_5CK_13596__000001_DN11DB,0,0,
Specsavers Opticians,OP_5CK_5787__000002_DN11TD,OPT,9 St. Sepulchre Gate,,Doncaster,,,DN1 1TD,Tel: 01302 326557, - ,,,No ratings yet Rate it yourself - /Services/opticians/LeaveReview/DefaultView.aspx?id=OP_5CK_5787__000002_DN11TD,0,0,
Vision Value Opticians,OP_5CK_5973__000001_DN11TD,OPT,33 St. Sepulchre Gate,,Doncaster,,,DN1 1TD,Tel: 01302 768691, - ,,,1 rating Rate it yourself - /Services/opticians/LeaveReview/DefaultView.aspx?id=OP_5CK_5973__000001_DN11TD,,,