Organisation Name,NACS Code,Organisation Type,Address1,Address2,Address3,Address4,Address5,PostCode,Telephone Number,Opening time,Value  (Opening time),Banding Classification  (Opening time),NHS.UK users rating,Value  (NHS.UK users rating),Banding Classification  (NHS.UK users rating),Car parking (Is there car parking at this organisation?)
Specsavers Openshaw,01-19246,OPT,,"Unit 17&18 Lime Sq, Ashton old Rd ",,"Openshaw,  Manchester",,M11 1DA,, - ,,,3 ratings Rate it yourself - /Services/opticians/LeaveReview/DefaultView.aspx?id=01-19246,,,
Selby & Glover,OP_5LH_2460__000001_M436QF,OPT,393 Manchester Road,Droylsden,Manchester,,,M43 6QF,Tel: 0161 370 1017, - ,,,No ratings yet Rate it yourself - /Services/opticians/LeaveReview/DefaultView.aspx?id=OP_5LH_2460__000001_M436QF,0,0,
Openshaw Optical ,00005__000001_M111JS,OPT,1311 Ashton Old Road,Openshaw,,Manchester,,M11 1JS,Tel: 0161 370 1800, - ,,,2 ratings Rate it yourself - /Services/opticians/LeaveReview/DefaultView.aspx?id=00005__000001_M111JS,,,
Eyes Right Opticians,OP_5CR_3014__000003_M111JG,OPT,1304 Ashton Old Road,Openshaw,Manchester,,,M11 1JG,Tel: 0161 370 1553, - ,,,No ratings yet Rate it yourself - /Services/opticians/LeaveReview/DefaultView.aspx?id=OP_5CR_3014__000003_M111JG,0,0,
Selby & Glover,OP_5CL_4761__000001_M188LY,OPT,167 Chapman Street,Gorton,Manchester,,,M18 8TJ,Tel: 0161 223 0694, - ,,,No ratings yet Rate it yourself - /Services/opticians/LeaveReview/DefaultView.aspx?id=OP_5CL_4761__000001_M188LY,0,0,
Tesco Opticians,TES5NT__000002_M188LD,OPT,Hyde Road,Gorton,Manchester,,,M18 8LD,Tel: 0161 255 9438, - ,,,No ratings yet Rate it yourself - /Services/opticians/LeaveReview/DefaultView.aspx?id=TES5NT__000002_M188LD,0,0,
Asda Vision Centre,00003__000001_M113BD,OPT,"Sports City , Ashton New Road",Beswick,,Manchester,,M11 3BD,Tel: 01612 303512, - ,,,No ratings yet Rate it yourself - /Services/opticians/LeaveReview/DefaultView.aspx?id=00003__000001_M113BD,0,0,
Optieye Care,OP_5CL_1490__000001_M187EE,OPT,646 Hyde Road,Gorton,,Manchester,,M18 7EE,Tel: 0161 223 2001, - ,,,No ratings yet Rate it yourself - /Services/opticians/LeaveReview/DefaultView.aspx?id=OP_5CL_1490__000001_M187EE,0,0,
Wass Opticians,OP_5LH_9513__000001_M437BP,OPT,48-50 Ashton Road,Droylsden,Manchester,,,M43 7BP,Tel: 0161 370 2037, - ,,,1 rating Rate it yourself - /Services/opticians/LeaveReview/DefaultView.aspx?id=OP_5LH_9513__000001_M437BP,,,
Eyes Right Opticians Ltd,OP_5LH_4840__000001_M437AA,OPT,124 Market Street,,Manchester,Droylsden,,M43 7AA,Tel: 0161 301 1400, - ,,,No ratings yet Rate it yourself - /Services/opticians/LeaveReview/DefaultView.aspx?id=OP_5LH_4840__000001_M437AA,0,0,
J S R Opticians,OP_5CL_9668__000001_M124JJ,OPT,558 Stockport Road,Longsight,Manchester,,,M12 4JJ,Tel: 0161 225 5943, - ,,,1 rating Rate it yourself - /Services/opticians/LeaveReview/DefaultView.aspx?id=OP_5CL_9668__000001_M124JJ,,,
The Eye Centre,OPT_M130SH_1,OPT,The Eye Centre,640 Stockport Road,Longsight,Manchester,Lancashire,M13 0SH,Tel: 0161 478 7473 (ext. 0796168686), - ,,,2 ratings Rate it yourself - /Services/opticians/LeaveReview/DefaultView.aspx?id=OPT_M130SH_1,,,
P Toleman Opticians,OP_5CR_8861__000001_M106JF,OPT,86 Old Church Street,Newton Heath,Manchester,,,M40 2JF,Tel: 0161 681 5931, - ,,,1 rating Rate it yourself - /Services/opticians/LeaveReview/DefaultView.aspx?id=OP_5CR_8861__000001_M106JF,,,
Robert Glass Opticians,00000__000002_M130WQ,OPT,380 Dickinson Road,Longsight,Manchester,Manchester,,M13 0WQ,Tel: 0161 256 2266, - ,,,No ratings yet Rate it yourself - /Services/opticians/LeaveReview/DefaultView.aspx?id=00000__000002_M130WQ,0,0,
Eyecare Oncall Ltd (Domicilliary Only),OP_M130TT_89429,OPT,,30 Meldon Road,,Manchester,,M13 0TT,, - ,,,No ratings yet Rate it yourself - /Services/opticians/LeaveReview/DefaultView.aspx?id=OP_M130TT_89429,0,0,
Direct Vision ,OP_5CL_4381__000001_M193PN,OPT,904 Stockport Road,Levenshulme,,Manchester,Greater Manchester,M19 3AD,Tel: 0161 248 4200, - ,,,No ratings yet Rate it yourself - /Services/opticians/LeaveReview/DefaultView.aspx?id=OP_5CL_4381__000001_M193PN,0,0,
Tesco Opticians,OP_19985J5__000002_M350EJ,OPT,Oldham Road,Failsworth,Oldham,Oldham,,M35 0EJ,Tel: 0161 251 7438, - ,,,No ratings yet Rate it yourself - /Services/opticians/LeaveReview/DefaultView.aspx?id=OP_19985J5__000002_M350EJ,0,0,
Mobile Vision Care Ltd,01-27946,OPT,,26-28 Hilton St,,Manchester,,M1 2EH,, - ,,,No ratings yet Rate it yourself - /Services/opticians/LeaveReview/DefaultView.aspx?id=01-27946,0,0,
Optometry Clinics,000007__000004_M601QD,OPT,Carys Bannister Building,Dover Street,,Manchester,,M13 9PT,Tel: 0161 306 3860, - ,,,No ratings yet Rate it yourself - /Services/opticians/LeaveReview/DefaultView.aspx?id=000007__000004_M601QD,0,0,
Lindop Opticians ,OP_5CL_8706__000001_M193PZ,OPT,923 Stockport Road,Levenshulme,,Manchester,Greater Manchester,M19 3PZ,Tel: 0161 224 6878, - ,,,No ratings yet Rate it yourself - /Services/opticians/LeaveReview/DefaultView.aspx?id=OP_5CL_8706__000001_M193PZ,0,0,
Focus Optics,5J5 8408,OPT,Focus Optics,Failsworth District Centre,Ashton Road West,"Failsworth, Manchester",,M35 0AD,Tel: 0161 684 8659, - ,,,No ratings yet Rate it yourself - /Services/opticians/LeaveReview/DefaultView.aspx?id=5J5 8408,0,0,
J S R Opticians,OP_5CL_9823__000002_M145AL,OPT,60 Wilmslow Road,Rusholme,Manchester,,,M14 5AL,Tel: 0161 224 0163, - ,,,2 ratings Rate it yourself - /Services/opticians/LeaveReview/DefaultView.aspx?id=OP_5CL_9823__000002_M145AL,,,
You & Eye Opticians,OP5NT__000001_M145LQ,OPT,172 Wilmslow Road,Rusholme,Manchester,,,M14 5LQ,Tel: 0161 224 6550, - ,,,1 rating Rate it yourself - /Services/opticians/LeaveReview/DefaultView.aspx?id=OP5NT__000001_M145LQ,,,
Dixon Optometrists Ltd,OP_5F7_8275__000001_SK57AA,OPT,416 Reddish Road,Reddish,,Stockport,Cheshire,SK5 7AA,Tel: 0161 432 8101, - ,,,4 ratings Rate it yourself - /Services/opticians/LeaveReview/DefaultView.aspx?id=OP_5F7_8275__000001_SK57AA,,,Data not available
Cartwright Optometrists,OP_5LH_14166__000001_M343JU,OPT,41 Manchester Road,Denton,Manchester,,,M34 3JU,Tel: 0161 336 3726, - ,,,2 ratings Rate it yourself - /Services/opticians/LeaveReview/DefaultView.aspx?id=OP_5LH_14166__000001_M343JU,,,
Boots-Denton,OP_5LH_4597__000001_M343LE,OPT,32 Manchester Road,,,Denton,Lancashire,M34 3LE,Tel: 0161 336 6944, - ,,,1 rating Rate it yourself - /Services/opticians/LeaveReview/DefaultView.aspx?id=OP_5LH_4597__000001_M343LE,,,
Vision Express Ltd,OP_5CR_12274__000001_M42HU,OPT,Unit 62,City Centre,Manchester,,,M4 3AQ,Tel: 0161 832 8855, - ,,,No ratings yet Rate it yourself - /Services/opticians/LeaveReview/DefaultView.aspx?id=OP_5CR_12274__000001_M42HU,0,0,
Specsavers Opticians,OP_5CR_11534__000002_M42HU,OPT,Unit 84,Halle Mall,Manchester,,,M4 2HU,Tel: 0161 834 6665, - ,,,No ratings yet Rate it yourself - /Services/opticians/LeaveReview/DefaultView.aspx?id=OP_5CR_11534__000002_M42HU,0,0,
Boots-Manchester - Market Street,OP_5CR_13076__000001_M11PL,OPT,32 Market Street,,,Manchester,Lancashire,M1 1PL,Tel: 0161 832 3823, - ,,,3 ratings Rate it yourself - /Services/opticians/LeaveReview/DefaultView.aspx?id=OP_5CR_13076__000001_M11PL,,,
Jones & Co Styling Opticians,OP_5CR_13204__000001_M24WQ,OPT,82 King Street,City Centre,,Manchester,,M2 4WQ,Tel: 0161 834 7798, - ,,,No ratings yet Rate it yourself - /Services/opticians/LeaveReview/DefaultView.aspx?id=OP_5CR_13204__000001_M24WQ,0,0,
Visioncare at Home North West Ltd (Domicilliary Only),OP_OL70AU_46385,OPT,,"Unit 5c, Kayley Industrial Estate",,Ashton-under-Lyne,,OL7 0AU,, - ,,,No ratings yet Rate it yourself - /Services/opticians/LeaveReview/DefaultView.aspx?id=OP_OL70AU_46385,0,0,
Vision Care for Homeless People,OPT_M156JS_1,OPT,Cornerstone Day Centre,104B Denmark Road,,Manchester,,M15 6JS,Tel: 020 3286 4186, - ,,,No ratings yet Rate it yourself - /Services/opticians/LeaveReview/DefaultView.aspx?id=OPT_M156JS_1,0,0,
Arrowsmith Eyecare,OP_5CR_9836__000002_M95TT,OPT,672 Rochdale Road,Harpurhey,,Manchester,,M9 5TT,Tel: 0161 205 2575, - ,,,1 rating Rate it yourself - /Services/opticians/LeaveReview/DefaultView.aspx?id=OP_5CR_9836__000002_M95TT,,,
Eyes Right Ltd,OP_5LH_14171__000001_M436AB,OPT,12 Stockport Road,Denton,,Manchester,,M34 6AB,Tel: 0161 335 9500, - ,,,1 rating Rate it yourself - /Services/opticians/LeaveReview/DefaultView.aspx?id=OP_5LH_14171__000001_M436AB,,,
City Specs,OP_M14AJ_30180,OPT,,6 Royal Exchange Aracade,,Manchester,,M2 7EA,Tel: 0161 236 6697, - ,,,No ratings yet Rate it yourself - /Services/opticians/LeaveReview/DefaultView.aspx?id=OP_M14AJ_30180,0,0,
Framed Opticians,00008__000001_M26AB,OPT,1-3 St Ann's Passage,"1-3 St Ann's Passage, King Street",,Manchester,,M2 6AB,Tel: 0161 839 6753, - ,,,No ratings yet Rate it yourself - /Services/opticians/LeaveReview/DefaultView.aspx?id=00008__000001_M26AB,0,0,
Specsavers Harpurhey ,000006__000001_M94DH,OPT,Unit 41,North City Shopping Centre,,Harpurhey,,M9 4DH,Tel: 0161 202 8710, - ,,,1 rating Rate it yourself - /Services/opticians/LeaveReview/DefaultView.aspx?id=000006__000001_M94DH,,,
Optical Express ,OP_5CR_3256__000002_M91DH,OPT,"Unit 31, North City Shopping Centre",Lee Road,,Manchester,Lancashire,M9 4DH,Tel: 0800 023 2020, - ,,,No ratings yet Rate it yourself - /Services/opticians/LeaveReview/DefaultView.aspx?id=OP_5CR_3256__000002_M91DH,0,0,
Optical Express,OP_12345_M3 4DN,OPT,7 St John Street,,Deansgate,Manchester,Lancashire,M3 4DN,Tel: 0800 023 2020, - ,,,No ratings yet Rate it yourself - /Services/opticians/LeaveReview/DefaultView.aspx?id=OP_12345_M3 4DN,0,0,
Asda Opticians,OPT_OL6 7DP,OPT,,Cavendish Street,,Ashton-Under-Lyne,,OL6 7DP,Tel: 0161 342 6612, - ,,,No ratings yet Rate it yourself - /Services/opticians/LeaveReview/DefaultView.aspx?id=OPT_OL6 7DP,0,0,
Specsavers Opticians,OP_5AA_8734__000002_M146SQ,OPT,114 Mauldeth Road,Fallowfield,Manchester,,,M14 6SQ,Tel: 0161 434 2755, - ,,,No ratings yet Rate it yourself - /Services/opticians/LeaveReview/DefaultView.aspx?id=OP_5AA_8734__000002_M146SQ,0,0,
Murrays Opticians,OP_5CL_8609__000002_M144RL,OPT,173 Princess Road,Moss Side,Manchester,Manchester,,M14 4RL,Tel: 0161 226 1031, - ,,,No ratings yet Rate it yourself - /Services/opticians/LeaveReview/DefaultView.aspx?id=OP_5CL_8609__000002_M144RL,0,0,
Gent Brothers Opticians ,OP_5CR_11412__000001_M400JA,OPT,325 Hollinwood Avenue,New Moston,Manchester,,,M40 0JA,Tel: 0161 681 1348, - ,,,3 ratings Rate it yourself - /Services/opticians/LeaveReview/DefaultView.aspx?id=OP_5CR_11412__000001_M400JA,,,
Domiciliary only Ian Creek Opticians ,OP_5LH_14225__000002_M400JA,OPT,325 Hollinwood Avenue,New Moston,Manchester,,,M40 0JA,Tel: 0161 681 1348, - ,,,No ratings yet Rate it yourself - /Services/opticians/LeaveReview/DefaultView.aspx?id=OP_5LH_14225__000002_M400JA,0,0,
Roberts Opticians,OP_5LH_333__000001_SK164JZ,OPT,125 King Street,,Dukinfield,,,SK16 4JZ,Tel: 0161 330 2394, - ,,,1 rating Rate it yourself - /Services/opticians/LeaveReview/DefaultView.aspx?id=OP_5LH_333__000001_SK164JZ,,,
Boots-Ashton Under Lyne,OP_5LH_12363__000002_OL67JL,OPT,15-17 Staveleigh Way,Ladysmith Centre,Ashton-under-Lyne,Ashton-under-Lyne,,OL6 7JL,Tel: 0161 308 4428, - ,,,3 ratings Rate it yourself - /Services/opticians/LeaveReview/DefaultView.aspx?id=OP_5LH_12363__000002_OL67JL,,,
Specsavers Opticians,OP_5LH_11788__000001_OL67JG,OPT,Unit 12,Ladysmith Shopping Centre,Ashton-under-Lyne,Greater Manchester,,OL6 7JQ,Tel: 0161 339 4449, - ,,,No ratings yet Rate it yourself - /Services/opticians/LeaveReview/DefaultView.aspx?id=OP_5LH_11788__000001_OL67JG,0,0,
Vision Express,OP_5LH_3021__000001_OL67JH,OPT,,12 Mercian Way,,Ashton-under-Lyne,,OL6 7JH,Tel: 0161 339 6502, - ,,,No ratings yet Rate it yourself - /Services/opticians/LeaveReview/DefaultView.aspx?id=OP_5LH_3021__000001_OL67JH,0,0,
Muldoon & Tonge Opticians,OP_5LH_8867__000001_OL67LR,OPT,178 Stamford Street,,Ashton-under-Lyne,,,OL6 7LR,Tel: 0161 330 4643, - ,,,1 rating Rate it yourself - /Services/opticians/LeaveReview/DefaultView.aspx?id=OP_5LH_8867__000001_OL67LR,,,
A R Gregory ,OP_5J5_3345__000001_OL84SA,OPT,764 Hollins Road,Hollinwood,Oldham,,,OL8 4SA,Tel: 0161 681 3011, - ,,,1 rating Rate it yourself - /Services/opticians/LeaveReview/DefaultView.aspx?id=OP_5J5_3345__000001_OL84SA,,,
John H. Blease,OP_5LH_14165__000001_OL66BY,OPT,15 Fletcher Street,,Ashton-under-Lyne,,,OL6 6BY,Tel: 0161 330 2321, - ,,,No ratings yet Rate it yourself - /Services/opticians/LeaveReview/DefaultView.aspx?id=OP_5LH_14165__000001_OL66BY,0,0,
Vision Service Opticians,OP_5CR_11066__000001_M87ER,OPT,4 Progress Buildings,Halliwell Lane,Cheetham Hill,Manchester,,M8 9ER,Tel: 0161 740 9009, - ,,,1 rating Rate it yourself - /Services/opticians/LeaveReview/DefaultView.aspx?id=OP_5CR_11066__000001_M87ER,,,
The Eye Team,OP_5AA_8763__000003_M203BG,OPT,458-460 Wilmslow Road,Withington,,Manchester,,M20 3BG,Tel: 0161 445 4441, - ,,,No ratings yet Rate it yourself - /Services/opticians/LeaveReview/DefaultView.aspx?id=OP_5AA_8763__000003_M203BG,0,0,
Guys Opticians ,OP_5AA_10474__000002_M203BG,OPT,492 Wilmslow Road,,,Withington,Greater Manchester,M20 3BG,Tel: 0161 445 4723, - ,,,No ratings yet Rate it yourself - /Services/opticians/LeaveReview/DefaultView.aspx?id=OP_5AA_10474__000002_M203BG,0,0,
Optieye Care,OP_5F5_2755__000003_M71QE,OPT,6 Mocha Parade,Salford,,Manchester,,M7 1QE,Tel: 0161 839 2884, - ,,,No ratings yet Rate it yourself - /Services/opticians/LeaveReview/DefaultView.aspx?id=OP_5F5_2755__000003_M71QE,0,0,
Costco Wholesale UK Limited,OP_OL98AU_46293,OPT,,The Broadway,Chadderton,Oldham,,OL9 8AU,Tel: 0161 684 2015, - ,,,No ratings yet Rate it yourself - /Services/opticians/LeaveReview/DefaultView.aspx?id=OP_OL98AU_46293,0,0,
Vikesh Measuria,5LH 243__000001_OL66HG,OPT,28 - 30 Penny Meadow,,Ashton-under-Lyne,Lancashire,,OL6 6HG,Tel: 0161 330 9437, - ,,,No ratings yet Rate it yourself - /Services/opticians/LeaveReview/DefaultView.aspx?id=5LH 243__000001_OL66HG,0,0,
Boots-Stockport - Wellington Rd Nth,OP_5F7_2001__000001_SK42QN,OPT,186 Wellington Road North,,,Stockport,Cheshire,SK4 2QN,Tel: 0161 442 7570, - ,,,No ratings yet Rate it yourself - /Services/opticians/LeaveReview/DefaultView.aspx?id=OP_5F7_2001__000001_SK42QN,0,0,
The Eye Site Opticians ,OP_5CR_3302__000001_M85BN,OPT,58 Bury Old Road,Cheetham,Manchester,,,M8 5BN,Tel: 0161 795 2341, - ,,,1 rating Rate it yourself - /Services/opticians/LeaveReview/DefaultView.aspx?id=OP_5CR_3302__000001_M85BN,,,
The Eye Site (Opticians) Ltd,OP_5F5_14706__000003_M74AS,OPT,,47 Leicester Road,Salford,Manchester,,M7 4AS,Tel: 0161 792 8181, - ,,,No ratings yet Rate it yourself - /Services/opticians/LeaveReview/DefaultView.aspx?id=OP_5F5_14706__000003_M74AS,0,0,
Robert Glass Opticians,OP_5F5_7774__000001_M74QJ,OPT,3 King Edward Buildings,Bury Old Road,Salford,Manchester,,M7 4QJ,Tel: 0161 740 3069, - ,,,No ratings yet Rate it yourself - /Services/opticians/LeaveReview/DefaultView.aspx?id=OP_5F5_7774__000001_M74QJ,0,0,
Harris S J,OP_5F5_14700__000001_M74EF,OPT,37 Legh Street,Salford,,Manchester,,M7 4EF,Tel: 0161 792 0380, - ,,,No ratings yet Rate it yourself - /Services/opticians/LeaveReview/DefaultView.aspx?id=OP_5F5_14700__000001_M74EF,0,0,
F S L Opticians Ltd,OP_5F7_4648__000001_SK44DT,OPT,1a Moorside Road,Heaton Moor,Stockport,,,SK4 4DT,Tel: 0161 442 8141, - ,,,No ratings yet Rate it yourself - /Services/opticians/LeaveReview/DefaultView.aspx?id=OP_5F7_4648__000001_SK44DT,0,0,
Murray & Haggerty,OP_5AA_1531__000001_M206EL,OPT,238 Fog Lane,Didsbury,,Manchester,,M20 6EL,Tel: 0161 434 4597, - ,,,1 rating Rate it yourself - /Services/opticians/LeaveReview/DefaultView.aspx?id=OP_5AA_1531__000001_M206EL,,,
Asda Opticians,OP_5LH_14164__000001_SK141BD,OPT,Asda Stores,Water Street,,Hyde,,SK14 1BD,Tel: 0161 882 5712, - ,,,1 rating Rate it yourself - /Services/opticians/LeaveReview/DefaultView.aspx?id=OP_5LH_14164__000001_SK141BD,,,
Healthcall Optical Services Limited,OP_5J5_14219__000001_M67HL,OPT,36/37 Leslie Hough Way,Salford,Manchester,,,M6 6AJ,Tel: 0845 601 7241, - ,,,No ratings yet Rate it yourself - /Services/opticians/LeaveReview/DefaultView.aspx?id=OP_5J5_14219__000001_M67HL,0,0,
Specsavers Home Visits  (Domiciliary only)  ,OP_5LH_14239__000002_M66DE,OPT,,Lesley Hough Way,Manchester,Salford,,M6 6AJ,Tel: 0161 925 9888, - ,,,40 ratings Rate it yourself - /Services/opticians/LeaveReview/DefaultView.aspx?id=OP_5LH_14239__000002_M66DE,,,
H J Wheeldon Opticians,OP_5AA_8929__000001_M203YB,OPT,106 Palatine Road,West Didsbury,,Manchester,,M20 3YB,Tel: 0161 445 4253, - ,,,3 ratings Rate it yourself - /Services/opticians/LeaveReview/DefaultView.aspx?id=OP_5AA_8929__000001_M203YB,,,yes
Artingstall Opticians,OP_5LH_4834__000002_SK142EL,OPT,3 Clarendon Street,,Hyde,,,SK14 2EL,Tel: 0161 368 7460, - ,,,No ratings yet Rate it yourself - /Services/opticians/LeaveReview/DefaultView.aspx?id=OP_5LH_4834__000002_SK142EL,0,0,
Eye Pad Opticians ,CO-4696,OPT,,4 Seymour Grove,Old Trafford,Manchester,Lancashire,M16 0LH,Tel: 0161 478 0908, - ,,,No ratings yet Rate it yourself - /Services/opticians/LeaveReview/DefaultView.aspx?id=CO-4696,0,0,
Boots-Hyde,OP_5LH_743__000002_SK142QR,OPT,2 The Square,,,Hyde,Cheshire,SK14 2QR,Tel: 0161 368 2303, - ,,,No ratings yet Rate it yourself - /Services/opticians/LeaveReview/DefaultView.aspx?id=OP_5LH_743__000002_SK142QR,0,0,
Eyeline Opticians,OP_M53PH_45793,OPT,,100 Phoebe Street,,"Radclyffe Park, Salford",,M5 3PH,, - ,,,No ratings yet Rate it yourself - /Services/opticians/LeaveReview/DefaultView.aspx?id=OP_M53PH_45793,0,0,
Valli Opticians Hyde,B8V7X,OPT,,88 Market Street,,Hyde,Greater Manchester,SK14 1ES,Tel: 01613681183, - ,,,No ratings yet Rate it yourself - /Services/opticians/LeaveReview/DefaultView.aspx?id=B8V7X,0,0,
Specsavers Opticians,OP_5LH_7336__000001_SK142NA,OPT,27 Market Place,,Hyde,,,SK14 2NA,Tel: 0161 367 8977, - ,,,3 ratings Rate it yourself - /Services/opticians/LeaveReview/DefaultView.aspx?id=OP_5LH_7336__000001_SK142NA,,,
Iris Domiciliary,OL/6735169 5NP__000012_M66DE,OPT,Cromwell Road,,Salford,,,M6 6DE,, - ,,,No ratings yet Rate it yourself - /Services/opticians/LeaveReview/DefaultView.aspx?id=OL/6735169 5NP__000012_M66DE,0,0,
Rose Optical Services (North) Ltd,OP_5F5_14701__000004_M66DE,OPT,"1st Floor, Cromwell House",Cromwell Road,Salford,Manchester,,M6 6DE,Tel: 0161 925 9888, - ,,,No ratings yet Rate it yourself - /Services/opticians/LeaveReview/DefaultView.aspx?id=OP_5F5_14701__000004_M66DE,0,0,
Optical Express,OP_SK11PJ_89441,OPT,18-20 Mersey Way,,,Stockport,Cheshire,SK1 1PJ,Tel: 0800 023 2020, - ,,,No ratings yet Rate it yourself - /Services/opticians/LeaveReview/DefaultView.aspx?id=OP_SK11PJ_89441,0,0,
Hathershaw Opticians,OPT_OL81QN_1,OPT,,250 Ashton Road,,Oldham,,OL8 1QN,Tel: 0161 258 2147, - ,,,No ratings yet Rate it yourself - /Services/opticians/LeaveReview/DefaultView.aspx?id=OPT_OL81QN_1,0,0,
John Lyne Opticians,OP_5F7_14168__000001_SK11NT,OPT,15 Great Underbank,,Stockport,Cheshire,,SK1 1LF,Tel: 0161 474 0974, - ,,,No ratings yet Rate it yourself - /Services/opticians/LeaveReview/DefaultView.aspx?id=OP_5F7_14168__000001_SK11NT,0,0,
Cunninghams Opticians Ltd,OP_5F7_4763__000001_SK11RW,OPT,83a Princes Street,,Stockport,,,SK1 1RW,Tel: 0161 480 0066, - ,,,1 rating Rate it yourself - /Services/opticians/LeaveReview/DefaultView.aspx?id=OP_5F7_4763__000001_SK11RW,,,
Vision Express,5F7V1__000009_S,OPT,,Unit 6-10 Adlington Walk,Off Merseyway,Stockport,Cheshire,SK1 1PR,Tel: 0161 476 4686, - ,,,No ratings yet Rate it yourself - /Services/opticians/LeaveReview/DefaultView.aspx?id=5F7V1__000009_S,0,0,
Boots-Stockport - Merseyway,OP_5F7_12755__000002_SK11PU,OPT,47-49 Merseyway,,Stockport,Stockport,,SK1 1PU,Tel: 0161 429 0515, - ,,,No ratings yet Rate it yourself - /Services/opticians/LeaveReview/DefaultView.aspx?id=OP_5F7_12755__000002_SK11PU,0,0,
Kay Downs Opticians Ltd,OP_5F7_3520__000001_SK11XR,OPT,,41 Great Underbank,,Stockport,,SK1 1NE,Tel: 0161 480 4980, - ,,,1 rating Rate it yourself - /Services/opticians/LeaveReview/DefaultView.aspx?id=OP_5F7_3520__000001_SK11XR,,,
Specsavers Opticians,OP_5F7_3917__000001_SK11RY,OPT,65 Merseyway,,,Stockport,,SK1 1QW,Tel: 0161 477 6161, - ,,,No ratings yet Rate it yourself - /Services/opticians/LeaveReview/DefaultView.aspx?id=OP_5F7_3917__000001_SK11RY,0,0,
Domiciliary Iris Services Ltd,2465LH__000001_M66DQ,OPT,1st Floor Cromwell House,Cromwell Road,Salford,,,M6 6DQ,Tel: 0161 737 4971, - ,,,No ratings yet Rate it yourself - /Services/opticians/LeaveReview/DefaultView.aspx?id=2465LH__000001_M66DQ,0,0,
Leeming MJ Opticians,OP_5AA_9833__000001_M206RD,OPT,1a School Lane,Didsbury,Manchester,,,M20 6RD,Tel: 0161 445 5307, - ,,,1 rating Rate it yourself - /Services/opticians/LeaveReview/DefaultView.aspx?id=OP_5AA_9833__000001_M206RD,,,
Scrivens Opticians and Hearing Centre,OP_5F5_14697__000002_M65JA,OPT,,79 Pendleton Way,Salford,Manchester,,M6 5JA,Tel: 0161 736 4732, - ,,,No ratings yet Rate it yourself - /Services/opticians/LeaveReview/DefaultView.aspx?id=OP_5F5_14697__000002_M65JA,0,0,
Specsavers Opticians,OP_5F5_12099__000001_M65FD,OPT,24 Briar Hill Way,Salford,Manchester,,,M6 5FD,Tel: 0161 743 8182, - ,,,1 rating Rate it yourself - /Services/opticians/LeaveReview/DefaultView.aspx?id=OP_5F5_12099__000001_M65FD,,,
Didsbury Eyecare ,OP_5AA_5181__000001_M200RH,OPT,717 Wilmslow Road,Didsbury,Manchester,,,M20 6WF,Tel: 0161 445 7668, - ,,,1 rating Rate it yourself - /Services/opticians/LeaveReview/DefaultView.aspx?id=OP_5AA_5181__000001_M200RH,,,
Cadman Opticians ,OP_5CL_7805__000002_M210AS,OPT,420a Wilbraham Road,Chorlton,Manchester,,,M21 0AS,Tel: 0161 881 6058, - ,,,2 ratings Rate it yourself - /Services/opticians/LeaveReview/DefaultView.aspx?id=OP_5CL_7805__000002_M210AS,,,
Eyeline Opticians,OP_5F5_4988__000001_M65HW,OPT,60 Fitzgerald Way,Salford,Manchester,,,M6 5HW,Tel: 0161 737 1557, - ,,,No ratings yet Rate it yourself - /Services/opticians/LeaveReview/DefaultView.aspx?id=OP_5F5_4988__000001_M65HW,0,0,
Direct Vision,OP_5CL_12185__000001_M210AG,OPT,444 Wilbraham Road,Chorlton,Manchester,,,M21 0AG,Tel: 0161 860 6363, - ,,,2 ratings Rate it yourself - /Services/opticians/LeaveReview/DefaultView.aspx?id=OP_5CL_12185__000001_M210AG,,,
Valli Opticians Chorlton,K6N4I,OPT,,448 Barlow Moor Road,,Chorlton-Cum-Hardy,Greater Manchester,M21 0BQ,Tel: 01618812588, - ,,,No ratings yet Rate it yourself - /Services/opticians/LeaveReview/DefaultView.aspx?id=K6N4I,0,0,
Jo Padmore Eyewear ,000012__000001_M202DR,OPT,790 Wilmslow Road,Didsbury,Manchester,,,M20 2DR,Tel: 0161 445 8855, - ,,,1 rating Rate it yourself - /Services/opticians/LeaveReview/DefaultView.aspx?id=000012__000001_M202DR,,,
David Singh Visioncare ,OP_5CL_11232__000001_M218AD,OPT,420 Barlow Moor Road,Chorlton-Cum-Hardy,Manchester,Manchester,,M21 8AD,Tel: 0161 860 6656, - ,,,2 ratings Rate it yourself - /Services/opticians/LeaveReview/DefaultView.aspx?id=OP_5CL_11232__000001_M218AD,,,
Boots Opticians,OPT_M218AD_1,OPT,,426 Barlow Moor Road,Chorlton,Manchester,,M21 8AD,Tel: 0161 881 9661, - ,,,No ratings yet Rate it yourself - /Services/opticians/LeaveReview/DefaultView.aspx?id=OPT_M218AD_1,0,0,
Boots-Chorlton,OP_5CL_9122__000001_M212AD,OPT,426 Barlow Moor Road,,Manchester,Chorlton-Cum-Hardy,,M21 8AD,Tel: 0161 881 9661, - ,,,No ratings yet Rate it yourself - /Services/opticians/LeaveReview/DefaultView.aspx?id=OP_5CL_9122__000001_M212AD,0,0,
Steve Mayer Opticians,OP_5LH_1963__000001_SK151RR,OPT,46 A Grosvenor Street,,Stalybridge,,,SK15 1RR,Tel: 0161 303 7773, - ,,,No ratings yet Rate it yourself - /Services/opticians/LeaveReview/DefaultView.aspx?id=OP_5LH_1963__000001_SK151RR,0,0,
Travers Opticians,OP-5J5 -473__000013_M418TW,OPT,,39 Bishops Road,,manchester,,M25 0HT,Tel: 0161 746 8098, - ,,,2 ratings Rate it yourself - /Services/opticians/LeaveReview/DefaultView.aspx?id=OP-5J5 -473__000013_M418TW,,,