Organisation Name,NACS Code,Organisation Type,Address1,Address2,Address3,Address4,Address5,PostCode,Telephone Number,Opening time,Value  (Opening time),Banding Classification  (Opening time),NHS.UK users rating,Value  (NHS.UK users rating),Banding Classification  (NHS.UK users rating),Car parking (Is there car parking at this organisation?)
A Hurd Opticians,OP_5HR_1256__000001_ST136JP,OPT,3 Cawdry Buildings,Fountain Street,Leek,,,ST13 6JP,Tel: 01538 382 927, - ,,,No ratings yet Rate it yourself - /Services/opticians/LeaveReview/DefaultView.aspx?id=OP_5HR_1256__000001_ST136JP,0,0,
Boots-Leek,OP_5HR_13040__000002_ST136HN,OPT,44 Derby Street,,,Leek,Staffordshire,ST13 5AJ,Tel: 01538 385950, - ,,,No ratings yet Rate it yourself - /Services/opticians/LeaveReview/DefaultView.aspx?id=OP_5HR_13040__000002_ST136HN,0,0,
B Newbold (Leek) Ltd,OP_5HR_9303__000001_ST135DN,OPT,,49 St. Edward Street,,Leek,Staffordshire,ST13 5DN,Tel: 01538 382090, - ,,,3 ratings Rate it yourself - /Services/opticians/LeaveReview/DefaultView.aspx?id=OP_5HR_9303__000001_ST135DN,,,
Nusyte Opticians (chedle),OP_5HR_4056__000002_ST101AF,OPT,Nusyte Opticians (Cheadle),50 High street,Cheadle,Stoke-on-Trent,Staffordshire,ST10 1AF,Tel: 01538 752085, - ,,,No ratings yet Rate it yourself - /Services/opticians/LeaveReview/DefaultView.aspx?id=OP_5HR_4056__000002_ST101AF,0,0,
A Hurd Opticians,OP_5PJ_0005__000001_ST27BW,OPT,48 Millrise Road,Milton,Stoke-on-Trent,Staffordshire,,ST2 7BW,Tel: 01782 570057, - ,,,No ratings yet Rate it yourself - /Services/opticians/LeaveReview/DefaultView.aspx?id=OP_5PJ_0005__000001_ST27BW,0,0,
Greens Opticians,OP_5H7_7481__000001_DE61GG,OPT,,2 The Gallery,,Ashbourne,Derbyshire,DE6 1GG,Tel: 01335 342484, - ,,,No ratings yet Rate it yourself - /Services/opticians/LeaveReview/DefaultView.aspx?id=OP_5H7_7481__000001_DE61GG,0,0,yes
Vision Express,OL18376/5N6__000003_DE61GH,OPT,,42 St John Street,,Ashbourne,Derbyshire,DE6 1GH,Tel: 01335 300199, - ,,,No ratings yet Rate it yourself - /Services/opticians/LeaveReview/DefaultView.aspx?id=OL18376/5N6__000003_DE61GH,0,0,
John Fell Opticians Ltd ,OP_5H7_10985__000002_DE61GH,OPT,Horse and Jockey Yard,St John Street,Ashbourne,,,DE6 1GH,Tel: 01335 300658, - ,,,No ratings yet Rate it yourself - /Services/opticians/LeaveReview/DefaultView.aspx?id=OP_5H7_10985__000002_DE61GH,0,0,
Gillian E Scarisbrick Optometrist,OPT_ST119LY_1,OPT,,"266 Uttoxeter Road, Blythe Bridge",,Stoke on Trent,,ST11 9LY,Tel: 01782 388355, - ,,,No ratings yet Rate it yourself - /Services/opticians/LeaveReview/DefaultView.aspx?id=OPT_ST119LY_1,0,0,
Nusyte Opticians (biddulph),01-17051,OPT,,49 High Street,,Stoke-on-Trent,,ST8 6AD,, - ,,,No ratings yet Rate it yourself - /Services/opticians/LeaveReview/DefaultView.aspx?id=01-17051,0,0,
Razvi SIH,OP_5MF_4701__000001_ST36AF,OPT,1 Cornelious Street,,Stoke-on-Trent,,,ST3 6AF,Tel: 01782 314673, - ,,,No ratings yet Rate it yourself - /Services/opticians/LeaveReview/DefaultView.aspx?id=OP_5MF_4701__000001_ST36AF,0,0,
Portland Opticians,5MF-202__000002_ST31BE,OPT,21 Market Street,Longton,Stoke On Trent,Staffordshire,,ST3 1BE,Tel: 01782 319930, - ,,,No ratings yet Rate it yourself - /Services/opticians/LeaveReview/DefaultView.aspx?id=5MF-202__000002_ST31BE,0,0,
Specsavers Opticians,5MF-272__000002_ST31BS,OPT,36-38 Market Street,Longton,Stoke On Trent,Staffordshire,,ST3 1BS,Tel: 01782 337830, - ,,,No ratings yet Rate it yourself - /Services/opticians/LeaveReview/DefaultView.aspx?id=5MF-272__000002_ST31BS,0,0,
"John Saum Optometrist, Newbold Opticians t/a The Specsplace",OP_5ME__000001_ST31BS,OPT,,"46a Market Street,",,Longton / Stoke on Trent,,ST3 1BS,Tel: 01782 330803, - ,,,No ratings yet Rate it yourself - /Services/opticians/LeaveReview/DefaultView.aspx?id=OP_5ME__000001_ST31BS,0,0,
Boots-Hanley - Upper Market Sq,OP_5ME_1700__000002_ST11PZ,OPT,3-5 Upper Market Square,,Stoke-on-Trent,Hanley,Staffordshire,ST1 1PZ,Tel: 01782 202064, - ,,,No ratings yet Rate it yourself - /Services/opticians/LeaveReview/DefaultView.aspx?id=OP_5ME_1700__000002_ST11PZ,0,0,
Dolland & Aitchison,OP_5PH_0004__000004_ST11PS,OPT,Unit 221 Potteries Shopping Centre,Hanley,Stoke-on-Trent,Staffordshire,,ST1 1PS,Tel: 01782 219754, - ,,,No ratings yet Rate it yourself - /Services/opticians/LeaveReview/DefaultView.aspx?id=OP_5PH_0004__000004_ST11PS,0,0,
Vision Express (UK) Ltd,OP_5ME_12350__000002_ST11PS,OPT,The Potteries Shopping Centre,Hanley,Stoke-on-Trent,,,ST1 1PS,Tel: 01782 283400, - ,,,No ratings yet Rate it yourself - /Services/opticians/LeaveReview/DefaultView.aspx?id=OP_5ME_12350__000002_ST11PS,0,0,
Boots-Longton,OP_5MF_11634__000002_ST32HX,OPT,24-26 Bennett Precinct,,,Longton,Staffordshire,ST3 2JA,Tel: 01782 599002, - ,,,No ratings yet Rate it yourself - /Services/opticians/LeaveReview/DefaultView.aspx?id=OP_5MF_11634__000002_ST32HX,0,0,
R K Mehta,OP_5MF_8544__000001_ST32JF,OPT,31 The Strand,Longton,,STOKE-ON-TRENT,Staffordshire,ST3 2JF,Tel: 01782 319703, - ,,,No ratings yet Rate it yourself - /Services/opticians/LeaveReview/DefaultView.aspx?id=OP_5MF_8544__000001_ST32JF,0,0,
Crown Eyeglass,OP_5ME_7857__000001_ST11NQ,OPT,16 Tontine Street,,Stoke-on-Trent,,,ST1 1NQ,Tel: 01782 206969, - ,,,No ratings yet Rate it yourself - /Services/opticians/LeaveReview/DefaultView.aspx?id=OP_5ME_7857__000001_ST11NQ,0,0,
Specsavers Opticians,OP_5ME_13105__000001_ST11NP,OPT,2/4 Piccadilly,Hanley,Stoke-on-Trent,,,ST1 1DF,Tel: 01782 206662, - ,,,No ratings yet Rate it yourself - /Services/opticians/LeaveReview/DefaultView.aspx?id=OP_5ME_13105__000001_ST11NP,0,0,
Tesco Opticians Limited,OP_5PH_0291__000001_ST32JB,OPT,Baths Passage,Longton,Stoke On Trent,,,ST3 2JB,Tel: 01782 424400, - ,,,No ratings yet Rate it yourself - /Services/opticians/LeaveReview/DefaultView.aspx?id=OP_5PH_0291__000001_ST32JB,0,0,
Glyn Jones (Hanley) Ltd,OP_5ME_12317__000001_ST15LA,OPT,36 Trinity Street,,Stoke-on-Trent,Hanley,Staffordshire,ST1 5LA,Tel: 01782 212666, - ,,,7 ratings Rate it yourself - /Services/opticians/LeaveReview/DefaultView.aspx?id=OP_5ME_12317__000001_ST15LA,,,
A Hurd Opticians,OP_5PJ_0006__000002_ST13BT,OPT,15 Regent Road,Hanley,Stoke-on-Trent,Staffordshire,,ST1 3BT,Tel: 01782 266228, - ,,,No ratings yet Rate it yourself - /Services/opticians/LeaveReview/DefaultView.aspx?id=OP_5PJ_0006__000002_ST13BT,0,0,
Optical Express,ST1 1QH_27836,OPT,Suite 10 The Forecourt,12 Albion St,,Stoke-on-trent,Staffordshire,ST1 1QH,Tel: 0800 023 2020, - ,,,No ratings yet Rate it yourself - /Services/opticians/LeaveReview/DefaultView.aspx?id=ST1 1QH_27836,0,0,
S K Barker,OP_5HN_293__000001_SK176AZ,OPT,4 The Square,,Buxton,,,SK17 6AZ,Tel: 01298 25361, - ,,,No ratings yet Rate it yourself - /Services/opticians/LeaveReview/DefaultView.aspx?id=OP_5HN_293__000001_SK176AZ,0,0,
Specsavers Opticians,OP_5HN_12247__000001_SK176DE,OPT,Unit 14,Spring Gardens Centre,Buxton,,,SK17 6DE,Tel: 01298 766130, - ,,,No ratings yet Rate it yourself - /Services/opticians/LeaveReview/DefaultView.aspx?id=OP_5HN_12247__000001_SK176DE,0,0,
Boots-Buxton,OP_5HN_14731__000001_SK176BE,OPT,4 Spring Gardens,,Derbyshire,Buxton,,SK17 6DE,Tel: 01298 22443, - ,,,No ratings yet Rate it yourself - /Services/opticians/LeaveReview/DefaultView.aspx?id=OP_5HN_14731__000001_SK176BE,0,0,
M A Stoker & Partner,OP_5HN_10060__000001_SK176AS,OPT,5,The Grove,,Buxton,,SK17 6AS,Tel: 01298 23380, - ,,,1 rating Rate it yourself - /Services/opticians/LeaveReview/DefaultView.aspx?id=OP_5HN_10060__000001_SK176AS,,,
Buxton VE Ltd,VISION__000001_SK176DF,OPT,19 Spring Gardens Centre,,,Buxton,Derbyshire,SK17 6DF,Tel: 01298 214613, - ,,,No ratings yet Rate it yourself - /Services/opticians/LeaveReview/DefaultView.aspx?id=VISION__000001_SK176DF,0,0,
Scrivens Ltd,OP_5ME_6427__000001_ST63AG,OPT,37 Market Place,Burslem,,Stoke on Trent,Staffordshire,ST6 3AG,Tel: 01782 837530, - ,,,1 rating Rate it yourself - /Services/opticians/LeaveReview/DefaultView.aspx?id=OP_5ME_6427__000001_ST63AG,,,
Nusyte Opticians (burslem),OP_5PJ_0007__000002_ST63EH,OPT,Nusyte Opticians (Burslem),45 Queen Street,Burslem,Stoke-on-Trent,Staffordshire,ST6 3EH,Tel: 01782 834936, - ,,,No ratings yet Rate it yourself - /Services/opticians/LeaveReview/DefaultView.aspx?id=OP_5PJ_0007__000002_ST63EH,0,0,
Barker S K,OP_5HN_14729__000001_SK178NF,OPT,The New Surgery,Parke Road,Tideswell,,,SK17 8NF,Tel: 01298 871396, - ,,,No ratings yet Rate it yourself - /Services/opticians/LeaveReview/DefaultView.aspx?id=OP_5HN_14729__000001_SK178NF,0,0,
Nuvision Opticians,CO-5045,OPT,Nuvision,84 High Street Stoke on Trent,,Stoke on Trent,Staffordshire,ST6 5TJ,Tel: 01782 499600, - ,,,No ratings yet Rate it yourself - /Services/opticians/LeaveReview/DefaultView.aspx?id=CO-5045,0,0,
James Herd Opticians,OP_5ME_4308__000001_ST65TA,OPT,59 High Street,Tunstall,Stoke-on-Trent,,,ST6 5TA,Tel: 01782 837961, - ,,,No ratings yet Rate it yourself - /Services/opticians/LeaveReview/DefaultView.aspx?id=OP_5ME_4308__000001_ST65TA,0,0,
Nusyte Opticians (tunstall),OP_5ME_4057__000001_ST65AN,OPT,Nusyte Opticians (Tunstall),115 High street,Tunstall,Stoke-on-Trent,Staffordshire,ST6 5TA,Tel: 01782 837858, - ,,,1 rating Rate it yourself - /Services/opticians/LeaveReview/DefaultView.aspx?id=OP_5ME_4057__000001_ST65AN,,,
Ernest G Hanwell Ltd,OP_5ME_10839__000001_ST65AA,OPT,8 Tower Square,Tunstall,Stoke-on-Trent,,,ST6 5AA,Tel: 01782 838710, - ,,,No ratings yet Rate it yourself - /Services/opticians/LeaveReview/DefaultView.aspx?id=OP_5ME_10839__000001_ST65AA,0,0,
Burgess Opticians,OP_5PJ_0002__000001_ST65AW,OPT,97 Roundwell Street,Tunstall,Stoke-on-Trent,Staffordshire,,ST6 5AW,Tel: 01782 837881, - ,,,No ratings yet Rate it yourself - /Services/opticians/LeaveReview/DefaultView.aspx?id=OP_5PJ_0002__000001_ST65AW,0,0,
Ernest G Hanwell Ltd,OP_5ME_1538__000001_ST41HP,OPT,11 Glebe Street,,Stoke-on-Trent,,,ST4 1HP,Tel: 01782 844105, - ,,,No ratings yet Rate it yourself - /Services/opticians/LeaveReview/DefaultView.aspx?id=OP_5ME_1538__000001_ST41HP,0,0,
Nusyte Opticians (stoke),01-22440,OPT,,80-82 Church Street,,Stoke-on-Trent,,ST4 1BS,Tel: 01782 845592, - ,,,No ratings yet Rate it yourself - /Services/opticians/LeaveReview/DefaultView.aspx?id=01-22440,0,0,
Edwards RG,5MF-014__000002_ST44AA,OPT,80-82 Church Street,Stoke,Stoke On Trent,Staffordshire,,ST4 1BS,Tel: 01782 848070, - ,,,No ratings yet Rate it yourself - /Services/opticians/LeaveReview/DefaultView.aspx?id=5MF-014__000002_ST44AA,0,0,
Asda Opticians,OP_5PH_0002__000001_ST50AP,OPT,Wolstanton Retail Park,Wolstanton,Newcastle-under-Lyme,Staffordshire,,ST5 0AP,Tel: 01782 349112, - ,,,158 ratings Rate it yourself - /Services/opticians/LeaveReview/DefaultView.aspx?id=OP_5PH_0002__000001_ST50AP,,,
Nusyte Opticians (Wol),OP_5HW_2210__000004_ST50EP,OPT,Nusyte Opticians (Wol),107 High Street,Wolstanton,Newcastle-u-Lyme,,ST5 0EP,Tel: 01782 617072, - ,,,No ratings yet Rate it yourself - /Services/opticians/LeaveReview/DefaultView.aspx?id=OP_5HW_2210__000004_ST50EP,0,0,
Congleton Visionplus Limited,OP_5H5_13407__000001_CW121BD,OPT,3a Bridestone Centre,Victoria Street,Congleton,Cheshire,,CW12 1XD,Tel: 01260 299 395, - ,,,No ratings yet Rate it yourself - /Services/opticians/LeaveReview/DefaultView.aspx?id=OP_5H5_13407__000001_CW121BD,0,0,
Boots Opticians - Congleton,5NP001,OPT,,9-11 Bridge Street,,Congleton,,CW12 1AY,, - ,,,7 ratings Rate it yourself - /Services/opticians/LeaveReview/DefaultView.aspx?id=5NP001,,,
Vision Express (UK) Ltd,OP_5H5_2269__000001_CW121AN,OPT,17a Bridge Street,,Congleton,Cheshire,,CW12 1AS,Tel: 01260 299300, - ,,,No ratings yet Rate it yourself - /Services/opticians/LeaveReview/DefaultView.aspx?id=OP_5H5_2269__000001_CW121AN,0,0,
Kenneth Wright,OP_5ME_1551__000001_ST47NX,OPT,340 Hartshill Road,,Stoke-on-Trent,Stoke-on-Trent,,ST4 7NX,Tel: 01782 617217, - ,,,2 ratings Rate it yourself - /Services/opticians/LeaveReview/DefaultView.aspx?id=OP_5ME_1551__000001_ST47NX,,,
L Thompson Optometrist,OP_5H5_13453__000002_CW121JN,OPT,5 West Street,,Congleton,Cheshire,,CW12 1JN,Tel: 01260 270941, - ,,,1 rating Rate it yourself - /Services/opticians/LeaveReview/DefaultView.aspx?id=OP_5H5_13453__000002_CW121JN,,,
S W Cotton Optometrist,OP_5HR_7856__000001_ST74EH,OPT,92 Liverpool Road,Kidsgrove,Stoke-on-Trent,,,ST7 4EH,Tel: 01782 782385, - ,,,No ratings yet Rate it yourself - /Services/opticians/LeaveReview/DefaultView.aspx?id=OP_5HR_7856__000001_ST74EH,0,0,
Thompson Opticians,OP_5HR_1864__000001_ST71EA,OPT,65 Liverpool Road,Kidsgrove,Stoke-on-Trent,,,ST7 1EA,Tel: 01782 786998, - ,,,No ratings yet Rate it yourself - /Services/opticians/LeaveReview/DefaultView.aspx?id=OP_5HR_1864__000001_ST71EA,0,0,
The Eye Place,OP_5HN_12438__000001_DE451HD,OPT,4 Royal Oak Place,Matlock Street,,Bakewell,Derbyshire,DE45 1HD,Tel: 01629 813603, - ,,,No ratings yet Rate it yourself - /Services/opticians/LeaveReview/DefaultView.aspx?id=OP_5HN_12438__000001_DE451HD,0,0,
K A Heath,OP_5HN_14730__000001_DE451BT,OPT,Burgons Buildings,Bath Gardens,Bakewell,Derbyshire,,DE45 1BT,Tel: 01629 813532, - ,,,No ratings yet Rate it yourself - /Services/opticians/LeaveReview/DefaultView.aspx?id=OP_5HN_14730__000001_DE451BT,0,0,
B Newbold (Newcastle) Ltd,OP_5HW_9731__000001_ST51RP,OPT,34 Ironmarket,,Newcastle,,,ST5 1RP,Tel: 01782 617044, - ,,,No ratings yet Rate it yourself - /Services/opticians/LeaveReview/DefaultView.aspx?id=OP_5HW_9731__000001_ST51RP,0,0,
Specsavers Opticians,OP_5HW_3465__000001_ST51QZ,OPT,Unit 9 Castle Walk,,Staffordshire,Newcastle-under-Lyme,Staffordshire,ST5 1AN,Tel: 01782 714 444, - ,,,3 ratings Rate it yourself - /Services/opticians/LeaveReview/DefaultView.aspx?id=OP_5HW_3465__000001_ST51QZ,,,
Specsavers Opticians,ST7783__000002_ST147HN,OPT,3 High Street,,Uttoxeter,Staffordshire,,ST14 7HN,Tel: 01889 561770, - ,,,No ratings yet Rate it yourself - /Services/opticians/LeaveReview/DefaultView.aspx?id=ST7783__000002_ST147HN,0,0,
Browns Opticians,OP_5PH_0003__000002_ST52AE,OPT,33 Merrial Street,,Newcastle-under-Lyme,Staffordshire,,ST5 2AE,Tel: 01782 715113, - ,,,No ratings yet Rate it yourself - /Services/opticians/LeaveReview/DefaultView.aspx?id=OP_5PH_0003__000002_ST52AE,0,0,
Lancaster & Thorpe,OP_5HW_10835__000001_ST52AE,OPT,57 Merrial Street,,Newcastle,,,ST5 2AE,Tel: 01782 617400, - ,,,No ratings yet Rate it yourself - /Services/opticians/LeaveReview/DefaultView.aspx?id=OP_5HW_10835__000001_ST52AE,0,0,
McCracken Opticians,OP_5ML_14383__000001_ST148HY,OPT,Northgate House,Church Street,Uttoxeter,Staffordshire,,ST14 8AG,Tel: 01889 562184, - ,,,No ratings yet Rate it yourself - /Services/opticians/LeaveReview/DefaultView.aspx?id=OP_5ML_14383__000001_ST148HY,0,0,
"McKellen, Ashton & Tavernor",OP_5PH_0001__000001_ST52DZ,OPT,6 Friar Street,,Newcaslte-under-Lyme,Staffordshire,,ST5 2DZ,Tel: 01782 619175, - ,,,No ratings yet Rate it yourself - /Services/opticians/LeaveReview/DefaultView.aspx?id=OP_5PH_0001__000001_ST52DZ,0,0,
Boots-Newcastle under Lyme - High St,OP_5HW_5841__000002_ST51QL,OPT,60-62 High Street,,,Newcastle Under Lyme,Staffordshire,ST5 1QL,Tel: 01782 711739, - ,,,1 rating Rate it yourself - /Services/opticians/LeaveReview/DefaultView.aspx?id=OP_5HW_5841__000002_ST51QL,,,
Dollond & Aitchison,OP_5HW_13142__000001_ST51SW,OPT,Unit 11 Roebuck Centre,High Street,Newcastle-under-Lyme,,,ST5 1SW,Tel: 01782 630 478, - ,,,No ratings yet Rate it yourself - /Services/opticians/LeaveReview/DefaultView.aspx?id=OP_5HW_13142__000001_ST51SW,0,0,
Vision Express,5PK_004__000002_ST148HY,OPT,,15 Market Place,,Uttoxeter,Staffordshire,ST14 8HY,Tel: 01889 567474, - ,,,No ratings yet Rate it yourself - /Services/opticians/LeaveReview/DefaultView.aspx?id=5PK_004__000002_ST148HY,0,0,
Heath JH,5MF-023__000001_ST48ES,OPT,2 Garfield Avenue,Hanford,,Stoke On Trent,Staffordshire,ST4 8ES,Tel: 01782 643999, - ,,,No ratings yet Rate it yourself - /Services/opticians/LeaveReview/DefaultView.aspx?id=5MF-023__000001_ST48ES,0,0,yes
Park Lane Opticians,OP_5H5_13346__000001_SK116UA,OPT,141 Park Lane,,Macclesfield,Cheshire,,SK11 6UB,Tel: 01625 432777, - ,,,8 ratings Rate it yourself - /Services/opticians/LeaveReview/DefaultView.aspx?id=OP_5H5_13346__000001_SK116UA,,,
Oldbury & Cruickshank Optometrists,OP_5H5_28__000001_SK116JD,OPT,73 Pickford Street,,,Macclesfield,Cheshire,SK11 6JD,Tel: 01625 615002, - ,,,1 rating Rate it yourself - /Services/opticians/LeaveReview/DefaultView.aspx?id=OP_5H5_28__000001_SK116JD,,,
Boots-Macclesfield - Mill St,OP_5H5_13524__000002_SK116LT,OPT,46 Mill Street,,Macclesfield,Cheshire,,SK11 6LT,Tel: 01625 424108, - ,,,1 rating Rate it yourself - /Services/opticians/LeaveReview/DefaultView.aspx?id=OP_5H5_13524__000002_SK116LT,,,
Dollond & Aitchison Professional Services Ltd,OP_5H5_4983__000001_SK116LT,OPT,36 Mill Street,,Macclesfield,Cheshire,,SK11 6LT,Tel: 01625 425582, - ,,,No ratings yet Rate it yourself - /Services/opticians/LeaveReview/DefaultView.aspx?id=OP_5H5_4983__000001_SK116LT,0,0,
Macclesfield VE Limited,SK11 6NE__000001_SK116NE,OPT,31 Mill Street,,,Macclesfield,Cheshire,SK11 6NE,Tel: 01625 429831, - ,,,No ratings yet Rate it yourself - /Services/opticians/LeaveReview/DefaultView.aspx?id=SK11 6NE__000001_SK116NE,0,0,
Macclesfield Visionplus Limited,OP_5H5_2588__000002_SK116AJ,OPT,Unit 6,"Mill Street Mall, Grosvenor Centre",Macclesfield,Cheshire,,SK11 6AJ,Tel: 01625 501 111, - ,,,No ratings yet Rate it yourself - /Services/opticians/LeaveReview/DefaultView.aspx?id=OP_5H5_2588__000002_SK116AJ,0,0,
Your Home Eyecare,SK11 8TQ__000002_SK118TQ,OPT,1 Tenby Road,,Macclesfield,Cheshire,,SK11 8TQ,Tel: 0800 952 0064, - ,,,No ratings yet Rate it yourself - /Services/opticians/LeaveReview/DefaultView.aspx?id=SK11 8TQ__000002_SK118TQ,0,0,
Fosman Ltd,OP_5H7_9628__000001_DE44DR,OPT,7 St. John Street,Wirksworth,Derbyshire,,,DE4 4DR,Tel: 01629 825125, - ,,,No ratings yet Rate it yourself - /Services/opticians/LeaveReview/DefaultView.aspx?id=OP_5H7_9628__000001_DE44DR,0,0,
M Broad Opticians,OP_5H4_1328__000001_ST72AF,OPT,14a Lawton Road,,Alsager,Cheshire,,ST7 2AF,Tel: 01270 882235, - ,,,No ratings yet Rate it yourself - /Services/opticians/LeaveReview/DefaultView.aspx?id=OP_5H4_1328__000001_ST72AF,0,0,
Scrivens Ltd,OP_5H4_13359__000001_ST72AE,OPT,10 Lawton Road,,,Alsager,Cheshire,ST7 2AE,Tel: 01270 873256, - ,,,No ratings yet Rate it yourself - /Services/opticians/LeaveReview/DefaultView.aspx?id=OP_5H4_13359__000001_ST72AE,0,0,
Brian Hitchin ,-44 5LC__000002_ST158AD,OPT,,48 Mount Avenue,,Stone,Staffordshire,ST15 8EE,Tel: 01785 815 656, - ,,,No ratings yet Rate it yourself - /Services/opticians/LeaveReview/DefaultView.aspx?id=-44 5LC__000002_ST158AD,0,0,
Dale Opticians,OP_DE43LT_46230,OPT,1 Dale Road,,,Matlock,,DE4 3LT,Tel: 01629 57751, - ,,,No ratings yet Rate it yourself - /Services/opticians/LeaveReview/DefaultView.aspx?id=OP_DE43LT_46230,0,0,
David Bray Opticians,OP_5HN_9217__000001_DE43AQ,OPT,6 Bank Road,,Matlock,Derby,Derbyshire,DE4 3AQ,Tel: 01629 584280, - ,,,No ratings yet Rate it yourself - /Services/opticians/LeaveReview/DefaultView.aspx?id=OP_5HN_9217__000001_DE43AQ,0,0,
Lancaster and Thorpe,OP_5HN_14732__000002_DE43AR,OPT,,13 Causeway Lane,,Matlock,Derbyshire,DE4 3AR,Tel: 01629 582590, - ,,,No ratings yet Rate it yourself - /Services/opticians/LeaveReview/DefaultView.aspx?id=OP_5HN_14732__000002_DE43AR,0,0,no
Scrivens Opticians & Hearing Care,OP_5HN_14734__000001_SK23OHH,OPT,,7 Market Street,Chapel-En-le-Frith,Chapel en le Frith,,SK23 0HH,Tel: 01298 812427, - ,,,No ratings yet Rate it yourself - /Services/opticians/LeaveReview/DefaultView.aspx?id=OP_5HN_14734__000001_SK23OHH,0,0,
Peter Bowers Optometrist,OP_5MN_2377__000001_ST158AD,OPT,,63A High Street,,Stone,Staffordshire,ST15 8AD,Tel: 01785 813902, - ,,,No ratings yet Rate it yourself - /Services/opticians/LeaveReview/DefaultView.aspx?id=OP_5MN_2377__000001_ST158AD,0,0,
Scrivens Opticians & Hearing Care,,OPT,,27 High Street,,Stone,,ST15 8AJ,Tel: 01785 814777, - ,,,N/A - Data not available,,,
Nusyte Opticians (Stone),5PK_ST15 8YQ__000001_ST158YQ,OPT,Nusyte Opticians (Stone),1/2 Oddfellows,Adies Alley,Stone,Staffordshire,ST15 8YQ,Tel: 01785 814777, - ,,,No ratings yet Rate it yourself - /Services/opticians/LeaveReview/DefaultView.aspx?id=5PK_ST15 8YQ__000001_ST158YQ,0,0,
T J Hopkins,OP_5H4_13430__000001_ST72JA,OPT,122 Crewe Road,,Alsager,Cheshire,,ST7 2JA,Tel: 01270 872523, - ,,,No ratings yet Rate it yourself - /Services/opticians/LeaveReview/DefaultView.aspx?id=OP_5H4_13430__000001_ST72JA,0,0,
Jenks & Burgess Opticians,OP_5HN_11466__000002_SK237LP,OPT,24 Market Street,Whaley Bridge,High Peak,,,SK23 7LP,Tel: 01663 733861, - ,,,No ratings yet Rate it yourself - /Services/opticians/LeaveReview/DefaultView.aspx?id=OP_5HN_11466__000002_SK237LP,0,0,
Brian Hitchin (DOM),5LA_OPT_44__000003_ST158AD,OPT,"60, Pirehill Lane,",,,Stone,Staffordshire,ST15 0JN,Tel: 017581 5656, - ,,,No ratings yet Rate it yourself - /Services/opticians/LeaveReview/DefaultView.aspx?id=5LA_OPT_44__000003_ST158AD,0,0,
Paul Rowlands Opticians,OP_5H4_4304__000001_CW111AR,OPT,2 Georges Walk,Off High Street,Sandbach,,,CW11 1AR,Tel: 01270 759916, - ,,,1 rating Rate it yourself - /Services/opticians/LeaveReview/DefaultView.aspx?id=OP_5H4_4304__000001_CW111AR,,,
Boots-Sandbach,OP_5H4_4093__000001_CW110DA,OPT,Unit 4,10 Congleton Road,,Sandbach,,CW11 1HJ,Tel: 01270 766870, - ,,,1 rating Rate it yourself - /Services/opticians/LeaveReview/DefaultView.aspx?id=OP_5H4_4093__000001_CW110DA,,,
Boots Opticians,OPT_CW111JH_1,OPT,,Unit 4 10 Congleton Road,,Sandbach,,CW11 1HJ,Tel: 01270 766 870, - ,,,1 rating Rate it yourself - /Services/opticians/LeaveReview/DefaultView.aspx?id=OPT_CW111JH_1,,,
Steven D Morris Opticians,OP_5H4_13468__000001_CW111GT,OPT,2 Welles Street,,Sandbach,Cheshire,,CW11 1GT,Tel: 01270 765848, - ,,,No ratings yet Rate it yourself - /Services/opticians/LeaveReview/DefaultView.aspx?id=OP_5H4_13468__000001_CW111GT,0,0,
Bramwells Opticians,OP_5H4_2395__000001_CW111AB,OPT,4 Hightown,,Sandbach,Cheshire,,CW11 1AB,Tel: 01270 763641, - ,,,No ratings yet Rate it yourself - /Services/opticians/LeaveReview/DefaultView.aspx?id=OP_5H4_2395__000001_CW111AB,0,0,
The Glebe Field Centre,OP_5ED_13289__000002_DE45EU,OPT,Glebe Field Close,Crich,Derbyshire,,,DE4 5EU,Tel: 01773 857894, - ,,,No ratings yet Rate it yourself - /Services/opticians/LeaveReview/DefaultView.aspx?id=OP_5ED_13289__000002_DE45EU,0,0,
School House Optometry Clinic,OPT_SK122BB_1,OPT,,School House Surgery,Buxton Old Road,Disley,Cheshire,SK12 2BB,Tel: 01663 764488, - ,,,No ratings yet Rate it yourself - /Services/opticians/LeaveReview/DefaultView.aspx?id=OPT_SK122BB_1,0,0,
Tutbury Opticians,OP_5ML_7802__000001_DE139LU,OPT,"Unit 8, Tutbury Mill Mews",6 Lower High Street,Tutbury,Staffs,,DE13 9LU,Tel: 01283 813329, - ,,,No ratings yet Rate it yourself - /Services/opticians/LeaveReview/DefaultView.aspx?id=OP_5ML_7802__000001_DE139LU,0,0,
Vision Express,C/01-16611__000002_DE561PW,OPT,,3 King Street,,Belper,Derbyshire,DE56 1PW,Tel: 01773 825361, - ,,,1 rating Rate it yourself - /Services/opticians/LeaveReview/DefaultView.aspx?id=C/01-16611__000002_DE561PW,,,
Specsavers Opticians,OL19617/5N6__000002_DE561PL,OPT,46-48 King Street,Belper,Derbyshire,,,DE56 1PL,Tel: 01773 824375, - ,,,No ratings yet Rate it yourself - /Services/opticians/LeaveReview/DefaultView.aspx?id=OL19617/5N6__000002_DE561PL,0,0,
Lancaster & Thorpe Opticians,OP_5ED_1708__000001_DE561AX,OPT,29B King Street,,,Belper,Derbyshire,DE56 1PX,Tel: 01773 822231, - ,,,No ratings yet Rate it yourself - /Services/opticians/LeaveReview/DefaultView.aspx?id=OP_5ED_1708__000001_DE561AX,0,0,no
Morans Opticians,OP_5HN_8606__000001_SK224AE,OPT,,28 Market Street,New Mills,High Peak,Derbyshire,SK22 4AE,Tel: 01663 742338, - ,,,1 rating Rate it yourself - /Services/opticians/LeaveReview/DefaultView.aspx?id=OP_5HN_8606__000001_SK224AE,,,