Organisation Name,NACS Code,Organisation Type,Address1,Address2,Address3,Address4,Address5,PostCode,Telephone Number,Opening time,Value  (Opening time),Banding Classification  (Opening time),NHS.UK users rating,Value  (NHS.UK users rating),Banding Classification  (NHS.UK users rating),Car parking (Is there car parking at this organisation?)
Pinder's Optometrists,OP_5AP_8682__000002_NG229PR,OPT,33 Forest Road,New Ollerton,Newark,,,NG22 9PR,Tel: 01623 863384, - ,,,No ratings yet Rate it yourself - /Services/opticians/LeaveReview/DefaultView.aspx?id=OP_5AP_8682__000002_NG229PR,0,0,
Charlotte Saunders Ltd (Charlotte Saunders),OP_NG236QA_34422,OPT,,5 High Street,,Newark,,NG23 6QA,Tel: 07898695809, - ,,,No ratings yet Rate it yourself - /Services/opticians/LeaveReview/DefaultView.aspx?id=OP_NG236QA_34422,0,0,
DI Blow Opticians,OP_5AP_13006__000002_NG210JP,OPT,"2 Sherwood Parade, Kirklington Road",Rainworth,Mansfield,,,NG21 0JP,Tel: 01623 797055, - ,,,No ratings yet Rate it yourself - /Services/opticians/LeaveReview/DefaultView.aspx?id=OP_5AP_13006__000002_NG210JP,0,0,
Pinder's Optometrists,OP_5AP_877__000003_NG250AA,OPT,20 Queen Street,,Southwell,,,NG25 0AA,Tel: 01636 812286, - ,,,No ratings yet Rate it yourself - /Services/opticians/LeaveReview/DefaultView.aspx?id=OP_5AP_877__000003_NG250AA,0,0,
Minster Optical Limited t/a Andrew Spybey & Associates,TP80E,OPT,,Willoughby House,,Nottinghamshire,,NG25 0HQ,, - ,,,No ratings yet Rate it yourself - /Services/opticians/LeaveReview/DefaultView.aspx?id=TP80E,0,0,
Pinder's Optometrists,OP_5AM_12773__000001_NG200JP,OPT,1 Sherwood Street,Warsop,Mansfield,,,NG20 0JP,Tel: 01623 842289, - ,,,No ratings yet Rate it yourself - /Services/opticians/LeaveReview/DefaultView.aspx?id=OP_5AM_12773__000001_NG200JP,0,0,
Asda Opticians,OP_5AM_14065__000001_NG190HA,OPT,Old Mill Lane,Forest Town,Mansfield,Nottinghamshire,,NG19 0HA,Tel: 01623 676767, - ,,,3 ratings Rate it yourself - /Services/opticians/LeaveReview/DefaultView.aspx?id=OP_5AM_14065__000001_NG190HA,,,
Woodhouse Eye Centre,CO-0006/3/5N8__000005_NG198BB,OPT,41 High Street,Mansfield Woodhouse,Mansfield,,,NG19 8BB,Tel: 01623 660349, - ,,,No ratings yet Rate it yourself - /Services/opticians/LeaveReview/DefaultView.aspx?id=CO-0006/3/5N8__000005_NG198BB,0,0,
Pinder's Optometrists,OP_5AM_0011__000002_NG182BT,OPT,8 Rufford Avenue,,Mansfield,Nottinghamshire,,NG18 2BT,Tel: 01623 628844, - ,,,No ratings yet Rate it yourself - /Services/opticians/LeaveReview/DefaultView.aspx?id=OP_5AM_0011__000002_NG182BT,0,0,
Duffy Optometrists,OP_5AM_0010__000002_NG181AF,OPT,31 Church Street,,Mansfield,Nottinghamshire,,NG18 1AF,Tel: 01623 622021, - ,,,No ratings yet Rate it yourself - /Services/opticians/LeaveReview/DefaultView.aspx?id=OP_5AM_0010__000002_NG181AF,0,0,
Boots-Mansfield - Four Seasons Centre,OP_5AM_10995__000003_NG181SU,OPT,Number 39,Four Seasons Shopping Centre,Mansfield,Nottinghamshire,,NG18 1SY,Tel: 01623 652390, - ,,,2 ratings Rate it yourself - /Services/opticians/LeaveReview/DefaultView.aspx?id=OP_5AM_10995__000003_NG181SU,,,
Crown Optical Centre,OP_5AM_0001__000001_NG186HU,OPT,8 Market Place,,Mansfield,Nottinghamshire,,NG18 1HU,Tel: 01623 621112, - ,,,No ratings yet Rate it yourself - /Services/opticians/LeaveReview/DefaultView.aspx?id=OP_5AM_0001__000001_NG186HU,0,0,
Boots-Mansfield - West Gate,OP_5AM_6709__000004_NG181RY,OPT,9-11 Westgate,,Nottinghamshire,Mansfield,,NG18 1RY,Tel: 01623 624555, - ,,,No ratings yet Rate it yourself - /Services/opticians/LeaveReview/DefaultView.aspx?id=OP_5AM_6709__000004_NG181RY,0,0,
Dudley & Severn,OP_5ET_A469__000001_DN226ES,OPT,9 West Street,,Retford,Nottinghamshire,,DN22 6ES,Tel: 01777 703030, - ,,,No ratings yet Rate it yourself - /Services/opticians/LeaveReview/DefaultView.aspx?id=OP_5ET_A469__000001_DN226ES,0,0,
Pinder's Optometrists,OP_5AM_12761__000001_NG181JL,OPT,5-9 Queen Street,,Mansfield,,,NG18 1JL,Tel: 01623 621965, - ,,,No ratings yet Rate it yourself - /Services/opticians/LeaveReview/DefaultView.aspx?id=OP_5AM_12761__000001_NG181JL,0,0,
Vision Express,OP_5AM_8905__000001_NG181SN,OPT,The Four Seasons Centre,,Mansfield,,,NG18 1SN,Tel: 01623 422222, - ,,,No ratings yet Rate it yourself - /Services/opticians/LeaveReview/DefaultView.aspx?id=OP_5AM_8905__000001_NG181SN,0,0,
"Bryson, Bell & Clenton",OP_5AM_11910__000002_NG181RU,OPT,59 West Gate,,Mansfield,,,NG18 1RU,Tel: 01623 623393, - ,,,No ratings yet Rate it yourself - /Services/opticians/LeaveReview/DefaultView.aspx?id=OP_5AM_11910__000002_NG181RU,0,0,
Woolcott Opticians,OP_5ET_3205__000003_DN226DY,OPT,30 Carolgate,,Retford,,,DN22 6DY,Tel: 01777 703340, - ,,,1 rating Rate it yourself - /Services/opticians/LeaveReview/DefaultView.aspx?id=OP_5ET_3205__000003_DN226DY,,,
Bingham & Young(Young Optical Limited),OP_5ET_2900__000001_DN227SQ,OPT,2 Exchange Street,,Retford,Retford,,DN22 6BL,Tel: 01777 703328, - ,,,No ratings yet Rate it yourself - /Services/opticians/LeaveReview/DefaultView.aspx?id=OP_5ET_2900__000001_DN227SQ,0,0,
Opticare Midlands Limited,OP_5AP_9380__000001_NG241DH,OPT,3 Paxton Court,,Newark,,,NG24 1DH,Tel: 01636 679555, - ,,,No ratings yet Rate it yourself - /Services/opticians/LeaveReview/DefaultView.aspx?id=OP_5AP_9380__000001_NG241DH,0,0,
Tesco Opticians,CO-0072/5N8__000001_NG220AP,OPT,Chesterfield Road,,Mansfield,,,NG19 7BQ,Tel: 01623 581400, - ,,,No ratings yet Rate it yourself - /Services/opticians/LeaveReview/DefaultView.aspx?id=CO-0072/5N8__000001_NG220AP,0,0,
Specsavers Opticians,OP_5AP_12095__000001_NG241EW,OPT,c/o Morrisons Superstore,Kings Road,Newark,,,NG24 1EW,Tel: 01636 611599, - ,,,No ratings yet Rate it yourself - /Services/opticians/LeaveReview/DefaultView.aspx?id=OP_5AP_12095__000001_NG241EW,0,0,
Duffy Optometrists,OP_5AP_8716__000001_NG241JT,OPT,51 Stodman Street,,Newark,Nottinghamshire,,NG24 1AW,Tel: 01636 705677, - ,,,No ratings yet Rate it yourself - /Services/opticians/LeaveReview/DefaultView.aspx?id=OP_5AP_8716__000001_NG241JT,0,0,
London Eye Bespoke Eyewear,CO-0099,OPT,,9 Chain Lane,,Newark,,NG24 1AU,, - ,,,No ratings yet Rate it yourself - /Services/opticians/LeaveReview/DefaultView.aspx?id=CO-0099,0,0,
Retford Specsavers Ltd,OP_5ET_9436__000001_DN226DR,OPT,10a Market Place,,,Retford,,DN22 6DR,Tel: 01777 711711, - ,,,4 ratings Rate it yourself - /Services/opticians/LeaveReview/DefaultView.aspx?id=OP_5ET_9436__000001_DN226DR,,,
Boots-Newark,OP_5AP_11578__000001_NG241EG,OPT,31-32 Market Place,,,Newark,Nottinghamshire,NG24 1EG,Tel: 01636 702057, - ,,,No ratings yet Rate it yourself - /Services/opticians/LeaveReview/DefaultView.aspx?id=OP_5AP_11578__000001_NG241EG,0,0,
Specsavers Opticians,OP_5AM_8070__000001_NG181RQ,OPT,55 West Gate,,Mansfield,,,NG18 1RQ,Tel: 01623 650273, - ,,,2 ratings Rate it yourself - /Services/opticians/LeaveReview/DefaultView.aspx?id=OP_5AM_8070__000001_NG181RQ,,,
J:D Opticians,TP3XC,OPT,,17/19 Appleton Gate   ,,Newark,,NG24 1JR,Tel: 01636 611133, - ,,,No ratings yet Rate it yourself - /Services/opticians/LeaveReview/DefaultView.aspx?id=TP3XC,0,0,
Scrivens Ltd,OP_5AP_5472__000002_NG241UD,OPT,10 The Arcade,,,Newark,Nottinghamshire,NG24 1UD,Tel: 01636 704503, - ,,,No ratings yet Rate it yourself - /Services/opticians/LeaveReview/DefaultView.aspx?id=OP_5AP_5472__000002_NG241UD,0,0,
Richards Opticians,OP_5AP_3771__000001_NG241PX,OPT,Harry's Eyewear,5-7 Barnby Gate,,Newark,Nottinghamshire,NG24 1PX,Tel: 01636 704656, - ,,,No ratings yet Rate it yourself - /Services/opticians/LeaveReview/DefaultView.aspx?id=OP_5AP_3771__000001_NG241PX,0,0,
DI Blow Opticians,CO-0004/4/5N8__000001_NG208AA,OPT,14 Market Place,Shirebrook,Mansfield,,,NG20 8AA,Tel: 01623 748245, - ,,,2 ratings Rate it yourself - /Services/opticians/LeaveReview/DefaultView.aspx?id=CO-0004/4/5N8__000001_NG208AA,,,
Vision Value Opticians Ltd,OP_5EG_3403__000002_NG208AQ,OPT,76 Victoria Street,Shirebrook,Mansfield,,,NG20 8AQ,Tel: 01623 742369, - ,,,No ratings yet Rate it yourself - /Services/opticians/LeaveReview/DefaultView.aspx?id=OP_5EG_3403__000002_NG208AQ,0,0,
D I Blow Ltd,OP_5EG_13014__000001_NG208AN,OPT,14 Market Street,Shirebrook,Mansfield,,,NG20 8AN,Tel: 01623 748245, - ,,,No ratings yet Rate it yourself - /Services/opticians/LeaveReview/DefaultView.aspx?id=OP_5EG_13014__000001_NG208AN,0,0,
Gilbert Opticians,5ET0032__000001_S801DG,OPT,55 Bridge Street,,Worksop,Nottinghamshire,,S80 1DG,Tel: 01909 472506, - ,,,No ratings yet Rate it yourself - /Services/opticians/LeaveReview/DefaultView.aspx?id=5ET0032__000001_S801DG,0,0,
Boots-Worksop - Bridge St,OP_5ET_2185__000005_S801DP,OPT,15A Bridge Street,,,Worksop,Nottinghamshire,S80 1DP,Tel: 01909 472984, - ,,,No ratings yet Rate it yourself - /Services/opticians/LeaveReview/DefaultView.aspx?id=OP_5ET_2185__000005_S801DP,0,0,
Specsavers Opticians,OP_5ET_5960__000004_S801DP,OPT,9 Bridge Street,,Worksop,,,S80 1DP,Tel: 01909 500403, - ,,,1 rating Rate it yourself - /Services/opticians/LeaveReview/DefaultView.aspx?id=OP_5ET_5960__000004_S801DP,,,
Davies-Todd Opticians Ltd,OP_5ET_2537__000004_S801JR,OPT,,31 Bridge Place,Worksop,Nottinghamshire,,S80 1DT,Tel: 01909 486418, - ,,,5 ratings Rate it yourself - /Services/opticians/LeaveReview/DefaultView.aspx?id=OP_5ET_2537__000004_S801JR,,,
Worksop V.E. Limited,C/0001/5ET__000005_S801JR,OPT,Unit 18,Priory Centre,Worksop,Nottinghamshire,,S80 1JR,Tel: 01909 488795, - ,,,No ratings yet Rate it yourself - /Services/opticians/LeaveReview/DefaultView.aspx?id=C/0001/5ET__000005_S801JR,0,0,
DI Blow Opticians,OP_5FA_7203__000001_NG171AZ,OPT,55a Portland Square,,Sutton-In-Ashfield,,,NG17 1AZ,Tel: 01623 511896, - ,,,No ratings yet Rate it yourself - /Services/opticians/LeaveReview/DefaultView.aspx?id=OP_5FA_7203__000001_NG171AZ,0,0,
Specsavers Opticians,OP_5FA_1545__000006_NG171BJ,OPT,The Idlewells Precinct,,Sutton-In-Ashfield,,,NG17 1BP,Tel: 01623 552456, - ,,,3 ratings Rate it yourself - /Services/opticians/LeaveReview/DefaultView.aspx?id=OP_5FA_1545__000006_NG171BJ,,,
Scrivens Ltd,OP_5FA_10761__000003_NG171BJ,OPT,The Idlewells Precinct,,Sutton-In-Ashfield,,,NG17 1BP,Tel: 01623 513954, - ,,,No ratings yet Rate it yourself - /Services/opticians/LeaveReview/DefaultView.aspx?id=OP_5FA_10761__000003_NG171BJ,0,0,
Michael Vickers,MVDN228RX,OPT,,89 Town Street,,"Lound, Retford",,DN22 8RX,Tel: 01777 818291, - ,,,No ratings yet Rate it yourself - /Services/opticians/LeaveReview/DefaultView.aspx?id=MVDN228RX,0,0,
DI Blow Opticians,OP_5FA_4816__000003_NG177AS,OPT,40 Station Street,,Kirkby-In-Ashfield,,,NG17 7AS,Tel: 01623 752453, - ,,,No ratings yet Rate it yourself - /Services/opticians/LeaveReview/DefaultView.aspx?id=OP_5FA_4816__000003_NG177AS,0,0,
Woolcott Opticians,OP_5FA_9367__000001_NG177AQ,OPT,17 Station Street,,Kirkby-In-Ashfield,,,NG17 7AQ,Tel: 01623 752345, - ,,,No ratings yet Rate it yourself - /Services/opticians/LeaveReview/DefaultView.aspx?id=OP_5FA_9367__000001_NG177AQ,0,0,
I.Con Optical Eyewear Ltd,OP_5FA_0038__000001_NG171AQ,OPT,The Market Place,,Sutton-In-Ashfield,Nottinghamshire,,NG17 1AQ,Tel: 01623 559655, - ,,,No ratings yet Rate it yourself - /Services/opticians/LeaveReview/DefaultView.aspx?id=OP_5FA_0038__000001_NG171AQ,0,0,
Wycherley Opticians,OP_5FA_6683__000002_NG171AL,OPT,Brook Street,,Sutton-In-Ashfield,,,NG17 1AL,Tel: 01623 554377, - ,,,No ratings yet Rate it yourself - /Services/opticians/LeaveReview/DefaultView.aspx?id=OP_5FA_6683__000002_NG171AL,0,0,
Warner and Medlam t/a Parker Opticians,OP_5EG_12882__000003_S446DT,OPT,48 Town End,Bolsover,Chesterfield,,,S44 6DT,Tel: 01246 823242, - ,,,No ratings yet Rate it yourself - /Services/opticians/LeaveReview/DefaultView.aspx?id=OP_5EG_12882__000003_S446DT,0,0,
Tesco Opticians,CO-0072/1/5N8__000001_NG157UQ,OPT,Ashgate Road,Hucknall,Nottingham,Nottingham,,NG15 7UQ,Tel: 0115 684 8917, - ,,,No ratings yet Rate it yourself - /Services/opticians/LeaveReview/DefaultView.aspx?id=CO-0072/1/5N8__000001_NG157UQ,0,0,
Portland Opticians,OP_5EG_10068__000001_S434JN,OPT,20 Mill Street,Clowne,Chesterfield,,,S43 4JN,Tel: 01246 810512, - ,,,No ratings yet Rate it yourself - /Services/opticians/LeaveReview/DefaultView.aspx?id=OP_5EG_10068__000001_S434JN,0,0,
Eyestyle Co,OP_5EC_14905__000001_NG57ED,OPT,155 Front Street,Arnold,Nottingham,,,NG5 7ED,Tel: 0115 9536526, - ,,,No ratings yet Rate it yourself - /Services/opticians/LeaveReview/DefaultView.aspx?id=OP_5EC_14905__000001_NG57ED,0,0,
Specsavers Opticians,OP_5EC_11181__000001_NG57EG,OPT,118 Front Street,Arnold,Nottingham,,,NG5 7EG,Tel: 0115 9670856, - ,,,No ratings yet Rate it yourself - /Services/opticians/LeaveReview/DefaultView.aspx?id=OP_5EC_11181__000001_NG57EG,0,0,
Specsavers Opticians,CO-0022/2/5N8__000003_NG157AX,OPT,56 High Street,Hucknall,,Nottingham,,NG15 7AX,, - ,,,No ratings yet Rate it yourself - /Services/opticians/LeaveReview/DefaultView.aspx?id=CO-0022/2/5N8__000003_NG157AX,0,0,
Thomas Bond & Partners,OP_5EV_11036__000002_NG157AX,OPT,66 High Street,,,Hucknall,,NG15 7AX,Tel: 0115 963 2427, - ,,,No ratings yet Rate it yourself - /Services/opticians/LeaveReview/DefaultView.aspx?id=OP_5EV_11036__000002_NG157AX,0,0,
DI Blow Opticians,OP_5EV_12834__000001_NG157HF,OPT,2 Central Walk,Hucknall,Nottingham,,,NG15 7HF,Tel: 0115 963 6732, - ,,,No ratings yet Rate it yourself - /Services/opticians/LeaveReview/DefaultView.aspx?id=OP_5EV_12834__000001_NG157HF,0,0,
Thomas Bond & Partners,OP_5EC_3208__000002_NG57DJ,OPT,77b High Street,,,Arnold,Nottinghamshire,NG5 7DJ,Tel: 0115 926 7455, - ,,,No ratings yet Rate it yourself - /Services/opticians/LeaveReview/DefaultView.aspx?id=OP_5EC_3208__000002_NG57DJ,0,0,
Adams Opticians,OP_5EC_8895__000001_NG57DE,OPT,19 High Street,Arnold,Nottingham,Nottingham,,NG5 7DE,Tel: 0115 9555520, - ,,,No ratings yet Rate it yourself - /Services/opticians/LeaveReview/DefaultView.aspx?id=OP_5EC_8895__000001_NG57DE,0,0,
Kopacz and Barlow,OP_5EA_14809__000001_NG54GB,OPT,30a Marlborough Road,Woodthorpe,Nottingham,,,NG5 4GB,Tel: 0115 926 1694, - ,,,No ratings yet Rate it yourself - /Services/opticians/LeaveReview/DefaultView.aspx?id=OP_5EA_14809__000001_NG54GB,0,0,
C E Lea,OP_5EC_14900__000002_NG35JU,OPT,33 Plains Road,Mapperley,Nottingham,,,NG3 5JU,Tel: 01159 606526, - ,,,No ratings yet Rate it yourself - /Services/opticians/LeaveReview/DefaultView.aspx?id=OP_5EC_14900__000002_NG35JU,0,0,
Mistry - K,MOB/01-11546/5N8__000003_NG59DD,OPT,Unit 3/4 Top Valley Way,Top Valley,Nottingham,Nottinghamshire,,NG5 9DD,, - ,,,No ratings yet Rate it yourself - /Services/opticians/LeaveReview/DefaultView.aspx?id=MOB/01-11546/5N8__000003_NG59DD,0,0,
Mistry's Opticians,OP_5EM_4594__000002_NG59DD,OPT,Unit 3-4 Top Valley Way,Top Valley,Nottingham,,,NG5 9DD,Tel: 0115 977 0195, - ,,,1 rating Rate it yourself - /Services/opticians/LeaveReview/DefaultView.aspx?id=OP_5EM_4594__000002_NG59DD,,,
Yeomans Opticians Ltd,OP_5D2_13821__000003_LN60QQ,OPT,,"Unit 23, Birchwood Shopping Centre",Jasmin Road,Lincoln,Lincolnshire,LN6 0QQ,Tel: 01522 694548, - ,,,No ratings yet Rate it yourself - /Services/opticians/LeaveReview/DefaultView.aspx?id=OP_5D2_13821__000003_LN60QQ,0,0,yes
Woolcott Opticians,34567__000004_NG52GE,OPT,672 Mansfield Road,,Nottingham,,,NG5 2GE,, - ,,,No ratings yet Rate it yourself - /Services/opticians/LeaveReview/DefaultView.aspx?id=34567__000004_NG52GE,0,0,
Trent Eye-Care Ltd,TP9DK,OPT,,680 Mansfield Road,,Nottingham,,NG5 2GE,Tel: 0115 8224822, - ,,,No ratings yet Rate it yourself - /Services/opticians/LeaveReview/DefaultView.aspx?id=TP9DK,0,0,
D I Blow Opticians Ltd,OP_5EM_11404__000001_NG68ET,OPT,90 Main Street,Bulwell,Nottingham,,,NG6 8ET,Tel: 0115 9275790, - ,,,No ratings yet Rate it yourself - /Services/opticians/LeaveReview/DefaultView.aspx?id=OP_5EM_11404__000001_NG68ET,0,0,
Allen A C,MOB/0013/5N8__000002_NG52GA,OPT,660 Mansfield Road,Sherwood,Nottingham,Nottinghamshire,,NG5 2GA,Tel: 01159 603594, - ,,,No ratings yet Rate it yourself - /Services/opticians/LeaveReview/DefaultView.aspx?id=MOB/0013/5N8__000002_NG52GA,0,0,
A C Allen,OP_5EM_5859__000001_NG52GA,OPT,660 Mansfield Road,Sherwood,Nottingham,,,NG5 2GA,Tel: 0115 960 3594, - ,,,No ratings yet Rate it yourself - /Services/opticians/LeaveReview/DefaultView.aspx?id=OP_5EM_5859__000001_NG52GA,0,0,
Bowler & Charsley,OP_5EM_1421__000001_NG68EW,OPT,82 Main Street,Bulwell,,Nottingham,,NG6 8EW,Tel: 0115 9271685, - ,,,No ratings yet Rate it yourself - /Services/opticians/LeaveReview/DefaultView.aspx?id=OP_5EM_1421__000001_NG68EW,0,0,
Thomas Bond & Partners,OP_5EC_2342__000002_NG42LA,OPT,37 Victoria Road,,,Netherfield,Nottinghamshire,NG4 2LA,Tel: 0115 961 6193, - ,,,No ratings yet Rate it yourself - /Services/opticians/LeaveReview/DefaultView.aspx?id=OP_5EC_2342__000002_NG42LA,0,0,
I.Wear Opticians,CO-0063/5N8__000001_BULWELL,OPT,73 Main Street,Bulwell,,Nottingham,,NG6 8QD,, - ,,,No ratings yet Rate it yourself - /Services/opticians/LeaveReview/DefaultView.aspx?id=CO-0063/5N8__000001_BULWELL,0,0,
I Wear Opticians,OP_5EM_14884__000001_NG68QD,OPT,73 Main Street,Bulwell,Nottingham,,,NG6 8QD,Tel: 0115 9757533, - ,,,No ratings yet Rate it yourself - /Services/opticians/LeaveReview/DefaultView.aspx?id=OP_5EM_14884__000001_NG68QD,0,0,
Thomas Bond & Partners,OP_5FC_3209__000003_NG138BD,OPT,17 Eaton Place,,,Bingham,Nottinghamshire,NG13 8BD,Tel: 01949 838242, - ,,,No ratings yet Rate it yourself - /Services/opticians/LeaveReview/DefaultView.aspx?id=OP_5FC_3209__000003_NG138BD,0,0,
Asda Opticians,190920161532,OPT,,Newark Road,,Lincoln,,LN6 8JY,Tel: 01522 581148, - ,,,No ratings yet Rate it yourself - /Services/opticians/LeaveReview/DefaultView.aspx?id=190920161532,0,0,
Twynings Opticians,CO-0076/2/5N8__000002_NG138AD,OPT,17 Union Street,,Bingham,Nottinghamshire,,NG13 8AD,, - ,,,No ratings yet Rate it yourself - /Services/opticians/LeaveReview/DefaultView.aspx?id=CO-0076/2/5N8__000002_NG138AD,0,0,
Carlton Opticians,OP_5AP_14063__000001_NG241JR,OPT,318 Carlton Hill,Carlton,Nottingham,,,NG4 1GD,Tel: 0115 9873125, - ,,,No ratings yet Rate it yourself - /Services/opticians/LeaveReview/DefaultView.aspx?id=OP_5AP_14063__000001_NG241JR,0,0,
J A Higson Opticians,56789__000004_NG41GD,OPT,318 Carlton Hill,Carlton,Nottingham,,,NG4 1GD,, - ,,,No ratings yet Rate it yourself - /Services/opticians/LeaveReview/DefaultView.aspx?id=56789__000004_NG41GD,0,0,
Eye 2 Eye Opticians,C-0084/5N8__000001_NG41JD,OPT,346 Carlton Hill,Carlton,Nottingham,Nottinghamshire,,NG4 1JD,Tel: 01159 877378, - ,,,No ratings yet Rate it yourself - /Services/opticians/LeaveReview/DefaultView.aspx?id=C-0084/5N8__000001_NG41JD,0,0,
Thomas & Holloway Ltd,OP_5H8_9174__000001_S254DB,OPT,24 Quarry Lane,North Anston,Sheffield,,,S25 4DB,Tel: 01909 562492, - ,,,No ratings yet Rate it yourself - /Services/opticians/LeaveReview/DefaultView.aspx?id=OP_5H8_9174__000001_S254DB,0,0,
Specsavers Colwick,,OPT,,Sainsbury's Road No 3,,Nottingham,,NG4 2JN,Tel: 0115 6975899, - ,,,N/A - Data not available,,,
Blow DI,OP_5EA_14784__000003_DE552BN,OPT,20 Market Place,South Normanton,Derbyshire,,,DE55 2BN,Tel: 01773 862343, - ,,,No ratings yet Rate it yourself - /Services/opticians/LeaveReview/DefaultView.aspx?id=OP_5EA_14784__000003_DE552BN,0,0,
Jenny Hudson Opticians,OP_5H8_8619__000001_S252PN,OPT,25 Laughton Road,Dinnington,Sheffield,,,S25 2PN,Tel: 01909 563111, - ,,,No ratings yet Rate it yourself - /Services/opticians/LeaveReview/DefaultView.aspx?id=OP_5H8_8619__000001_S252PN,0,0,
Portland Optical Group,OP_5H8_4852__000002_S252PN,OPT,59 Laughton Road,Dinnington,Sheffield,,,S25 2PN,Tel: 01909 562948, - ,,,No ratings yet Rate it yourself - /Services/opticians/LeaveReview/DefaultView.aspx?id=OP_5H8_4852__000002_S252PN,0,0,
Bowler & Charsley,OP_5FC_1226__000001_NG122AG,OPT,22 Shelford Road,Radcliffe-on-Trent,,Nottingham,,NG12 2AG,Tel: 0115 933 3930, - ,,,No ratings yet Rate it yourself - /Services/opticians/LeaveReview/DefaultView.aspx?id=OP_5FC_1226__000001_NG122AG,0,0,
Lesley Cree Opticians Limited,NG12 2FD,OPT,,9b Main Road,,Radcliffe on Trent,Nottinghamshire,NG12 2FD,Tel: 0115 9332999, - ,,,10 ratings Rate it yourself - /Services/opticians/LeaveReview/DefaultView.aspx?id=NG12 2FD,,,yes
C & D Barlow,OP_5EC_14901__000002_NG54GB,OPT,Foxhall Business Centre,Foxhall Road,Nottingham,,,NG7 6LH,Tel: 0800 6525505, - ,,,No ratings yet Rate it yourself - /Services/opticians/LeaveReview/DefaultView.aspx?id=OP_5EC_14901__000002_NG54GB,0,0,
Woolcott Opticians,OP_5ET_9365__000002_DN118JN,OPT,85 Scrooby Road,Bircotes,Doncaster,,,DN11 8JN,Tel: 01302 744300, - ,,,No ratings yet Rate it yourself - /Services/opticians/LeaveReview/DefaultView.aspx?id=OP_5ET_9365__000002_DN118JN,0,0,
SPX Opticians Ltd,01120__000001_NG85BU,OPT,373 Nuthall Road,Aspley,Nottingham,Nottinghamshire,,NG8 5BU,Tel: 0115 9244244, - ,,,2 ratings Rate it yourself - /Services/opticians/LeaveReview/DefaultView.aspx?id=01120__000001_NG85BU,,,
Forbes PL,OP_5EA_14792__000002_S433UU,OPT,T/A Jean Holmes Opticians,33 High Street,Staveley,,,S43 3UU,Tel: 01246 477199, - ,,,No ratings yet Rate it yourself - /Services/opticians/LeaveReview/DefaultView.aspx?id=OP_5EA_14792__000002_S433UU,0,0,
"Alan D Box, Opticians",OP_5EM_12436__000001_NG75GT,OPT,201 Radford Road,Hyson Green,Nottingham,,,NG7 5GT,Tel: 0115 978 5557, - ,,,No ratings yet Rate it yourself - /Services/opticians/LeaveReview/DefaultView.aspx?id=OP_5EM_12436__000001_NG75GT,0,0,
Asda Opticians,OPT_NG7 5FP,OPT,,RADFORD ROAD,HYSON GREEN,NOTTINGHAM,,NG7 5FP,Tel: 01159 002520, - ,,,No ratings yet Rate it yourself - /Services/opticians/LeaveReview/DefaultView.aspx?id=OPT_NG7 5FP,0,0,
Dale Opticians,OP_5EM_14882__000001_NG24LW,OPT,133 Sneinton Dale,Sneinton,Nottingham,,,NG2 4LW,Tel: 0115 9580023, - ,,,No ratings yet Rate it yourself - /Services/opticians/LeaveReview/DefaultView.aspx?id=OP_5EM_14882__000001_NG24LW,0,0,
Dale Opticians,MOB/0091/5N8__000003_NG24LW,OPT,133 Sneiton Dale,,Nottingham,Nottinghamshire,,NG2 4LW,, - ,,,No ratings yet Rate it yourself - /Services/opticians/LeaveReview/DefaultView.aspx?id=MOB/0091/5N8__000003_NG24LW,0,0,
Mr A Khan T/A D I Blow Opticians Ltd,OP_5EM_5933__000001_NG75EH,OPT,143-145 Radford Road,Hyson Green,Nottingham,,,NG7 5EH,Tel: 0115 9786551, - ,,,3 ratings Rate it yourself - /Services/opticians/LeaveReview/DefaultView.aspx?id=OP_5EM_5933__000001_NG75EH,,,
DI Blow Opticians,MOB/2677/2/5N8__000002_NG75EH,OPT,143 Radford Road,,Nottingham,Nottinghamshire,,NG7 5EH,, - ,,,No ratings yet Rate it yourself - /Services/opticians/LeaveReview/DefaultView.aspx?id=MOB/2677/2/5N8__000002_NG75EH,0,0,
Medina Express Opticians,OP_5EM_22780__000001_NG75FU,OPT,92 Radford Road,Hyson Green,Nottingham,Nottinghamshire,,NG7 5FU,Tel: 0115 9788786, - ,,,No ratings yet Rate it yourself - /Services/opticians/LeaveReview/DefaultView.aspx?id=OP_5EM_22780__000001_NG75FU,0,0,
Walters Opticians,OP_5D2_692__000002_DN212BY,OPT,34 Market Place,,Gainsborough,,,DN21 2BY,Tel: 01427 616505, - ,,,No ratings yet Rate it yourself - /Services/opticians/LeaveReview/DefaultView.aspx?id=OP_5D2_692__000002_DN212BY,0,0,no
Boots-Nottingham - Victoria Centre,OP_5EM_2831__000001_NG13QG,OPT,165 Victoria Centre,Nottingham,,Nottinghamshire,,NG1 3QG,Tel: 0115 947 4807, - ,,,1 rating Rate it yourself - /Services/opticians/LeaveReview/DefaultView.aspx?id=OP_5EM_2831__000001_NG13QG,,,
J Yeomans & Partners,OP_5EM_8797__000001_NG24PB,OPT,19 Manvers Street,,Nottingham,,,NG2 4PB,Tel: 0115 9505477, - ,,,No ratings yet Rate it yourself - /Services/opticians/LeaveReview/DefaultView.aspx?id=OP_5EM_8797__000001_NG24PB,0,0,
Gainsborough VisionPlus Ltd,OPT082__000001_DN212NA,OPT,"Unit 22, Marshalls Yard",Beaumont Street,Gainsborough,Lincolnshire,,DN21 2NA,Tel: 01472 619870, - ,,,No ratings yet Rate it yourself - /Services/opticians/LeaveReview/DefaultView.aspx?id=OPT082__000001_DN212NA,0,0,