Organisation Name,NACS Code,Organisation Type,Address1,Address2,Address3,Address4,Address5,PostCode,Telephone Number,Opening time,Value  (Opening time),Banding Classification  (Opening time),NHS.UK users rating,Value  (NHS.UK users rating),Banding Classification  (NHS.UK users rating),Car parking (Is there car parking at this organisation?)
Robert Ellin Opticians,OP_5MT_4223__000002_WR98QS,OPT,41 Ombersley Street East,,Droitwich,,,WR9 8QS,Tel: 01905 773054, - ,,,No ratings yet Rate it yourself - /Services/opticians/LeaveReview/DefaultView.aspx?id=OP_5MT_4223__000002_WR98QS,0,0,
Specsavers Opticians,00000067__000005_WR98HE,OPT,10 St.andrews Square,,Droitwich,Worcestershire,,WR9 8HE,Tel: 01905 790660, - ,,,No ratings yet Rate it yourself - /Services/opticians/LeaveReview/DefaultView.aspx?id=00000067__000005_WR98HE,0,0,
Boots-Droitwich,OP_5MT_11993__000003_WR98HE,OPT,52 St Andrews Square,,,Droitwich,Worcestershire,WR9 8HE,Tel: 01905 774 661, - ,,,No ratings yet Rate it yourself - /Services/opticians/LeaveReview/DefaultView.aspx?id=OP_5MT_11993__000003_WR98HE,0,0,
The Factory Opticians,000000061__000004_WR98HE,OPT,St.andrews Square,,Droitwich,Worcestershire,,WR9 8HE,Tel: 01905 795541, - ,,,No ratings yet Rate it yourself - /Services/opticians/LeaveReview/DefaultView.aspx?id=000000061__000004_WR98HE,0,0,
Waller & Waller,OP_5MT_11085__000001_WR98DY,OPT,18 St. andrews Street,Droitwich,Worcestershire,,,WR9 8DY,Tel: 01905 772729, - ,,,No ratings yet Rate it yourself - /Services/opticians/LeaveReview/DefaultView.aspx?id=OP_5MT_11085__000001_WR98DY,0,0,
Nic Sproson - The Optician,OP_5MT_8842__000001_WR11JA,OPT,52 Barbourne Road,,,Worcester,Worcestershire,WR1 1JA,Tel: 01905 27327, - ,,,No ratings yet Rate it yourself - /Services/opticians/LeaveReview/DefaultView.aspx?id=OP_5MT_8842__000001_WR11JA,0,0,
Spectacle Wearhouse,OP_5DR_2669__000001_DY139EH,OPT,29 York Street,,Stourport-on-Severn,,,DY13 9EH,Tel: 01299 826688, - ,,,No ratings yet Rate it yourself - /Services/opticians/LeaveReview/DefaultView.aspx?id=OP_5DR_2669__000001_DY139EH,0,0,
Specsavers Opticians,5PL 00000__000001_DY139JW,OPT,45 The High Street,,Stourport On Severn,Worcestershire,,DY13 8BX,Tel: 01299 877999, - ,,,1 rating Rate it yourself - /Services/opticians/LeaveReview/DefaultView.aspx?id=5PL 00000__000001_DY139JW,,,
Specsavers Opticians,OP_5DR_12005__000001_DY138BL,OPT,45 High Street,Stourport-on-Severn,Worcestershire,,,DY13 8BX,Tel: 01299 877999, - ,,,No ratings yet Rate it yourself - /Services/opticians/LeaveReview/DefaultView.aspx?id=OP_5DR_12005__000001_DY138BL,0,0,
Seymour & Easlea Ltd.,(5DR)__000001_DY138DJ,OPT,2a High Street,,Stourport On Severn,Worcestershire,,DY13 8DJ,Tel: 01299 877171, - ,,,No ratings yet Rate it yourself - /Services/opticians/LeaveReview/DefaultView.aspx?id=(5DR)__000001_DY138DJ,0,0,
Vision Express (UK) Ltd,OP_5MT_12893__000001_WR13LE,OPT,1-2 Friary Walk,,Worcester,,,WR1 3LE,Tel: 01905 616699, - ,,,No ratings yet Rate it yourself - /Services/opticians/LeaveReview/DefaultView.aspx?id=OP_5MT_12893__000001_WR13LE,0,0,
Opticial Express,OP_12345_WR1 3LH,OPT,,6/9 Broad Street,,Worcester,,WR1 3LH,, - ,,,No ratings yet Rate it yourself - /Services/opticians/LeaveReview/DefaultView.aspx?id=OP_12345_WR1 3LH,0,0,
Specs Express,OP_5MT_8820__000001_WR12PS,OPT,10 St. Swithins Street,,Worcester,,,WR1 2PS,Tel: 01905 613037, - ,,,No ratings yet Rate it yourself - /Services/opticians/LeaveReview/DefaultView.aspx?id=OP_5MT_8820__000001_WR12PS,0,0,
Mr DK Stephens t/a Brauchli Opticians,0000000__000001_WR49RW,OPT,7 St Swithens Street,,Worcester,Worcestershire,,WR1 2PY,Tel: 01905 26193, - ,,,1 rating Rate it yourself - /Services/opticians/LeaveReview/DefaultView.aspx?id=0000000__000001_WR49RW,,,
Actons Opticians,OP_5MT_8086__000002_WR12DR,OPT,10 Cornmarket,,Worcester,,,WR1 2DR,Tel: 01905 22156, - ,,,No ratings yet Rate it yourself - /Services/opticians/LeaveReview/DefaultView.aspx?id=OP_5MT_8086__000002_WR12DR,0,0,
Dominic Tunnell Opticians ,OP_5MT_3702__000001_WR12DH,OPT,6 Mealcheapen Street,6 Mealcheapen Street,Worcester,Worcester,,WR1 2DH,Tel: 01905 613020, - ,,,No ratings yet Rate it yourself - /Services/opticians/LeaveReview/DefaultView.aspx?id=OP_5MT_3702__000001_WR12DH,0,0,
Boots-Worcester - High St (in Boots UK),OP_5MT_7617__000001_WR13LD,OPT,72-74 High Street,,,Worcester,Worcestershire,WR1 2EU,Tel: 01905 25613, - ,,,1 rating Rate it yourself - /Services/opticians/LeaveReview/DefaultView.aspx?id=OP_5MT_7617__000001_WR13LD,,,
Specsavers Opticians,OP_5MT_2071__000001_WR13LY,OPT,Specsavers,9-13 Pump Street,,Worcester,Worcestershire,WR1 2QX,Tel: 01905 729 779, - ,,,No ratings yet Rate it yourself - /Services/opticians/LeaveReview/DefaultView.aspx?id=OP_5MT_2071__000001_WR13LY,0,0,
Stephen John Opticians,OP_5MT_7555__000001_WR12AQ,OPT,2 Charles Street,,,Worcester,Warwickshire,WR1 2AQ,Tel: 01905 745454, - ,,,No ratings yet Rate it yourself - /Services/opticians/LeaveReview/DefaultView.aspx?id=OP_5MT_7555__000001_WR12AQ,0,0,
Geoffrey Roberts,OP_5MT_14399__000001_WR25AJ,OPT,38 St Johns,,Worcester,Worcestershire,,WR2 5AJ,Tel: 01905 423217, - ,,,No ratings yet Rate it yourself - /Services/opticians/LeaveReview/DefaultView.aspx?id=OP_5MT_14399__000001_WR25AJ,0,0,
The Factory Opticians,00000064__000001_DY101HJ,OPT,Dixon Street,,Kidderminster,Worcestershire,,DY10 1HJ,Tel: 01562 747087, - ,,,No ratings yet Rate it yourself - /Services/opticians/LeaveReview/DefaultView.aspx?id=00000064__000001_DY101HJ,0,0,
Eyecare Kidderminster Ltd,M2B9S,OPT,,"Unit 1 in Morrisons Supermarket, Green Street",,Kidderminster,,DY10 1AZ,, - ,,,No ratings yet Rate it yourself - /Services/opticians/LeaveReview/DefaultView.aspx?id=M2B9S,0,0,
P Crawford,OP_5DR_3243__000001_DY101BB,OPT,8 Oxford Street,,Kidderminster,,,DY10 1BB,Tel: 01562 822577, - ,,,No ratings yet Rate it yourself - /Services/opticians/LeaveReview/DefaultView.aspx?id=OP_5DR_3243__000001_DY101BB,0,0,
Boots-Kidderminster,DY10 1AA_19172,OPT,,"Unit 15, Weavers Wharf Retail Park",,Kidderminster,Worcestershire,DY10 1AA,Tel: 01562 824474, - ,,,1 rating Rate it yourself - /Services/opticians/LeaveReview/DefaultView.aspx?id=DY10 1AA_19172,,,
Chapman & Myers Opticians,OP_5DR_11705__000001_DY101EJ,OPT,,5 Vicar Street,Kidderminster,Worcestershire,,DY10 1DE,Tel: 01562 822276, - ,,,2 ratings Rate it yourself - /Services/opticians/LeaveReview/DefaultView.aspx?id=OP_5DR_11705__000001_DY101EJ,,,
MC Perrigo,00000065__000002_DY122AW,OPT,71 Load Street,,Bewdley,Worcestershire,,DY12 2AW,Tel: 01299 403722, - ,,,No ratings yet Rate it yourself - /Services/opticians/LeaveReview/DefaultView.aspx?id=00000065__000002_DY122AW,0,0,
Vision Express Ltd,000000063__000001_DY102DQ,OPT,6 High Street,,Kidderminster,Worcestershire,,DY10 2DQ,Tel: 01562 824846, - ,,,No ratings yet Rate it yourself - /Services/opticians/LeaveReview/DefaultView.aspx?id=000000063__000001_DY102DQ,0,0,
Specsavers Opticians,OP_5DR_9273__000002_DY102DG,OPT,2 Coventry Street,Swan Centre,Kidderminster,,,DY10 2DG,Tel: 01562 823 552, - ,,,No ratings yet Rate it yourself - /Services/opticians/LeaveReview/DefaultView.aspx?id=OP_5DR_9273__000002_DY102DG,0,0,
Blink Vision,TP80T,OPT,,201-203 Park Lane,,Kidderminster,,DY11 6TQ,Tel: 0000000000, - ,,,No ratings yet Rate it yourself - /Services/opticians/LeaveReview/DefaultView.aspx?id=TP80T,0,0,
Clive G Stephens,OP_5DR_4342__000001_DY102AD,OPT,2 Church Street,,Kidderminster,,,DY10 2AD,Tel: 01562 822803, - ,,,No ratings yet Rate it yourself - /Services/opticians/LeaveReview/DefaultView.aspx?id=OP_5DR_4342__000001_DY102AD,0,0,
Hamptons Optical Ltd.,00000052__000001_B618DJ,OPT,Crown House,11 Crown Close,Bromsgrove,Worcestershire,,B61 8DJ,, - ,,,No ratings yet Rate it yourself - /Services/opticians/LeaveReview/DefaultView.aspx?id=00000052__000001_B618DJ,0,0,
Boots-Bromsgrove,OP_5MR_276__000002_B618EX,OPT,64 High Street,Bromsgrove,,Worcestershire,Worcestershire,B61 8EX,Tel: 01527 872 583, - ,,,No ratings yet Rate it yourself - /Services/opticians/LeaveReview/DefaultView.aspx?id=OP_5MR_276__000002_B618EX,0,0,
Specsavers Opticians,OP_5MR_12187__000001_B618DD,OPT,131 High Street,Bromsgrove,Worcestershire,,,B61 8AE,Tel: 01527 579 815, - ,,,2 ratings Rate it yourself - /Services/opticians/LeaveReview/DefaultView.aspx?id=OP_5MR_12187__000001_B618DD,,,
Chapman Opticians,OP_5MR_8077__000002_B618AQ,OPT,103 High Street,,Bromsgrove,,,B61 8AE,Tel: 01527 836290, - ,,,1 rating Rate it yourself - /Services/opticians/LeaveReview/DefaultView.aspx?id=OP_5MR_8077__000002_B618AQ,,,
Eyecare Opticians Parkside,B61 0AZ,OPT,BHI Parkside Medical Centre,Stourbridge Road,,Bromsgrove,,B61 0AZ,Tel: 01527 888599, - ,,,No ratings yet Rate it yourself - /Services/opticians/LeaveReview/DefaultView.aspx?id=B61 0AZ,0,0,
Edmund Proctor & Associates,00000066__000002_DY102BX,OPT,Coppice Gate,Tanners Hill,Bewdley,Worcestershire,,DY12 2LP,Tel: 07701 281081, - ,,,1 rating Rate it yourself - /Services/opticians/LeaveReview/DefaultView.aspx?id=00000066__000002_DY102BX,,,
Specsavers Malvern Retail Park,TP8L2,OPT,,"Unit 13, Roman Way",,Malvern,Worcestershire,WR14 1PZ,Tel: 01684 567465, - ,,,No ratings yet Rate it yourself - /Services/opticians/LeaveReview/DefaultView.aspx?id=TP8L2,0,0,
S.J Tromans,OP_5MT_4788__000001_WR141AA,OPT,255 Worcester Road,,Malvern,,,WR14 1AA,Tel: 01684 565145, - ,,,No ratings yet Rate it yourself - /Services/opticians/LeaveReview/DefaultView.aspx?id=OP_5MT_4788__000001_WR141AA,0,0,
Robinson & Sproson,OP_5DR_12006__000001_DY90NW,OPT,143 - 145 Worcester Road,Hagley,West Midlands,Hagley,,DY9 0NW,Tel: 01562 882444, - ,,,No ratings yet Rate it yourself - /Services/opticians/LeaveReview/DefaultView.aspx?id=OP_5DR_12006__000001_DY90NW,0,0,
Hagley Eyecare Studio,201220160917,OPT,,Unit 42 The Old Woodyard,,Hagley,,DY9 9LQ,, - ,,,2 ratings Rate it yourself - /Services/opticians/LeaveReview/DefaultView.aspx?id=201220160917,,,
G L & K R Holland,OP_5MT_6448__000001_WR142HL,OPT,16 Graham Road,,,Malvern,Worcestershire,WR14 2HL,Tel: 01684 573942, - ,,,No ratings yet Rate it yourself - /Services/opticians/LeaveReview/DefaultView.aspx?id=OP_5MT_6448__000001_WR142HL,0,0,
Barnards Green Opticians,OP_5MT_4306__000002_WR143LT,OPT,113 Barnards Green Road,,Malvern,,,WR14 3LT,Tel: 01684 892586, - ,,,5 ratings Rate it yourself - /Services/opticians/LeaveReview/DefaultView.aspx?id=OP_5MT_4306__000002_WR143LT,,,
J & D Miller,0000005__000001_WR142AZ,OPT,38 Church Street,,Malvern,Worcesteer,,WR14 2AZ,Tel: 01684 564766, - ,,,No ratings yet Rate it yourself - /Services/opticians/LeaveReview/DefaultView.aspx?id=0000005__000001_WR142AZ,0,0,
Waller & Waller,OP_5MT_1952__000001_WR144QH,OPT,Lambert House,Edith Walk,Malvern,,,WR14 4QH,Tel: 01684 892727, - ,,,No ratings yet Rate it yourself - /Services/opticians/LeaveReview/DefaultView.aspx?id=OP_5MT_1952__000001_WR144QH,0,0,
Value Vision Opticians,OP_5MT_9208__000001_WR142XH,OPT,3 Church Walk,,Malvern,,,WR14 2XH,Tel: 01684 563779, - ,,,No ratings yet Rate it yourself - /Services/opticians/LeaveReview/DefaultView.aspx?id=OP_5MT_9208__000001_WR142XH,0,0,
Barnt Green Opticians,OP_5MR_7851__000001_B458NF,OPT,12 Hewell Road,Barnt Green,,Birmingham,,B45 8NE,Tel: 0121 445 6015, - ,,,No ratings yet Rate it yourself - /Services/opticians/LeaveReview/DefaultView.aspx?id=OP_5MR_7851__000001_B458NF,0,0,
Troth Opticians,00000051__000003_B459JR,OPT,135 New Road,Rubery,Birmingham,,,B45 9JR,Tel: 0121 453 2146, - ,,,No ratings yet Rate it yourself - /Services/opticians/LeaveReview/DefaultView.aspx?id=00000051__000003_B459JR,0,0,
Williams Optometrists,OP_5MR_9056__000002_B459JW,OPT,161 New Road,Rubery,Birmingham,,,B45 9JW,Tel: 0121 453 2581, - ,,,No ratings yet Rate it yourself - /Services/opticians/LeaveReview/DefaultView.aspx?id=OP_5MR_9056__000002_B459JW,0,0,
Kinver Opticians,OP_5MN_1681__000001_DY76HE,OPT,51a High Street,Kinver,,Stourbridge,,DY7 6HE,Tel: 01384 872035, - ,,,No ratings yet Rate it yourself - /Services/opticians/LeaveReview/DefaultView.aspx?id=OP_5MN_1681__000001_DY76HE,0,0,
Spex4U Limited,OL5PL01__000005_B459JA,OPT,174 New Road,Rubery,,Birmingham,Worcestershire,B45 9JA,Tel: 0121 453 7179, - ,,,1 rating Rate it yourself - /Services/opticians/LeaveReview/DefaultView.aspx?id=OL5PL01__000005_B459JA,,,
Peter Bainbridge Opticians,OP_5MR_341__000003_B974EY,OPT,18 Kingfisher Walk,Redditch,Worcestershire,,,B97 4EY,Tel: 01527 64691, - ,,,2 ratings Rate it yourself - /Services/opticians/LeaveReview/DefaultView.aspx?id=OP_5MR_341__000003_B974EY,,,
Boots-Redditch,OP_5MR_9389__000002_B974EY,OPT,7 Kingfisher Walk,,,Redditch,Worcestershire,B97 4EY,Tel: 01527 63068, - ,,,No ratings yet Rate it yourself - /Services/opticians/LeaveReview/DefaultView.aspx?id=OP_5MR_9389__000002_B974EY,0,0,yes
Vision Express (UK) Ltd,OP_5MR_9135__000001_B974HA,OPT,7 New Walk,Kingfisher Centre,Redditch,Worcestershire,,B97 4HA,Tel: 01527 69633, - ,,,No ratings yet Rate it yourself - /Services/opticians/LeaveReview/DefaultView.aspx?id=OP_5MR_9135__000001_B974HA,0,0,
Specsavers Opticians,OP_5MR_655__000001_B974YP,OPT,13 New Walk,Kingfisher Centre,Redditch,Worcestershire,,B97 4YP,Tel: 01527 595558, - ,,,No ratings yet Rate it yourself - /Services/opticians/LeaveReview/DefaultView.aspx?id=OP_5MR_655__000001_B974YP,0,0,
Specsavers - Redditch Alvechurch,M2Y9H,OPT,,"Sainsburys, Abbey Trading Centre,Alvechurch Highway",,Redditch,,B97 6RF,Tel: 01527 913585, - ,,,No ratings yet Rate it yourself - /Services/opticians/LeaveReview/DefaultView.aspx?id=M2Y9H,0,0,
Asda Opticians,OPT_B98 7ER,OPT,,JINNAH ROAD,SMALLWOOD,REDDITCH,,B98 7ER,Tel: 01527 509344, - ,,,No ratings yet Rate it yourself - /Services/opticians/LeaveReview/DefaultView.aspx?id=OPT_B98 7ER,0,0,
J & D Mason Opticians ,OP_5PL_9067__000003_B487LA,OPT,23 The Square,"23 The Square,",Birmingham,Alvechurch,,B48 7LA,Tel: 0121 447 8682, - ,,,1 rating Rate it yourself - /Services/opticians/LeaveReview/DefaultView.aspx?id=OP_5PL_9067__000003_B487LA,,,
Julian Hill Opticians,OP_5HT_4772__000002_DY81QU,OPT,108 Hagley Road,Oldswinford,Stourbridge,,,DY8 1QU,Tel: 01384 374 232, - ,,,1 rating Rate it yourself - /Services/opticians/LeaveReview/DefaultView.aspx?id=OP_5HT_4772__000002_DY81QU,,,
Peter J Smith,00000061__000002_WR101BG,OPT,14 High Street,,,Pershore,Worcestershire,WR10 1BG,Tel: 01386 553922, - ,,,No ratings yet Rate it yourself - /Services/opticians/LeaveReview/DefaultView.aspx?id=00000061__000002_WR101BG,0,0,
Pershore Eyecare Centre,CO - 5410,OPT,,16 Bridge Street,,Pershore,Worcestershire,WR10 1AT,Tel: 01386 555675, - ,,,No ratings yet Rate it yourself - /Services/opticians/LeaveReview/DefaultView.aspx?id=CO - 5410,0,0,
Cleobury Opticians,CO-5117,OPT,,16 Church Street,,Kidderminster,,DY14 8BX,, - ,,,No ratings yet Rate it yourself - /Services/opticians/LeaveReview/DefaultView.aspx?id=CO-5117,0,0,
Scrivens Opticians & Hearing Care,OP_5CN_5439__000001_HR74EB,OPT,,10 Broad Street,,Bromyard,Herefordshire,HR7 4BT,Tel: 01885 482492, - ,,,No ratings yet Rate it yourself - /Services/opticians/LeaveReview/DefaultView.aspx?id=OP_5CN_5439__000001_HR74EB,0,0,
Docker & Wilson Ltd,OP_5HT_3049__000001_DY81ED,OPT,84 High Street,,Stourbridge,,,DY8 1ED,Tel: 01384 394300, - ,,,No ratings yet Rate it yourself - /Services/opticians/LeaveReview/DefaultView.aspx?id=OP_5HT_3049__000001_DY81ED,0,0,
Specsavers Opticians,OP_5HT_7393__000001_DY81DX,OPT,71 High Street,,Stourbridge,,,DY8 1DX,Tel: 01384 440464, - ,,,No ratings yet Rate it yourself - /Services/opticians/LeaveReview/DefaultView.aspx?id=OP_5HT_7393__000001_DY81DX,0,0,
Boots-Stourbridge,OP_5HT_6791__000001_DY81DT,OPT,119 High Street,,,Stourbridge,West Midlands,DY8 1DT,Tel: 01384 440 594, - ,,,No ratings yet Rate it yourself - /Services/opticians/LeaveReview/DefaultView.aspx?id=OP_5HT_6791__000001_DY81DT,0,0,
Eyewise Opticians,OP_5HT_4692__000001_DY81YD,OPT,,7 Market Street,Stourbridge,West Midlands,,DY8 1AB,Tel: 01384 395333, - ,,,12 ratings Rate it yourself - /Services/opticians/LeaveReview/DefaultView.aspx?id=OP_5HT_4692__000001_DY81YD,,,
P W Optics Ltd,TP8NN,OPT,,Unit 2 Market Street,,Stourbridge,West Midlands,DY8 1YD,Tel: 01384 936020, - ,,,No ratings yet Rate it yourself - /Services/opticians/LeaveReview/DefaultView.aspx?id=TP8NN,0,0,yes
Special Look's Opticians,00299__000002_DY98LP,OPT,84a Pedmore Road,Lye,Stourbridge,West Midlands,,DY9 8LP,Tel: 01384 340 101, - ,,,No ratings yet Rate it yourself - /Services/opticians/LeaveReview/DefaultView.aspx?id=00299__000002_DY98LP,0,0,
J & S Bangay,OP_5HT_3598__000001_DY83QG,OPT,60 Bridgnorth Road,Wollaston,,Stourbridge,West Midlands,DY8 3QG,Tel: 01384 396585, - ,,,1 rating Rate it yourself - /Services/opticians/LeaveReview/DefaultView.aspx?id=OP_5HT_3598__000001_DY83QG,,,yes
Robert Hill Opticians,OP_5HT_8972__000001_DY98LB,OPT,39 High Street,Lye,,Stourbridge,West Midlands,DY9 8LF,Tel: 01384 422270, - ,,,3 ratings Rate it yourself - /Services/opticians/LeaveReview/DefaultView.aspx?id=OP_5HT_8972__000001_DY98LB,,,
Sanjeev Singh Sanghera,5MX083,OPT,,39 High Street,Lye,Stourbridge,,DY9 8LF,Tel: 01384 422270, - ,,,No ratings yet Rate it yourself - /Services/opticians/LeaveReview/DefaultView.aspx?id=5MX083,0,0,
Lees & Thomas Optometrist,OP_5MQ_9995__000001_B807NJ,OPT,57 Alcester Road,,Studley,,,B80 7NJ,Tel: 01527 853932, - ,,,No ratings yet Rate it yourself - /Services/opticians/LeaveReview/DefaultView.aspx?id=OP_5MQ_9995__000001_B807NJ,0,0,
Pabari Opticians Ltd,OP_5M1_4727__000002_B313JW,OPT,3 Alvechurch Road,West Heath,Birmingham,,,B31 3JW,Tel: 0121 477 5252, - ,,,No ratings yet Rate it yourself - /Services/opticians/LeaveReview/DefaultView.aspx?id=OP_5M1_4727__000002_B313JW,0,0,
Home Eyecare,5MX063,OPT,,"Unit 8, 17 Winyates Centre",,Redditch,,B98 0NR,Tel: 01527 529010, - ,,,No ratings yet Rate it yourself - /Services/opticians/LeaveReview/DefaultView.aspx?id=5MX063,0,0,
Winyates Opticians,0000050__000004_B980NR,OPT,17 Winyates Shopping Centre,Winyates,Redditch,Worcestershire,,B98 0NR,Tel: 01527 529010, - ,,,No ratings yet Rate it yourself - /Services/opticians/LeaveReview/DefaultView.aspx?id=0000050__000004_B980NR,0,0,
Upton Vision,P0N0A,OPT,,6 Old Street,,Worcester,,WR8 0HA,, - ,,,No ratings yet Rate it yourself - /Services/opticians/LeaveReview/DefaultView.aspx?id=P0N0A,0,0,
Chapman & Myers Opticians,OP_5HT_437__000001_B634AB,OPT,14 Hagley Mall,The Cornbow Centre,,Halesowen,,B63 4AL,Tel: 0121 585 7065, - ,,,1 rating Rate it yourself - /Services/opticians/LeaveReview/DefaultView.aspx?id=OP_5HT_437__000001_B634AB,,,
Scrivens Ltd,OP_5HT_5770__000001_B634AL,OPT,5 Hagley Mall,The Cornbow Centre,,Halesowen,,B63 4AL,Tel: 0121 501 1010, - ,,,No ratings yet Rate it yourself - /Services/opticians/LeaveReview/DefaultView.aspx?id=OP_5HT_5770__000001_B634AL,0,0,
Specsavers ,OP_5HT_14938__000002_B634AL,OPT,36 Hagley Mall,The Cornbow Centre,Halesowen,,,B63 4AL,Tel: 0121 504 4940, - ,,,No ratings yet Rate it yourself - /Services/opticians/LeaveReview/DefaultView.aspx?id=OP_5HT_14938__000002_B634AL,0,0,
Boots-Halesowen,OP_5HT_690__000001_B633AS,OPT,2 Hagley Street,Halesowen,,West Midlands,,B63 3AS,Tel: 0121 550 1610, - ,,,2 ratings Rate it yourself - /Services/opticians/LeaveReview/DefaultView.aspx?id=OP_5HT_690__000001_B633AS,,,
Eye Society Opticians,OP_5HT_3430__000002_B633AW,OPT,,4 Peckingham Street,,Halesowen,West Midlands,B63 3AW,Tel: 0121 585 5347, - ,,,1 rating Rate it yourself - /Services/opticians/LeaveReview/DefaultView.aspx?id=OP_5HT_3430__000002_B633AW,,,
Specs Direct,5M147__000002_B312PA,OPT,871 Bristol Road South,Northfield,Birmingham,,,B31 2PA,Tel: 0121 477 7474, - ,,,No ratings yet Rate it yourself - /Services/opticians/LeaveReview/DefaultView.aspx?id=5M147__000002_B312PA,0,0,
Myoptics Eye Clinic,I2T1M,OPT,,14 Curdale Road,Bartley Green,Birmingham,West Midlands,B32 4HB,Tel: 01214754920, - ,,,2 ratings Rate it yourself - /Services/opticians/LeaveReview/DefaultView.aspx?id=I2T1M,,,
Boots-Northfield,5M1089,OPT,816 Bristol Road South,,Northfield,Birmingham,,B31 2NS,Tel: 0121 475 1072, - ,,,No ratings yet Rate it yourself - /Services/opticians/LeaveReview/DefaultView.aspx?id=5M1089,0,0,
Virdi & Pepall Ltd,5M1105,OPT,,826 Bristol Road South,Northfield,Birmingham,,B31 2NS,Tel: 0121 475 4342, - ,,,5 ratings Rate it yourself - /Services/opticians/LeaveReview/DefaultView.aspx?id=5M1105,,,
Eyewise ,OP_5M1_2922__000002_B312JU,OPT,892 Bristol Road South,Northfield,Birmingham,,,B31 2NS,Tel: 0121 477 6550, - ,,,No ratings yet Rate it yourself - /Services/opticians/LeaveReview/DefaultView.aspx?id=OP_5M1_2922__000002_B312JU,0,0,
John Hamer Opticians,OP_5HT_3163__000002_DY85PD,OPT,11 Wordsley Green Shopping Centre,Wordsley Green,Stourbridge,,,DY8 5PD,Tel: 01384 401 201, - ,,,No ratings yet Rate it yourself - /Services/opticians/LeaveReview/DefaultView.aspx?id=OP_5HT_3163__000002_DY85PD,0,0,
Specsavers Opticians,OP_5M1_8153__000002_B312NN,OPT,,"Unit 3, 780-792 Bristol Road South",Northfield,Birmingham,,B31 2NN,Tel: 0121 476 4717, - ,,,No ratings yet Rate it yourself - /Services/opticians/LeaveReview/DefaultView.aspx?id=OP_5M1_8153__000002_B312NN,0,0,
Scrivens Ltd,OP_5M1_6295__000001_B312NG,OPT,731 Bristol Road South,Northfield,,Birmingham,West Midlands,B31 2NG,Tel: 0121 475 1152, - ,,,No ratings yet Rate it yourself - /Services/opticians/LeaveReview/DefaultView.aspx?id=OP_5M1_6295__000001_B312NG,0,0,
Vision Express (UK) Ltd,OP_5HT_290__000003_DY51SY,OPT,Units U44-U45,The Merry Hill Centre,Brierley Hill,West Midlands,,DY5 1SY,Tel: 01384 481 616, - ,,,No ratings yet Rate it yourself - /Services/opticians/LeaveReview/DefaultView.aspx?id=OP_5HT_290__000003_DY51SY,0,0,
Eye Society,OP_5MH_10164__000002_B645HH,OPT,33 High Street,,Cradley Heath,,,B64 5HL,Tel: 01384 633336, - ,,,No ratings yet Rate it yourself - /Services/opticians/LeaveReview/DefaultView.aspx?id=OP_5MH_10164__000002_B645HH,0,0,
Arnold Opticians,OP_5MH_10243__000001_B645HG,OPT,17-18 High Street,,Cradley Heath,,,B64 5HG,Tel: 01384 561969, - ,,,No ratings yet Rate it yourself - /Services/opticians/LeaveReview/DefaultView.aspx?id=OP_5MH_10243__000001_B645HG,0,0,
J S Edmunds,OP_5HT_7829__000001_DY53AU,OPT,101 High Street,,Brierley Hill,,,DY5 3AU,Tel: 01384 77025, - ,,,No ratings yet Rate it yourself - /Services/opticians/LeaveReview/DefaultView.aspx?id=OP_5HT_7829__000001_DY53AU,0,0,
R Meredith,OP_5MH_7811__000001_B645HP,OPT,6 High Street,,Cradley Heath,,,B64 5HP,Tel: 01384 566 770, - ,,,No ratings yet Rate it yourself - /Services/opticians/LeaveReview/DefaultView.aspx?id=OP_5MH_7811__000001_B645HP,0,0,
Pickford Opticians,OP_5HT_12084__000001_DY53BU,OPT,177 High Street,,Brierley Hill,,,DY5 3BU,Tel: 01384 77326, - ,,,4 ratings Rate it yourself - /Services/opticians/LeaveReview/DefaultView.aspx?id=OP_5HT_12084__000001_DY53BU,,,
Boots Opticians and Hearing Care,OP_5HT_242__000002_DY51SY,OPT,The Merry Hill Centre,Brierley Hill,Dudley,West Midlands,,DY5 1QT,Tel: 01384 74817, - ,,,13 ratings Rate it yourself - /Services/opticians/LeaveReview/DefaultView.aspx?id=OP_5HT_242__000002_DY51SY,,,
Optical Express,OP_5HT_1213__000001_DY51SS,OPT,U83,Upper Mall,Merry Hill Shopping Centre,Brierley Hill,West Midlands,DY5 1SS,Tel: 0800 023 2020, - ,,,3 ratings Rate it yourself - /Services/opticians/LeaveReview/DefaultView.aspx?id=OP_5HT_1213__000001_DY51SS,,,
Boots-Brierley Hill - Merry Hill Centre (next to Boots UK),OP_5HT_2764__000001_DY51QX,OPT,Unit 66,Merry Hill Centre,,Brierley Hill,West Midlands,DY5 1QX,Tel: 01384 74817, - ,,,1 rating Rate it yourself - /Services/opticians/LeaveReview/DefaultView.aspx?id=OP_5HT_2764__000001_DY51QX,,,
DUDLEY WOOD OPTICIANS,OPT_DY20BH_1,OPT,,2 Bush Road,,Dudley,,DY2 0BH,Tel: 01384 412 600, - ,,,3 ratings Rate it yourself - /Services/opticians/LeaveReview/DefaultView.aspx?id=OPT_DY20BH_1,,,
A C Jelley,OP_5MT_4555__000001_WR158BA,OPT,14 Teme Street,,Tenbury Wells,,,WR15 8BA,Tel: 01584 811445, - ,,,No ratings yet Rate it yourself - /Services/opticians/LeaveReview/DefaultView.aspx?id=OP_5MT_4555__000001_WR158BA,0,0,