Organisation Name,NACS Code,Organisation Type,Address1,Address2,Address3,Address4,Address5,PostCode,Telephone Number,Opening time,Value  (Opening time),Banding Classification  (Opening time),NHS.UK users rating,Value  (NHS.UK users rating),Banding Classification  (NHS.UK users rating),Car parking (Is there car parking at this organisation?)
Leightons Opticians & Hearing Care,OP_5KP_3130__000001_KT112LR,OPT,,Unit 5,1-7 Holly Parade,Cobham,Surrey,KT11 3EB,Tel: 01932 867 890, - ,,,No ratings yet Rate it yourself - /Services/opticians/LeaveReview/DefaultView.aspx?id=OP_5KP_3130__000001_KT112LR,0,0,
The Optical Co. ,TP9G6,OPT,,3 High Street,,Cobham,Surrey,KT11 3DH,Tel: 01932 867565, - ,,,No ratings yet Rate it yourself - /Services/opticians/LeaveReview/DefaultView.aspx?id=TP9G6,0,0,
David Clulow Opticians,KT11 2LR__000002_KT112LR,OPT,21 Oakdene Parade,,Cobham,Surrey,,KT11 2LR,Tel: 01932 590415, - ,,,No ratings yet Rate it yourself - /Services/opticians/LeaveReview/DefaultView.aspx?id=KT11 2LR__000002_KT112LR,0,0,
TESCO OPTICANS,KT13 0XF__000003_KT130XF,OPT,,Barnes Wallace Drive,,Weybridge,Surrey,KT13 0XF,Tel: 0345 601 3479, - ,,,No ratings yet Rate it yourself - /Services/opticians/LeaveReview/DefaultView.aspx?id=KT13 0XF__000003_KT130XF,0,0,
Batemans (opticians),OP_5L7_11137__000001_KT146LF,OPT,,57 Old Woking Road,,West Byfleet,Surrey,KT14 6LF,Tel: 01932 343 732, - ,,,No ratings yet Rate it yourself - /Services/opticians/LeaveReview/DefaultView.aspx?id=OP_5L7_11137__000001_KT146LF,0,0,
Community Eye Care,OP_5L5_3088__000001_GU236EW,OPT,"Suite A, Astra",Vicarage Lane,"Send, Woking",Surrey,,GU23 7JN,Tel: 01483 224914, - ,,,No ratings yet Rate it yourself - /Services/opticians/LeaveReview/DefaultView.aspx?id=OP_5L5_3088__000001_GU236EW,0,0,
T H Collison Ltd,OP_5L7_6600__000002_KT146NG,OPT,,15 Old Woking Road,,West Byfleet,Surrey,KT14 6LW,Tel: 01932 342 457, - ,,,No ratings yet Rate it yourself - /Services/opticians/LeaveReview/DefaultView.aspx?id=OP_5L7_6600__000002_KT146NG,0,0,
Asda Stores Ltd,OPT_GU215SE_1,OPT,Asda Opticians,Forsyth Road,,"Sheerwater, Woking",Surrey,GU21 5SE,Tel: 01483 702700, - ,,,No ratings yet Rate it yourself - /Services/opticians/LeaveReview/DefaultView.aspx?id=OPT_GU215SE_1,0,0,
Asda Opticians,OPT_GU21 5SE,OPT,,Forsyth Road,,Sheerwater,,GU21 5SE,Tel: 01483220 955, - ,,,No ratings yet Rate it yourself - /Services/opticians/LeaveReview/DefaultView.aspx?id=OPT_GU21 5SE,0,0,
Donner Optometrists,,OPT,,9 Church Rd,,Great Bookham Leatherhead,,KT23 3PD,Tel: 01372 458318, - ,,,N/A - Data not available,,,
JOHN ROSE EYE CARE,KT11 1BQ__000001_KT111BQ,OPT,,1 Eden Street,,Kingston,Surrey,KT11 1BQ,Tel: 0208 546 9292, - ,,,1 rating Rate it yourself - /Services/opticians/LeaveReview/DefaultView.aspx?id=KT11 1BQ__000001_KT111BQ,,,
Bayfields Opticians,OP_5L7_9872__000001_GU211XU,OPT,,35 Commercial Way,,Woking,,GU21 6XR,Tel: 01483 766 800, - ,,,No ratings yet Rate it yourself - /Services/opticians/LeaveReview/DefaultView.aspx?id=OP_5L7_9872__000001_GU211XU,0,0,
Dollond & Aitchison,OP_5L7_3550__000001_GU211XX,OPT,35 Wolsey Walk,,Woking,,,GU21 6YH,Tel: 01483 761 495, - ,,,No ratings yet Rate it yourself - /Services/opticians/LeaveReview/DefaultView.aspx?id=OP_5L7_3550__000001_GU211XX,0,0,
Specsavers Opticians,OP_5L7_375__000001_GU211XS,OPT,,17-19 Wolsey Walk,Wolsey Place Shopping Centre,Woking,Surrey,GU21 6XU,Tel: 01483 767 170, - ,,,No ratings yet Rate it yourself - /Services/opticians/LeaveReview/DefaultView.aspx?id=OP_5L7_375__000001_GU211XS,0,0,
Boots Opticians Woking ,OP_5L7_6031__000002_GU211YA,OPT,1-9 Commercial Way,"10 Wolsey Walk, Wolsey Place Shopping Centre",,Woking,Surrey,GU21 6XU,Tel: 01483 761640, - ,,,1 rating Rate it yourself - /Services/opticians/LeaveReview/DefaultView.aspx?id=OP_5L7_6031__000002_GU211YA,,,
Eye Noor Limited,OPT_KT139UQ_1,OPT,,Weybridge Eye Clinic  83 Queens Road,,Weybridge,,KT13 9UQ,, - ,,,No ratings yet Rate it yourself - /Services/opticians/LeaveReview/DefaultView.aspx?id=OPT_KT139UQ_1,0,0,
Eyesite Opticians,OP_5L6_9625__000001_KT138DL,OPT,,60 Church Street,,Weybridge,Surrey,KT13 8DL,Tel: 01932 859 889, - ,,,No ratings yet Rate it yourself - /Services/opticians/LeaveReview/DefaultView.aspx?id=OP_5L6_9625__000001_KT138DL,0,0,
Henning & Henning Opticians,OP_5L6_9057__000001_KT138DX,OPT,14 Church Street,,Weybridge,,,KT13 8DX,Tel: 01932 829 868, - ,,,No ratings yet Rate it yourself - /Services/opticians/LeaveReview/DefaultView.aspx?id=OP_5L6_9057__000001_KT138DX,0,0,
Boots-Weybridge - High St,OP_5L6_5995__000002_KT138AX,OPT,23 High Street,,,Weybridge,Surrey,KT13 8AX,Tel: 01932 842725, - ,,,No ratings yet Rate it yourself - /Services/opticians/LeaveReview/DefaultView.aspx?id=OP_5L6_5995__000002_KT138AX,0,0,
Boots Opticians,TP97E,OPT,,2 The Lane,,Addlestone,,KT15 2GN,, - ,,,1 rating Rate it yourself - /Services/opticians/LeaveReview/DefaultView.aspx?id=TP97E,,,
Addlestone Specsavers Limited,T4J9A,OPT,,84 Station Road,Addlestone,Surrey,,KT15 2AD,Tel: 01932505027, - ,,,No ratings yet Rate it yourself - /Services/opticians/LeaveReview/DefaultView.aspx?id=T4J9A,0,0,
Leightons Opticians & Hearing Care,OP_5L6_11775__000002_KT152AF,OPT,,76 Station Road,,Addlestone,Surrey,KT15 2AF,Tel: 01932 853 199, - ,,,No ratings yet Rate it yourself - /Services/opticians/LeaveReview/DefaultView.aspx?id=OP_5L6_11775__000002_KT152AF,0,0,
Batemans Opticians,OP_5L7_12343__000001_GU215AG,OPT,55 Commercial Way,,Woking,,,GU21 3HN,Tel: 01483 760770, - ,,,No ratings yet Rate it yourself - /Services/opticians/LeaveReview/DefaultView.aspx?id=OP_5L7_12343__000001_GU215AG,0,0,
Tesco Opticians ,KT152AS060716,OPT,,117 Station Road,,Addlestone,Surrey,KT15 2AS,Tel: 0345 601 3479, - ,,,No ratings yet Rate it yourself - /Services/opticians/LeaveReview/DefaultView.aspx?id=KT152AS060716,0,0,
Graham Johnson,OP_5L6_7561__000003_KT124HL,OPT,6 Hersham Centre,Hersham Green,,Hersham,Surrey,KT12 4HL,Tel: 01932 231 470, - ,,,No ratings yet Rate it yourself - /Services/opticians/LeaveReview/DefaultView.aspx?id=OP_5L6_7561__000003_KT124HL,0,0,yes
Specsavers Opticians,OPT_KT228AH_1,OPT,,12 The Swan Centre,,Leatherhead,Surrey,KT22 8AH,Tel: 01372 227740, - ,,,No ratings yet Rate it yourself - /Services/opticians/LeaveReview/DefaultView.aspx?id=OPT_KT228AH_1,0,0,
R. Stone Opticians,OP_5L6_4153__000001_KT121BY,OPT,52 High Street,,,Walton-on-Thames,,KT12 1BY,Tel: 01932 225 076, - ,,,No ratings yet Rate it yourself - /Services/opticians/LeaveReview/DefaultView.aspx?id=OP_5L6_4153__000001_KT121BY,0,0,
VISION EXPRESS (UK) LTD,KT12 1GH__000001_KT121GH,OPT,Unit 31 Heart Shopping Centre,New Zealand Avenue,,Walton On Thames,Surrey,KT12 1GH,Tel: 01932 254270, - ,,,No ratings yet Rate it yourself - /Services/opticians/LeaveReview/DefaultView.aspx?id=KT12 1GH__000001_KT121GH,0,0,
Nicklins Opticians,OP_5L5_9270__000001_GU13JB,OPT,216 High Street,,,Guildford,,GU1 3JB,Tel: 01483 561 256, - ,,,No ratings yet Rate it yourself - /Services/opticians/LeaveReview/DefaultView.aspx?id=OP_5L5_9270__000001_GU13JB,0,0,
Boots Opticians,OPT_KT121DG_1,OPT,,25 High Street,,Walton-On-Thames,,KT12 1DG,, - ,,,No ratings yet Rate it yourself - /Services/opticians/LeaveReview/DefaultView.aspx?id=OPT_KT121DG_1,0,0,
Esher Eye Centre,OP_5KP_14521__000001_KT109QJ,OPT,122 High Street,,Esher,,,KT10 9QJ,Tel: 01372 464492, - ,,,No ratings yet Rate it yourself - /Services/opticians/LeaveReview/DefaultView.aspx?id=OP_5KP_14521__000001_KT109QJ,0,0,
Batemans (Opticians) Ltd,OP_5L6_5171__000001_KT122QS,OPT,,6 Church Street,,Walton-on-Thames,Surrey,KT12 2QS,Tel: 01932 221 524, - ,,,No ratings yet Rate it yourself - /Services/opticians/LeaveReview/DefaultView.aspx?id=OP_5L6_5171__000001_KT122QS,0,0,
Batemans (Opticians) Ltd,OP_5L5_2184__000001_GU13HN,OPT,162 High Street,,Guildford,,,GU1 3HN,Tel: 01483 572 953, - ,,,No ratings yet Rate it yourself - /Services/opticians/LeaveReview/DefaultView.aspx?id=OP_5L5_2184__000001_GU13HN,0,0,
Eyeworks ,OP_5L6_14622__000001_KT122QP,OPT,1 Church Street,Walton-on-Thames,Surrey,Surrey,,KT12 2QP,Tel: 01932 244 266, - ,,,No ratings yet Rate it yourself - /Services/opticians/LeaveReview/DefaultView.aspx?id=OP_5L6_14622__000001_KT122QP,0,0,
Optical Express,GU1 3EZ_11111,OPT,"Suite 3, 1 Milkhouse gate",,,Guildford,Surrey,GU1 3EZ,Tel: 0800 023 2020, - ,,,No ratings yet Rate it yourself - /Services/opticians/LeaveReview/DefaultView.aspx?id=GU1 3EZ_11111,0,0,
Specsavers,OP_5L6_14625__000001_KT101BY,OPT,22 High Street,22 High Street,Walton-on-Thames,Surrey,,KT10 1DA,Tel: 01932 251 960, - ,,,No ratings yet Rate it yourself - /Services/opticians/LeaveReview/DefaultView.aspx?id=OP_5L6_14625__000001_KT101BY,0,0,
David Clulow Opticians,OP_GU13DP_89449,OPT,,103 High Street,,Guildford,,GU1 3DP,Tel: 01483 453339, - ,,,No ratings yet Rate it yourself - /Services/opticians/LeaveReview/DefaultView.aspx?id=OP_GU13DP_89449,0,0,
Dollond & Aitchison,OP_5L5_7322__000001_GU13HE,OPT,94 High Street,,Guildford,,,GU1 3HE,Tel: 01483 570 093, - ,,,No ratings yet Rate it yourself - /Services/opticians/LeaveReview/DefaultView.aspx?id=OP_5L5_7322__000001_GU13HE,0,0,
Boots-Guildford - Swan Lane,OP_5L5_629__000001_GU14EQ,OPT,22-24 Swan Lane,,,Guildford,Surrey,GU1 4EQ,Tel: 01483 573637, - ,,,No ratings yet Rate it yourself - /Services/opticians/LeaveReview/DefaultView.aspx?id=OP_5L5_629__000001_GU14EQ,0,0,
Boots Optician Ltd,OPT_GU14EQ_1,OPT,,22-24 Swan Lane,,Guildford,Surrey,GU1 4EQ,Tel: 01483 573637, - ,,,No ratings yet Rate it yourself - /Services/opticians/LeaveReview/DefaultView.aspx?id=OPT_GU14EQ_1,0,0,
Visioncare,OP_5KP_849__000002_KT109RL,OPT,,17 High Street,,Esher,Surrey,KT10 9RL,Tel: 01372 462 401, - ,,,No ratings yet Rate it yourself - /Services/opticians/LeaveReview/DefaultView.aspx?id=OP_5KP_849__000002_KT109RL,0,0,
Bayfields Opticians,OP_5L5_4821__000001_GU13DY,OPT,37 High Street,,Guildford,Guildford,,GU1 3DY,Tel: 01483 575 650, - ,,,2 ratings Rate it yourself - /Services/opticians/LeaveReview/DefaultView.aspx?id=OP_5L5_4821__000001_GU13DY,,,
Vision Express (UK) Ltd,OP_5L5_719__000002_GU13DY,OPT,51 High Street,,,Guildford,,GU1 3DY,Tel: 01483 300 344, - ,,,No ratings yet Rate it yourself - /Services/opticians/LeaveReview/DefaultView.aspx?id=OP_5L5_719__000002_GU13DY,0,0,
Specsavers Opticians,OP_5L5_8367__000001_GU14EH,OPT,23 Friary Street,,,Guildford,,GU1 4EH,Tel: 01483 452 225, - ,,,No ratings yet Rate it yourself - /Services/opticians/LeaveReview/DefaultView.aspx?id=OP_5L5_8367__000001_GU14EH,0,0,
Vision Express ,OP_5L7_6926__000001_GU211GD,OPT,,46 Wolsey Walk,,Woking,Surrey,GU2 6GH,Tel: 01483 767 141, - ,,,No ratings yet Rate it yourself - /Services/opticians/LeaveReview/DefaultView.aspx?id=OP_5L7_6926__000001_GU211GD,0,0,
Haig Brown Opticians,OP_5KP_1837__000001_KT109PJ,OPT,Fairoak,Portsmouth Road,Esher,,,KT10 9PJ,Tel: 01372 466 762, - ,,,1 rating Rate it yourself - /Services/opticians/LeaveReview/DefaultView.aspx?id=OP_5KP_1837__000001_KT109PJ,,,
 Thomas H. Collison Ltd,OP_5L6_5042__000002_KT169AL,OPT,119c Guildford Street,,Chertsey,Chertsey,,KT16 9AL,Tel: 01932 571832, - ,,,No ratings yet Rate it yourself - /Services/opticians/LeaveReview/DefaultView.aspx?id=OP_5L6_5042__000002_KT169AL,0,0,
T H Collison Ltd,OP_5L6_2450__000003_KT169AL,OPT,,133 Guildford Street,,Chertsey,Surrey,KT16 9AL,Tel: 01932 563 076, - ,,,1 rating Rate it yourself - /Services/opticians/LeaveReview/DefaultView.aspx?id=OP_5L6_2450__000003_KT169AL,,,
McAteers Opticians,OP_5L6_14623__000001_TW179AW,OPT,6 The High Street,,Shepperton,,,TW17 9AW,Tel: 01932 230 303, - ,,,No ratings yet Rate it yourself - /Services/opticians/LeaveReview/DefaultView.aspx?id=OP_5L6_14623__000001_TW179AW,0,0,
Ian Squire Optician,OP_5L6_3873__000001_TW178AR,OPT,11 Station Approach,,Shepperton,,,TW17 8AR,Tel: 01932 226 789, - ,,,No ratings yet Rate it yourself - /Services/opticians/LeaveReview/DefaultView.aspx?id=OP_5L6_3873__000001_TW178AR,0,0,
Penny & Hayter,OP_5L7_10130__000001_GU212PS,OPT,3 Albion Parade,High Street,Woking,,,GU21 2PS,Tel: 01483 475 205, - ,,,No ratings yet Rate it yourself - /Services/opticians/LeaveReview/DefaultView.aspx?id=OP_5L7_10130__000001_GU212PS,0,0,
Chobham Eye Clinic,Y8Z7R,OPT,,24 High Street,,Chobham,,GU24 8AA,Tel: 01276 932884, - ,,,3 ratings Rate it yourself - /Services/opticians/LeaveReview/DefaultView.aspx?id=Y8Z7R,,,
Ashtead Eye Clinic,OP_5KP_12937__000001_KT211AA,OPT,31-33 The Street,,Ashtead,,,KT21 1AA,Tel: 01372 274 348, - ,,,No ratings yet Rate it yourself - /Services/opticians/LeaveReview/DefaultView.aspx?id=OP_5KP_12937__000001_KT211AA,0,0,
Boots-Dorking,OP_5KP_10554__000003_RH41AW,OPT,83 High Street,,,Dorking,Surrey,RH4 1AW,Tel: 01306 882 176, - ,,,1 rating Rate it yourself - /Services/opticians/LeaveReview/DefaultView.aspx?id=OP_5KP_10554__000003_RH41AW,,,
EMSLIE OPTICIANS,OP_5KP_14528__000001_RH41AY,OPT,62 High Street,,Dorking,Dorking,,RH4 1AY,Tel: 01306 875 201, - ,,,No ratings yet Rate it yourself - /Services/opticians/LeaveReview/DefaultView.aspx?id=OP_5KP_14528__000001_RH41AY,0,0,
Batemans (Opticians) Ltd,OP_5KP_11827__000001_RH41BA,OPT,,114 High Street,,Dorking,Surrey,RH4 1BA,Tel: 01306 882 787, - ,,,No ratings yet Rate it yourself - /Services/opticians/LeaveReview/DefaultView.aspx?id=OP_5KP_11827__000001_RH41BA,0,0,
Specsavers Opticians,OP_5KP_14662__000002_RH41BA,OPT,Specsavers,110 High Street,,Dorking,Surrey,RH4 1BA,Tel: 01306 745 350, - ,,,No ratings yet Rate it yourself - /Services/opticians/LeaveReview/DefaultView.aspx?id=OP_5KP_14662__000002_RH41BA,0,0,
Thomas H. Collison Ltd,OP_5L5_9284__000001_GU25XX,OPT,The Royal Surrey County Hospital,Egerton Road,,Guildford,Surrey,GU2 5XX,Tel: 01483 571122 (ext. 2144), - ,,,No ratings yet Rate it yourself - /Services/opticians/LeaveReview/DefaultView.aspx?id=OP_5L5_9284__000001_GU25XX,0,0,
The Avenue Optical,OP_5L6_11988__000002_TW165HS,OPT,9 Avenue Parade,The Avenue,,Sunbury-on-Thames,Surrey,TW16 5HS,Tel: 01932 770 977, - ,,,No ratings yet Rate it yourself - /Services/opticians/LeaveReview/DefaultView.aspx?id=OP_5L6_11988__000002_TW165HS,0,0,
The Optical Gallery (Chessington),OP_5A5_5843__000001_KT91NU,OPT,340 Hook Road,Chessington,,Surrey,,KT9 1NU,Tel: 0208 391 0900, - ,,,No ratings yet Rate it yourself - /Services/opticians/LeaveReview/DefaultView.aspx?id=OP_5A5_5843__000001_KT91NU,0,0,
Thomas H. Collison Ltd,OP_5KP_11291__000001_KT80DT,OPT,Kent House,Walton Road,,East Molesey,Surrey,KT8 0DT,Tel: 0208 979 6751, - ,,,No ratings yet Rate it yourself - /Services/opticians/LeaveReview/DefaultView.aspx?id=OP_5KP_11291__000001_KT80DT,0,0,
Tesco Opticians,TW167BB060716,OPT,,Escot Road,,Sunbury-on-Thames,,TW16 7BB,Tel: 0845 601 3479, - ,,,No ratings yet Rate it yourself - /Services/opticians/LeaveReview/DefaultView.aspx?id=TW167BB060716,0,0,
Thomas H. Collison Ltd,OP_5L6_4986__000002_TW167AB,OPT,11 The Parade,Staines Road West,,Sunbury-on-Thames,Surrey,TW16 7AB,Tel: 01932 782 318, - ,,,No ratings yet Rate it yourself - /Services/opticians/LeaveReview/DefaultView.aspx?id=OP_5L6_4986__000002_TW167AB,0,0,
The Optical Studio,OPT_GU254DW_1,OPT,,13 Station Approach,,Virginia Water,,GU25 4DW,Tel: 01344 849077, - ,,,No ratings yet Rate it yourself - /Services/opticians/LeaveReview/DefaultView.aspx?id=OPT_GU254DW_1,0,0,
Leightons Opticians & Hearing Care,OP_5KP_3838__000001_KT198EH,OPT,88 High Street,,Epsom,Surrey,,KT19 8BJ,Tel: 01372 722 656, - ,,,No ratings yet Rate it yourself - /Services/opticians/LeaveReview/DefaultView.aspx?id=OP_5KP_3838__000001_KT198EH,0,0,
Vision Express (UK) Ltd,OP_5KP_12653__000002_KT185DB,OPT,,16 Ashley Centre,,Epsom,Surrey,KT18 5DB,Tel: 01372 747 422, - ,,,No ratings yet Rate it yourself - /Services/opticians/LeaveReview/DefaultView.aspx?id=OP_5KP_12653__000002_KT185DB,0,0,
Boots-Epsom - Ashley Centre (in Boots UK),KT18 5DB__000003_KT185DB,OPT,57 Ashley Centre,,,Epsom,Surrey,KT18 5DB,Tel: 01372 747605, - ,,,7 ratings Rate it yourself - /Services/opticians/LeaveReview/DefaultView.aspx?id=KT18 5DB__000003_KT185DB,,,
Specsavers Opticians,OP_5KP_8008__000001_KT198AH,OPT,,24 High Street,,Epsom,Surrey,KT19 8AH,Tel: 01372 744 250, - ,,,No ratings yet Rate it yourself - /Services/opticians/LeaveReview/DefaultView.aspx?id=OP_5KP_8008__000001_KT198AH,0,0,
SeeAbility Ltd,CO-4941,OPT,,Newplan House,,Surrey,,KT17 1BL,, - ,,,No ratings yet Rate it yourself - /Services/opticians/LeaveReview/DefaultView.aspx?id=CO-4941,0,0,
Priory Opticians,OP_5M6_13284__000001_TW122NS,OPT,37 Priory Road,Hampton,,Middlesex,,TW12 2NS,Tel: 0208 979 0203, - ,,,2 ratings Rate it yourself - /Services/opticians/LeaveReview/DefaultView.aspx?id=OP_5M6_13284__000001_TW122NS,,,
Specsavers Opticians,TP9GG,OPT,,Sainsburys,Kiln Lane,Epsom,Surrey,KT17 1EQ,Tel: 01372 677928, - ,,,No ratings yet Rate it yourself - /Services/opticians/LeaveReview/DefaultView.aspx?id=TP9GG,0,0,
Norman Prince Opticians,V9S9S,OPT,Norman Prince Opticians,15 Church Parade,,Ashford,,TW15 2TX,Tel: 01784 252106, - ,,,1 rating Rate it yourself - /Services/opticians/LeaveReview/DefaultView.aspx?id=V9S9S,,,
Boots-Surbiton,KT6 4NR__000001_KT66NR,OPT,2 Onslow House,67 Victoria Rd,,Surbiton,,KT6 4NR,Tel: 020 8390 9268, - ,,,No ratings yet Rate it yourself - /Services/opticians/LeaveReview/DefaultView.aspx?id=KT6 4NR__000001_KT66NR,0,0,
Hollands Opticians Surbiton,KT6 4JZ__000002_KT64JZ,OPT,24a,Victoria Road,,Surbiton,,KT6 4JZ,Tel: 0208 399 8104, - ,,,3 ratings Rate it yourself - /Services/opticians/LeaveReview/DefaultView.aspx?id=KT6 4JZ__000002_KT64JZ,,,
Opticall Ltd,685P2__000001_W52QP,OPT,7 Acantha Court,"1st Floor, 21 Victoria Road",Ealing,"Surbiton, Surrey",,KT6 4JZ,, - ,,,No ratings yet Rate it yourself - /Services/opticians/LeaveReview/DefaultView.aspx?id=685P2__000001_W52QP,0,0,
Mistry Opticians,OP_5A5_13282__000001_KT67AB,OPT,287 Ewell Road,Surbiton,,Surrey,,KT6 7AB,Tel: 020 8399 4491, - ,,,1 rating Rate it yourself - /Services/opticians/LeaveReview/DefaultView.aspx?id=OP_5A5_13282__000001_KT67AB,,,
Specsavers Opticians,TP10G,OPT,,2 Surbiton Parade,,Surbiton,Surrey,KT6 4RB,Tel: 0208 339 8900, - ,,,No ratings yet Rate it yourself - /Services/opticians/LeaveReview/DefaultView.aspx?id=TP10G,0,0,
Specsavers Opticians,TP10G,OPT,,2 Surbiton Parade,,Surbiton,,KT6 4RB,, - ,,,No ratings yet Rate it yourself - /Services/opticians/LeaveReview/DefaultView.aspx?id=TP10G,0,0,
KALSI OPTICIANS,KT8 4QU__000001_KT64QU,OPT,24 Claremont Road,,,Surbiton,,KT6 4QU,Tel: 0208 399 9887, - ,,,No ratings yet Rate it yourself - /Services/opticians/LeaveReview/DefaultView.aspx?id=KT8 4QU__000001_KT64QU,0,0,
Thomas H. Collison Ltd,OP_5L6_10052__000002_TW152UP,OPT,,17-19 Station Road,,Ashford,Middlesex,TW15 2UP,Tel: 01784 258 432, - ,,,No ratings yet Rate it yourself - /Services/opticians/LeaveReview/DefaultView.aspx?id=OP_5L6_10052__000002_TW152UP,0,0,
Thomas H. Collison Ltd,OP_5A5_11523__000001_KT67BA,OPT,372 Ewell Road,Tolworth,,Surrey,,KT6 7BA,Tel: 020 8399 0700, - ,,,1 rating Rate it yourself - /Services/opticians/LeaveReview/DefaultView.aspx?id=OP_5A5_11523__000001_KT67BA,,,
Bayfields Opticians and Audiologists (Staines),I9X7K,OPT,,Unit 3,The Elmsleigh Centre,Staines,Surrey,TW18 4QB,Tel: 0178 444 9992, - ,,,No ratings yet Rate it yourself - /Services/opticians/LeaveReview/DefaultView.aspx?id=I9X7K,0,0,
VISION EXPRESS ,I8V0C,OPT,Unit 5,Elmsleigh  Centre,,Staines,Surrey,TW18 4QB,Tel: 01784 469 109, - ,,,No ratings yet Rate it yourself - /Services/opticians/LeaveReview/DefaultView.aspx?id=I8V0C,0,0,
Anthony Opticians,OP_5A5_7931__000001_KT67HR,OPT,84 The Broadway,Tolworth,,Surrey,,KT6 7HR,Tel: 0208 390 5219, - ,,,No ratings yet Rate it yourself - /Services/opticians/LeaveReview/DefaultView.aspx?id=OP_5A5_7931__000001_KT67HR,0,0,
Specsavers Opticians,OP_5L6_10293__000001_TW184DS,OPT,Unit 5ud,Two Rivers,Staines,Middlesex,,TW18 4UP,Tel: 01784 493 355, - ,,,No ratings yet Rate it yourself - /Services/opticians/LeaveReview/DefaultView.aspx?id=OP_5L6_10293__000001_TW184DS,0,0,
Nethercott Opticians,OP_5KP_4172__000002_KT205AD,OPT,18 Station Approach,,Tadworth,Surrey,,KT20 5AD,Tel: 01737 813 600, - ,,,No ratings yet Rate it yourself - /Services/opticians/LeaveReview/DefaultView.aspx?id=OP_5KP_4172__000002_KT205AD,0,0,
Boots-Staines - Two Rivers Centre,OP_5L6_3819__000001_TW184DR,OPT,"Unit S3, Two Rivers Retail Park",,,Staines,Middlesex,TW18 4WB,Tel: 01784 455437, - ,,,1 rating Rate it yourself - /Services/opticians/LeaveReview/DefaultView.aspx?id=OP_5L6_3819__000001_TW184DR,,,
Bayfields Opticians & Audiologists,X3N3Z,OPT,68 High Street,,Ewell,Surrey,,KT17 1RL,Tel: 020 8393 7711, - ,,,No ratings yet Rate it yourself - /Services/opticians/LeaveReview/DefaultView.aspx?id=X3N3Z,0,0,
Robinson and Lamb Opticians,TP9JP ,OPT,,7 The Precinct,,Egham,,TW20 9HN,, - ,,,No ratings yet Rate it yourself - /Services/opticians/LeaveReview/DefaultView.aspx?id=TP9JP,0,0,
Specsavers Egham,TP71E,OPT,,29 The Precinct,,Egham,,TW20 9HN,Tel: 01784 220580, - ,,,No ratings yet Rate it yourself - /Services/opticians/LeaveReview/DefaultView.aspx?id=TP71E,0,0,
Chandlers Eyecare,B5V5J,OPT,,40 High Street,,Godalming,Surrey,GU7 1DY,Tel: 01483 418 020, - ,,,No ratings yet Rate it yourself - /Services/opticians/LeaveReview/DefaultView.aspx?id=B5V5J,0,0,
Specsavers,OPT_TW121AW_1,OPT,,J Sainsbury,303 Uxbridge Road,Hampton Hill,,TW12 1AW,Tel: 0208 9410852, - ,,,No ratings yet Rate it yourself - /Services/opticians/LeaveReview/DefaultView.aspx?id=OPT_TW121AW_1,0,0,
Batemans  Opticians,OP_5L5_10443__000001_GU71AW,OPT,,37 High Street,,Godalming,Surrey,GU7 1AU,Tel: 01483 414 953, - ,,,No ratings yet Rate it yourself - /Services/opticians/LeaveReview/DefaultView.aspx?id=OP_5L5_10443__000001_GU71AW,0,0,
Boots-Godalming,GU7 1AU__000002_GU71AU,OPT,33 High Street,,,Godalming,Surrey,GU7 1AU,Tel: 01483 425087, - ,,,No ratings yet Rate it yourself - /Services/opticians/LeaveReview/DefaultView.aspx?id=GU7 1AU__000002_GU71AU,0,0,
Tesco Opticians,OPT_TW197PZ_1,OPT,,Town Lane,,"Stanwell, Staines",Surrey,TW19 7PZ,Tel: 0345 677 9018, - ,,,No ratings yet Rate it yourself - /Services/opticians/LeaveReview/DefaultView.aspx?id=OPT_TW197PZ_1,0,0,
iSpy Opticians,TP2DG,OPT,,67 High street,,Godalming,Surrey,GU7 1AW,Tel: 01483 414168, - ,,,No ratings yet Rate it yourself - /Services/opticians/LeaveReview/DefaultView.aspx?id=TP2DG,0,0,
Englefield Green Opticians,OP_TW200QX_34400,OPT,,44 Victoria Street,,Engelfield Green,,TW20 0QX,Tel: 01784 432818, - ,,,No ratings yet Rate it yourself - /Services/opticians/LeaveReview/DefaultView.aspx?id=OP_TW200QX_34400,0,0,
Boots-Kingston - Union St,KT1 1RP__000005_KT11RP,OPT,42 Union Street,,,Kingston Upon Thames,Surrey,KT1 1RP,Tel: 0208 5411560, - ,,,1 rating Rate it yourself - /Services/opticians/LeaveReview/DefaultView.aspx?id=KT1 1RP__000005_KT11RP,,,
DOLLAND & AITCHISON,KT1 1RJ__000001_KT11RJ,OPT,10 Church Street,,,Kingston,,KT1 1RJ,Tel: 0208 546 3416, - ,,,No ratings yet Rate it yourself - /Services/opticians/LeaveReview/DefaultView.aspx?id=KT1 1RJ__000001_KT11RJ,0,0,
David Wilson Optometrists,OPT_TW118QZ_3,OPT,,7 Broad Street,,Teddington,Middlesex,TW11 8QZ,Tel: 020 8977 7499, - ,,,No ratings yet Rate it yourself - /Services/opticians/LeaveReview/DefaultView.aspx?id=OPT_TW118QZ_3,0,0,
Boots-Teddington,OP_TW118QZ_46632,OPT,,Unit 2B,61 Broad Street,Teddington,Middlesex,TW11 8QZ,Tel: 0208 973 1635, - ,,,No ratings yet Rate it yourself - /Services/opticians/LeaveReview/DefaultView.aspx?id=OP_TW118QZ_46632,0,0,
Vision Express ,OP_5A5_6670__000002_KT11TR,OPT,Bentalls Shopping Centre,Wood Street,,Kingston-upon-Thames,,KT1 1TR,Tel: 020 8549 8010, - ,,,No ratings yet Rate it yourself - /Services/opticians/LeaveReview/DefaultView.aspx?id=OP_5A5_6670__000002_KT11TR,0,0,
Sims Opticians,OP_5M6_3062__000001_TW110HE,OPT,4 The Causeway,,,Teddington,,TW11 0HE,Tel: 0208 977 1039, - ,,,No ratings yet Rate it yourself - /Services/opticians/LeaveReview/DefaultView.aspx?id=OP_5M6_3062__000001_TW110HE,0,0,