Organisation Name,NACS Code,Organisation Type,Address1,Address2,Address3,Address4,Address5,PostCode,Telephone Number,Opening time,Value  (Opening time),Banding Classification  (Opening time),NHS.UK users rating,Value  (NHS.UK users rating),Banding Classification  (NHS.UK users rating),Car parking (Is there car parking at this organisation?)
Scrivens,5QE_0X75AD__000005_OX75AD,OPT,Scrivens Opticians and   Hearing Care,8 High Street,,Chipping Norton,Oxfordshire,OX7 5AD,Tel: 01608 642 949, - ,,,No ratings yet Rate it yourself - /Services/opticians/LeaveReview/DefaultView.aspx?id=5QE_0X75AD__000005_OX75AD,0,0,
Michael Barfield,MICHEALBARFIELD1,OPT,,4 New Street,,Chipping Norton,,OX7 5LJ,Tel: 01608 643772, - ,,,2 ratings Rate it yourself - /Services/opticians/LeaveReview/DefaultView.aspx?id=MICHEALBARFIELD1,,,
Chipping Norton Opticians,310320170916,OPT,,"Chipping Norton Health Centre, Russell Way",,Chipping Norton,Oxfordshire,OX7 5FA,Tel: 01608 648012, - ,,,12 ratings Rate it yourself - /Services/opticians/LeaveReview/DefaultView.aspx?id=310320170916,,,
Witney Community Hospital,OP_5DY_3500__000001_OX87JJ,OPT,Welch Way,,,Witney,Oxfordshire,OX28 6JJ,Tel: 01993 209400, - ,,,No ratings yet Rate it yourself - /Services/opticians/LeaveReview/DefaultView.aspx?id=OP_5DY_3500__000001_OX87JJ,0,0,
Optical View Opticians,OPTICALVIEWOPTICIANS1,OPT,,78 High Street,,Witney,Oxfordshire,OX28 6HL,Tel: 01993 771793, - ,,,2 ratings Rate it yourself - /Services/opticians/LeaveReview/DefaultView.aspx?id=OPTICALVIEWOPTICIANS1,,,yes
Boots-Witney,OP_5DY_11544__000001_OX286HW,OPT,,5 High Street,,Witney,Oxfordshire,OX28 6HW,Tel: 01993 778237, - ,,,1 rating Rate it yourself - /Services/opticians/LeaveReview/DefaultView.aspx?id=OP_5DY_11544__000001_OX286HW,,,
Scrivens ,OP_5DY_11106__000002_OX86HB,OPT,,16a High Street,,Witney,Oxfordshire,OX28 6HB,Tel: 01993 702543, - ,,,No ratings yet Rate it yourself - /Services/opticians/LeaveReview/DefaultView.aspx?id=OP_5DY_11106__000002_OX86HB,0,0,
Vision Express Witney,T0M9W,OPT,,24 Woolgate Shopping Centre,Market Square,Witney,Oxfordshire,OX28 6AP,Tel: 01993849700, - ,,,No ratings yet Rate it yourself - /Services/opticians/LeaveReview/DefaultView.aspx?id=T0M9W,0,0,
Specsavers Opticians,OP_5DY_7975__000001_OX86AP,OPT,,18a Woolgate Centre,,Witney,Oxfordshire,OX28 6AP,Tel: 01993 779977, - ,,,1 rating Rate it yourself - /Services/opticians/LeaveReview/DefaultView.aspx?id=OP_5DY_7975__000001_OX86AP,,,
Cotswold Opticians,OP_5DY_10797__000001_OX86AG,OPT,43 Market Square,,Witney,,,OX28 6AG,Tel: 01993 773535, - ,,,1 rating Rate it yourself - /Services/opticians/LeaveReview/DefaultView.aspx?id=OP_5DY_10797__000001_OX86AG,,,
The Opticians,5KY 20005__000001_GL541AA,OPT,Sheep Street,Sheep Street,Stow On The Wold,Gloucestershire,,GL54 1AA,Tel: 01451 830554, - ,,,1 rating Rate it yourself - /Services/opticians/LeaveReview/DefaultView.aspx?id=5KY 20005__000001_GL541AA,,,
Michael Lowe & Partners,OP_5DY_2881__000002_OX183XZ,OPT,5 Streatfield House,Alvescot Road,,Carterton,,OX18 3XZ,Tel: 01993 844291, - ,,,No ratings yet Rate it yourself - /Services/opticians/LeaveReview/DefaultView.aspx?id=OP_5DY_2881__000002_OX183XZ,0,0,
Carterton Opticians,CARTERTONOPTICIANS1,OPT,,"Unit D6, The Giles Centre",,Carterton,,OX18 3DH,Tel: 01993 841268, - ,,,No ratings yet Rate it yourself - /Services/opticians/LeaveReview/DefaultView.aspx?id=CARTERTONOPTICIANS1,0,0,yes
Kevin Tait Opticians,OP_5KY_3831__000001_GL560AS,OPT,3 High Street,,Moreton-In-Marsh,Gloucestershire,,GL56 0AH,Tel: 01608 650621, - ,,,5 ratings Rate it yourself - /Services/opticians/LeaveReview/DefaultView.aspx?id=OP_5KY_3831__000001_GL560AS,,,
Specsavers Kidlington,F4N7Z,OPT,,"Unit 2B, 40 High Street",,Kidlington,Oxfordshire,OX5 2DL,Tel: 01865 509578, - ,,,2 ratings Rate it yourself - /Services/opticians/LeaveReview/DefaultView.aspx?id=F4N7Z,,,
Cherwell Opticians,,OPT,,33 High Street,Kidlington,Oxfordshire,,OX5 2DH,Tel: 01865 842044, - ,,,N/A - Data not available,,,
Morgan Optometry,OP_5DT_12976__000001_OX51BL,OPT,106a Oxford Road,,,Kidlington,,OX5 1BL,Tel: 01865 372125, - ,,,1 rating Rate it yourself - /Services/opticians/LeaveReview/DefaultView.aspx?id=OP_5DT_12976__000001_OX51BL,,,
Greys Opticians,OP_5MQ_2403__000002_CV364AF,OPT,29 High Street,,,Shipston-on-Stour,Warwickshire,CV36 4AJ,Tel: 01608 662873, - ,,,No ratings yet Rate it yourself - /Services/opticians/LeaveReview/DefaultView.aspx?id=OP_5MQ_2403__000002_CV364AF,0,0,
Walford and Round,OP_5MQ_14439__000001_CV364AE,OPT,42 Sheep Street,Shipston On Stour,Warwickshire,,,CV36 4AE,Tel: 01608 661649, - ,,,No ratings yet Rate it yourself - /Services/opticians/LeaveReview/DefaultView.aspx?id=OP_5MQ_14439__000001_CV364AE,0,0,
Boots-Oxford - Mayfield House,OP_5DW_2231__000001_OX27DE,OPT,1 Mayfield House,256 Banbury Road,Summertime,Oxford,,OX2 7DE,Tel: 01865 558 951, - ,,,No ratings yet Rate it yourself - /Services/opticians/LeaveReview/DefaultView.aspx?id=OP_5DW_2231__000001_OX27DE,0,0,
Ideal Eyes,IDEALEYES1,OPT,,217 Banbury Road,Summertown,Oxford,,OX2 7HQ,Tel: 01865 302288, - ,,,No ratings yet Rate it yourself - /Services/opticians/LeaveReview/DefaultView.aspx?id=IDEALEYES1,0,0,
Ideal Eyes,OP_5DW_12641__000001_OP_5DW_12641,OPT,76 West Way,Botley,,Oxford,,OX2 9JT,Tel: 01865 244699, - ,,,No ratings yet Rate it yourself - /Services/opticians/LeaveReview/DefaultView.aspx?id=OP_5DW_12641__000001_OP_5DW_12641,0,0,
David Spicer Opticians,OP_5DW_8831__000001_OX29LG,OPT,1 Elms Parade,Botley,,Oxford,Oxfordshire,OX2 9LG,Tel: 01865 241142, - ,,,1 rating Rate it yourself - /Services/opticians/LeaveReview/DefaultView.aspx?id=OP_5DW_8831__000001_OX29LG,,,
Dray's Eyecare,OLCO30425QE__000002_OX169YJ,OPT,,81 Chatsworth Drive,Cherwell Heights,Banbury,Oxfordshire,OX16 9YJ,Tel: 01295 261080, - ,,,5 ratings Rate it yourself - /Services/opticians/LeaveReview/DefaultView.aspx?id=OLCO30425QE__000002_OX169YJ,,,yes
Horton General Hospital,OP_5DV_3501__000001_OX169AL,OPT,Oxford Road,,Banbury,,,OX16 9AL,Tel: 01295 275500, - ,,,No ratings yet Rate it yourself - /Services/opticians/LeaveReview/DefaultView.aspx?id=OP_5DV_3501__000001_OX169AL,0,0,
Walford & Round,OP_5DV_3485__000001_OX165LA,OPT,47 High Street,,,Banbury,,OX16 5LA,Tel: 01295 262501, - ,,,No ratings yet Rate it yourself - /Services/opticians/LeaveReview/DefaultView.aspx?id=OP_5DV_3485__000001_OX165LA,0,0,
Peepers Opticians,OP_5DV_3830__000001_OX165ER,OPT,,54 High Street,,Banbury,Oxfordshire,OX16 5JJ,Tel: 01295 262219, - ,,,No ratings yet Rate it yourself - /Services/opticians/LeaveReview/DefaultView.aspx?id=OP_5DV_3830__000001_OX165ER,0,0,
Complete Eyecare,SPECSEXPRESS1,OPT,,13 High Street,,Banbury,Oxfordshire,OX16 5EE,Tel: 01295 262200, - ,,,No ratings yet Rate it yourself - /Services/opticians/LeaveReview/DefaultView.aspx?id=SPECSEXPRESS1,0,0,
Scrivens inc Melson Wingate,OP_5DT_10799__000001_OX165JJ,OPT,,5 High Street,,Banbury,Oxfordshire,OX16 5DZ,Tel: 01295 262 882, - ,,,No ratings yet Rate it yourself - /Services/opticians/LeaveReview/DefaultView.aspx?id=OP_5DT_10799__000001_OX165JJ,0,0,
S H Harrold Ltd,OP_5DV_118__000001_OX165JE,OPT,92 High Street,,,Banbury,,OX16 5JE,Tel: 01295 266326, - ,,,No ratings yet Rate it yourself - /Services/opticians/LeaveReview/DefaultView.aspx?id=OP_5DV_118__000001_OX165JE,0,0,
Specsavers,SPECSAVERSBANBURY1,OPT,,29-31 Bridge Street,,Banbury,,OX16 5PN,Tel: 01295 251251, - ,,,No ratings yet Rate it yourself - /Services/opticians/LeaveReview/DefaultView.aspx?id=SPECSAVERSBANBURY1,0,0,
Vision Express,VISIONEXPRESSBANBURY1,OPT,,"Unit 8,  Castle Centre",,Banbury,,OX16 8UH,Tel: 01295 709006, - ,,,No ratings yet Rate it yourself - /Services/opticians/LeaveReview/DefaultView.aspx?id=VISIONEXPRESSBANBURY1,0,0,
Boots-Banbury,BOOTSOPTICIANBANBURY1,OPT,,19 Castle Quay,,Banbury,,OX16 5UH,Tel: 01295 262557, - ,,,No ratings yet Rate it yourself - /Services/opticians/LeaveReview/DefaultView.aspx?id=BOOTSOPTICIANBANBURY1,0,0,
Paul Conway ,OP_5DW_8773__000001_OX12AQ,OPT,,44 George Street,,Oxford,Oxfordshire,OX1 2AQ,Tel: 01865 244667, - ,,,No ratings yet Rate it yourself - /Services/opticians/LeaveReview/DefaultView.aspx?id=OP_5DW_8773__000001_OX12AQ,0,0,
Specsavers,OX1 3EY__000003_OX11NU,OPT,,33 Queen Street,,Oxford,Oxfordshire,OX1 1ER,Tel: 01865 255710, - ,,,No ratings yet Rate it yourself - /Services/opticians/LeaveReview/DefaultView.aspx?id=OX1 3EY__000003_OX11NU,0,0,
John Lewis Opticians,TP8JN,OPT,101 The Westgate,Queen Street,,Oxford,Oxfordshire,OX1 1PB,Tel: 01865 240172, - ,,,No ratings yet Rate it yourself - /Services/opticians/LeaveReview/DefaultView.aspx?id=TP8JN,0,0,
Boots Opticians (Oxford),,OPT,,6-8 Cornmarket Street,,Oxford,,OX1 3HL,Tel: 01865246206, - ,,,N/A - Data not available,,,
M&S Opticians,,OPT,,13-18 Queen Street,,Oxford,Oxfordshire,OX1 1AB,Tel: 01865 419984, - ,,,N/A - Data not available,,,
David Clulow Opticians,TP3RL,OPT,,13 High Street,,Oxford,Oxfordshire,OX1 4DB,Tel: 01865 242058, - ,,,No ratings yet Rate it yourself - /Services/opticians/LeaveReview/DefaultView.aspx?id=TP3RL,0,0,
Vision Express,OP_5DW_12640__000001_OX11NU,OPT,,31-32 Queen Street,,Oxford,Oxfordshire,OX1 3ER,Tel: 01865 243567, - ,,,No ratings yet Rate it yourself - /Services/opticians/LeaveReview/DefaultView.aspx?id=OP_5DW_12640__000001_OX11NU,0,0,
M&S Opticians (Banbury),F7M6Y,OPT,,"M&S, Unit 11 Gateway Retail Park",Banbury,Oxfordshire,,OX16 3ER,Tel: 0129 523 4570, - ,,,No ratings yet Rate it yourself - /Services/opticians/LeaveReview/DefaultView.aspx?id=F7M6Y,0,0,
Optometry Department,OP_5DW_1905__000002_OX26HE,OPT,West Wing Lg1,John Radcliffe Hospital,Headington,Oxford,,OX3 9DU,Tel: 01865 234163, - ,,,No ratings yet Rate it yourself - /Services/opticians/LeaveReview/DefaultView.aspx?id=OP_5DW_1905__000002_OX26HE,0,0,
Dove & Conway Opticians,SM 009 / 4060 / 5QE,OPT,,100 Sheep Street,,Bicester,Oxfordshire,OX26 6LP,Tel: 01869 242740, - ,,,No ratings yet Rate it yourself - /Services/opticians/LeaveReview/DefaultView.aspx?id=SM 009 / 4060 / 5QE,0,0,
Robert Stanley Opticians,ROBERTSTANLEYOPTICIANS1,OPT,,Unit EY4 Pioneer Square,Bure Place,Bicester,Oxfordshire,OX26 6FA,Tel: 01869 360557, - ,,,No ratings yet Rate it yourself - /Services/opticians/LeaveReview/DefaultView.aspx?id=ROBERTSTANLEYOPTICIANS1,0,0,
Vision Express,VISIONEXPRESSBICESTER1,OPT,,47 Sheep Street,,Bicester,,OX26 6JJ,Tel: 01869 327035, - ,,,No ratings yet Rate it yourself - /Services/opticians/LeaveReview/DefaultView.aspx?id=VISIONEXPRESSBICESTER1,0,0,
Greys Opticians,5KY 20001__000002_GL556AT,OPT,,"Drury House, The Square",High Street,Chipping Campden,Gloucestershire,GL55 6AL,Tel: 01386 848884, - ,,,No ratings yet Rate it yourself - /Services/opticians/LeaveReview/DefaultView.aspx?id=5KY 20001__000002_GL556AT,0,0,
Boots-Bicester,OP_5DT_1929__000003_OX67HY,OPT,,Unit 6 Crown Walk,,Bicester,Oxfordshire,OX26 6HY,Tel: 01869 320027, - ,,,1 rating Rate it yourself - /Services/opticians/LeaveReview/DefaultView.aspx?id=OP_5DT_1929__000003_OX67HY,,,
Specsavers Opticians,OP_5DT_11808__000001_OX67HY,OPT,,26 Sheep Street,,Bicester,Oxfordshire,OX26 6JF,Tel: 01869 321422, - ,,,No ratings yet Rate it yourself - /Services/opticians/LeaveReview/DefaultView.aspx?id=OP_5DT_11808__000001_OX67HY,0,0,yes
Scrivens ,OP_5DT_9615__000001_OX266JF,OPT,Scrivens Opticians and Hearing Care,21 Sheep Street,,Bicester,Oxfordshire,OX26 6JF,Tel: 01869 253577, - ,,,No ratings yet Rate it yourself - /Services/opticians/LeaveReview/DefaultView.aspx?id=OP_5DT_9615__000001_OX266JF,0,0,
Gardiners Opticians,OP_5DW_3921__000001_OX37RA,OPT,5 Manor Buildings,Osler Road,,Oxford,,OX3 7RA,Tel: 01865 761459, - ,,,No ratings yet Rate it yourself - /Services/opticians/LeaveReview/DefaultView.aspx?id=OP_5DW_3921__000001_OX37RA,0,0,
Robert Stanley Opticians,OP_5DW_3703__000001_OX39HZ,OPT,137 London Road,Headington,,Oxford,,OX3 9HZ,Tel: 01865 766488, - ,,,3 ratings Rate it yourself - /Services/opticians/LeaveReview/DefaultView.aspx?id=OP_5DW_3703__000001_OX39HZ,,,
Haine & Smith Opticians,OP_5DY_13238__000001_SN77HH,OPT,,7 Cornmarket,,Faringdon,,SN7 7HH,Tel: 01367 242262, - ,,,No ratings yet Rate it yourself - /Services/opticians/LeaveReview/DefaultView.aspx?id=OP_5DY_13238__000001_SN77HH,0,0,
Fairford Opticians,5KY 20004__000002_GL74AD,OPT,11 High Street,,Fairford,Gloucestershire,,GL7 4AD,Tel: 01285 713313, - ,,,No ratings yet Rate it yourself - /Services/opticians/LeaveReview/DefaultView.aspx?id=5KY 20004__000002_GL74AD,0,0,
Specsavers Opticians,OP_5DW_212__000001_OX43YA,OPT,119 Pound Way,Cowley,,Oxford,,OX4 3YA,Tel: 01865 773344, - ,,,9 ratings Rate it yourself - /Services/opticians/LeaveReview/DefaultView.aspx?id=OP_5DW_212__000001_OX43YA,,,
Ideal Eyes ,OP_5DW_11455__000001_OX43XH,OPT,,130-131 Pound Way,Cowley,Oxford,Oxfordshire,OX4 3XH,Tel: 01865 749877, - ,,,No ratings yet Rate it yourself - /Services/opticians/LeaveReview/DefaultView.aspx?id=OP_5DW_11455__000001_OX43XH,0,0,
Specsavers Opticians,TP98L,OPT,Sainsbury's,Heyford Hill,Littlemore,Oxford,Oxfordshire,OX4 4XR,Tel: 01865 712 500, - ,,,13 ratings Rate it yourself - /Services/opticians/LeaveReview/DefaultView.aspx?id=TP98L,,,
Chris Cheshire Opticians,0000001__000001_WR127AA,OPT,17 The Green,High Street,,Broadway,Worcestershire,WR12 7AA,Tel: 01386 859109, - ,,,No ratings yet Rate it yourself - /Services/opticians/LeaveReview/DefaultView.aspx?id=0000001__000001_WR127AA,0,0,
Vision Express,TESCOABINGDON1,OPT,Tesco Express,Marcham Road,,Abingdon,Oxfordshire,OX14 1TU,Tel: 0121 519 1181, - ,,,No ratings yet Rate it yourself - /Services/opticians/LeaveReview/DefaultView.aspx?id=TESCOABINGDON1,0,0,
Specsavers Opticians,OP_5DY_11818__000001_OX141JZ,OPT,Unit 16,Abbey Shopping Centre,,Abingdon,,OX14 3QT,Tel: 01235 530530, - ,,,2 ratings Rate it yourself - /Services/opticians/LeaveReview/DefaultView.aspx?id=OP_5DY_11818__000001_OX141JZ,,,
Boots Opticians,TP4MA,OPT,,Unit 10,Abbey Shopping Centre,Abingdon,Oxfordshire,OX14 3QX,Tel: 01235 520809, - ,,,3 ratings Rate it yourself - /Services/opticians/LeaveReview/DefaultView.aspx?id=TP4MA,,,
Robert Stanley Opticians,OP_5DY_2075__000002_OX143JF,OPT,23 Stert Street,,,Abingdon,,OX14 3JF,Tel: 01235 520849, - ,,,No ratings yet Rate it yourself - /Services/opticians/LeaveReview/DefaultView.aspx?id=OP_5DY_2075__000002_OX143JF,0,0,
Paul Conway,OP_5DY_1044__000001_OX145BB,OPT,,21 High Street,,Abingdon,Oxfordshire,OX14 5BB,Tel: 01235 528032, - ,,,No ratings yet Rate it yourself - /Services/opticians/LeaveReview/DefaultView.aspx?id=OP_5DY_1044__000001_OX145BB,0,0,
Abingdon Eye Centre,ABINGDONEYECENTRE1,OPT,,"Unit 3, Bury Street Shopping Centre",,Abingdon,Oxfordshire,OX14 3QY,Tel: 01235 533328, - ,,,1 rating Rate it yourself - /Services/opticians/LeaveReview/DefaultView.aspx?id=ABINGDONEYECENTRE1,,,
Scrivens inc. Russell Caulton,OP_5DY_5772__000002_OX143HA,OPT,,6 Bury Street,,Abingdon,Oxfordshire,OX14 3QY,Tel: 01235 523217, - ,,,No ratings yet Rate it yourself - /Services/opticians/LeaveReview/DefaultView.aspx?id=OP_5DY_5772__000002_OX143HA,0,0,
Walford & Round Opticians,OP_5DV_4565__000001_NN136AU,OPT,4 Banbury Road,,Brackley,,,NN13 6AU,Tel: 01280 702338, - ,,,No ratings yet Rate it yourself - /Services/opticians/LeaveReview/DefaultView.aspx?id=OP_5DV_4565__000001_NN136AU,0,0,
Kineton Optometrists,OP_5MQ_8887__000001_CV350JZ,OPT,The Bank House,Banbury Street,Kineton,Warwick,Warwickshire,CV35 0JS,Tel: 01926 641093, - ,,,No ratings yet Rate it yourself - /Services/opticians/LeaveReview/DefaultView.aspx?id=OP_5MQ_8887__000001_CV350JZ,0,0,
Cotswold Eye Care Centre,OP_5KW_6379__000002_GL545LJ,OPT,High Street,,Winchcombe,Gloucestershire,Gloucestershire,GL54 5LJ,Tel: 01242 604654, - ,,,1 rating Rate it yourself - /Services/opticians/LeaveReview/DefaultView.aspx?id=OP_5KW_6379__000002_GL545LJ,,,
Watchfield Opticians,TP44Y,OPT,,2 Majors Road,,Swindon,,SN6 8TQ,, - ,,,2 ratings Rate it yourself - /Services/opticians/LeaveReview/DefaultView.aspx?id=TP44Y,,,
Haine & Smith Opticians,OP_5K3_3933__000002_SN67AG,OPT,22 High Street,Highworth,,Wiltshire,,SN6 7AG,Tel: 01793 762204, - ,,,No ratings yet Rate it yourself - /Services/opticians/LeaveReview/DefaultView.aspx?id=OP_5K3_3933__000002_SN67AG,0,0,
Boots-Wantage,BOOTSOPTICIANSWANTAGE1,OPT,Unit 3A Kings Walk,,,Wantage,Oxfordshire,OX12 9AJ,Tel: 01235 768177, - ,,,No ratings yet Rate it yourself - /Services/opticians/LeaveReview/DefaultView.aspx?id=BOOTSOPTICIANSWANTAGE1,0,0,
Specsavers Opticians,TP2HJ,OPT,,1A Grove Street,,Wantage,Oxfordshire,OX12 7AB,Tel: 01235 773980, - ,,,No ratings yet Rate it yourself - /Services/opticians/LeaveReview/DefaultView.aspx?id=TP2HJ,0,0,
Campbells Opticians,OP_5DY_2985__000002_OX128BU,OPT,,34 Market Place,,Wantage,Oxfordshire,OX12 8AH,Tel: 01235 763312, - ,,,No ratings yet Rate it yourself - /Services/opticians/LeaveReview/DefaultView.aspx?id=OP_5DY_2985__000002_OX128BU,0,0,
Andrew Rhys Evans (Optometrists),OP_5K4_273__000001_SN66DF,OPT,82 High Street,,Cricklade,,,SN6 6DF,Tel: 01793 750415, - ,,,No ratings yet Rate it yourself - /Services/opticians/LeaveReview/DefaultView.aspx?id=OP_5K4_273__000001_SN66DF,0,0,
Walford & Round,OP_5MQ_9501__000001_CV376EF,OPT,25 Sheep Street,,Stratford-upon-Avon,,,CV37 6EF,Tel: 01789 205941, - ,,,No ratings yet Rate it yourself - /Services/opticians/LeaveReview/DefaultView.aspx?id=OP_5MQ_9501__000001_CV376EF,0,0,
Greys Opticians,OP_5MQ_6922__000002_CV376LF,OPT,,11 Chapel Street,,Stratford-upon-Avon,Warwickshire,CV37 6EP,Tel: 01789 266941, - ,,,No ratings yet Rate it yourself - /Services/opticians/LeaveReview/DefaultView.aspx?id=OP_5MQ_6922__000002_CV376LF,0,0,
Zeiss Opticians,OP_5MQ_4968__000001_CV376EP,OPT,5a Chapel Street,,Stratford-upon-Avon,,,CV37 6EP,Tel: 01789 269555, - ,,,No ratings yet Rate it yourself - /Services/opticians/LeaveReview/DefaultView.aspx?id=OP_5MQ_4968__000001_CV376EP,0,0,
CGOptical,OP_5MQ_11227__000001_CV376LN,OPT,57 Ely Street,,Stratford-upon-Avon,Stratford-upon-Avon,,CV37 6LN,Tel: 01789 268828, - ,,,No ratings yet Rate it yourself - /Services/opticians/LeaveReview/DefaultView.aspx?id=OP_5MQ_11227__000001_CV376LN,0,0,
Specsavers Opticians,OP_5MQ_1955__000001_CV376JE,OPT,8 Wood Street,,Stratford-upon-Avon,,,CV37 6JE,Tel: 01789 262606, - ,,,1 rating Rate it yourself - /Services/opticians/LeaveReview/DefaultView.aspx?id=OP_5MQ_1955__000001_CV376JE,,,
Vision Express,OP - 5PM__000002_CV376JE,OPT,2 Wood Street,,Stratford-upon-Avon,Warwickshire,,CV37 6JE,Tel: 01789 290007, - ,,,1 rating Rate it yourself - /Services/opticians/LeaveReview/DefaultView.aspx?id=OP - 5PM__000002_CV376JE,,,
"Tesco’s Opticians, Cirencester",OP_GL71NP_30718,OPT,,"Kings Meadow, Cricklade Road",,Cirencester,,GL7 1NP,Tel: 0345 601 3479, - ,,,No ratings yet Rate it yourself - /Services/opticians/LeaveReview/DefaultView.aspx?id=OP_GL71NP_30718,0,0,
Boots-Stratford Upon-Avon,OP_5MQ_2401__000002_CV376JG,OPT,36 Wood Street,,,Stratford Upon Avon,Warwickshire,CV37 6JG,Tel: 01789 292161, - ,,,No ratings yet Rate it yourself - /Services/opticians/LeaveReview/DefaultView.aspx?id=OP_5MQ_2401__000002_CV376JG,0,0,
Leightons Opticians & Hearing Care,OP_5KY_11919__000001_GL72PP,OPT,,Merchants House,39-41 Dyer Street,Cirencester,Gloucestershire,GL7 2PP,Tel: 01285 651 344, - ,,,No ratings yet Rate it yourself - /Services/opticians/LeaveReview/DefaultView.aspx?id=OP_5KY_11919__000001_GL72PP,0,0,
Philip Kersey & Partners,OP_5KY_7259__000003_GL72PF,OPT,56 Dyer Street,,Cirencester,Gloucestershire,,GL7 2PF,Tel: 01285 641999, - ,,,1 rating Rate it yourself - /Services/opticians/LeaveReview/DefaultView.aspx?id=OP_5KY_7259__000003_GL72PF,,,
Boots-Cirencester,OP_5KY_1665__000001_GL71JH,OPT,42 Cricklade Street,,Cirencester,Gloucestershire,,GL7 1JH,Tel: 01285 654579, - ,,,No ratings yet Rate it yourself - /Services/opticians/LeaveReview/DefaultView.aspx?id=OP_5KY_1665__000001_GL71JH,0,0,
Haine & Smith Opticians,OP_5KY_2823__000002_GL71JH,OPT,,6c Cricklade Street,,Cirencester,Gloucestershire,GL7 1JH,Tel: 01285 651161, - ,,,No ratings yet Rate it yourself - /Services/opticians/LeaveReview/DefaultView.aspx?id=OP_5KY_2823__000002_GL71JH,0,0,
Specsavers Opticians,5KY 20003__000003_GL71JH,OPT,"30, Cricklade Street",,Cirencester,Gloucestershire,,GL7 1JH,Tel: 01285 648610, - ,,,No ratings yet Rate it yourself - /Services/opticians/LeaveReview/DefaultView.aspx?id=5KY 20003__000003_GL71JH,0,0,
R J Holmes Opticians ,OP_5KY_1317__000001_GL71QA,OPT,6 Castle Street,,Cirencester,Gloucestershire,,GL7 1QA,Tel: 01285 650136, - ,,,No ratings yet Rate it yourself - /Services/opticians/LeaveReview/DefaultView.aspx?id=OP_5KY_1317__000001_GL71QA,0,0,
Scrivens,OP_5DY_11103__000001_OX118RN,OPT,,182 The Broadway,,Didcot,Oxfordshire,OX11 8RN,Tel: 01235 813305, - ,,,No ratings yet Rate it yourself - /Services/opticians/LeaveReview/DefaultView.aspx?id=OP_5DY_11103__000001_OX118RN,0,0,
Boots-Didcot,OP_5DY_11588__000001_OX118RJ,OPT,,48 Orchard Street,,Didcot,Oxfordshire,OX11 7LG,Tel: 01235 812241, - ,,,No ratings yet Rate it yourself - /Services/opticians/LeaveReview/DefaultView.aspx?id=OP_5DY_11588__000001_OX118RJ,0,0,
Specsavers,SPECSAVERSDIDCOT1,OPT,,17 Orchard Street,,Didcot,,OX11 7LG,Tel: 01235 517100, - ,,,No ratings yet Rate it yourself - /Services/opticians/LeaveReview/DefaultView.aspx?id=SPECSAVERSDIDCOT1,0,0,
Glasses Direct,OP5M2_148__000001_SN169RU,OPT,Unit 3 Gemini House,Groundwell Industrial Estate,Swindon,Wiltshire,,SN25 5AJ,Tel: 08456 882020, - ,,,3 ratings Rate it yourself - /Services/opticians/LeaveReview/DefaultView.aspx?id=OP5M2_148__000001_SN169RU,,,
Boots-Evesham,OP_5MT_10560__000002_WR114RR,OPT,22 Bridge Street,,,Evesham,Worcestershire,WR11 4RR,Tel: 01386 446 176, - ,,,No ratings yet Rate it yourself - /Services/opticians/LeaveReview/DefaultView.aspx?id=OP_5MT_10560__000002_WR114RR,0,0,
Specsavers Opticians,00000062__000002_WR114SQ,OPT,24 Bridge Street,,,Evesham,Worcestershire,WR11 4RR,Tel: 01386 423301, - ,,,397 ratings Rate it yourself - /Services/opticians/LeaveReview/DefaultView.aspx?id=00000062__000002_WR114SQ,,,
Osbornes of Evesham,00000060__000001_WR114PA,OPT,Cross Keys House,1-3 Swan Lane,,Evesham,Worcestershire,WR11 4PA,Tel: 01386 47997, - ,,,No ratings yet Rate it yourself - /Services/opticians/LeaveReview/DefaultView.aspx?id=00000060__000001_WR114PA,0,0,
Guilford & Carter Optometrists,OP_5KW_3199__000002_GL524LR,OPT,21 Church Road,Bishop's Cleeve,Cheltenham,Gloucestershire,Gloucestershire,GL52 8LR,Tel: 01242 675964, - ,,,2 ratings Rate it yourself - /Services/opticians/LeaveReview/DefaultView.aspx?id=OP_5KW_3199__000002_GL524LR,,,yes
Cheltenham General Hospital,OP_5KW_1846__000001_GL537AN,OPT,Department Of Optometry,Sandford Road,Cheltenham,Gloucestershire,,GL53 7AN,Tel: 08454 223 203, - ,,,No ratings yet Rate it yourself - /Services/opticians/LeaveReview/DefaultView.aspx?id=OP_5KW_1846__000001_GL537AN,0,0,
ASDA Vision Centre,OP_5K3_14300__000002_SN254BG,OPT,North Swindon District Centre,Thamesdown Drive,,Swindon,,SN25 4BG,Tel: 01793 707882, - ,,,1 rating Rate it yourself - /Services/opticians/LeaveReview/DefaultView.aspx?id=OP_5K3_14300__000002_SN254BG,,,
Boots-Cheltenham - High St,OP_5KW_8341__000002_GL501DB,OPT,197-199 High Street,,,Cheltenham,Gloucestershire,GL50 1DB,Tel: 01242 580730, - ,,,No ratings yet Rate it yourself - /Services/opticians/LeaveReview/DefaultView.aspx?id=OP_5KW_8341__000002_GL501DB,0,0,
Vision Express ,OP_5KW_12700__000001_GL501DQ,OPT,188 High Street,,Cheltenham,Gloucestershire,,GL50 1EP,Tel: 01242 238777, - ,,,No ratings yet Rate it yourself - /Services/opticians/LeaveReview/DefaultView.aspx?id=OP_5KW_12700__000001_GL501DQ,0,0,
Boots-Cheltenham - Regent Arcade,OP_5KW_3677__000001_GL501JZ,OPT,"Unit 40, Regent Arcade",Regent Street,Cheltenham,Gloucestershire,,GL50 1JZ,Tel: 01242 577811, - ,,,No ratings yet Rate it yourself - /Services/opticians/LeaveReview/DefaultView.aspx?id=OP_5KW_3677__000001_GL501JZ,0,0,