Organisation Name,NACS Code,Organisation Type,Address1,Address2,Address3,Address4,Address5,PostCode,Telephone Number,Opening time,Value  (Opening time),Banding Classification  (Opening time),NHS.UK users rating,Value  (NHS.UK users rating),Banding Classification  (NHS.UK users rating),Car parking (Is there car parking at this organisation?)
Tesco Opticians,OP _5D8__000002_NE297UJ,OPT,North Shields Extra,Chirton,,North Shields,,NE29 7UJ,Tel: 0345 677 9513, - ,,,No ratings yet Rate it yourself - /Services/opticians/LeaveReview/DefaultView.aspx?id=OP _5D8__000002_NE297UJ,0,0,
N & J Robinson Optometrists,OP_5D8_3792__000001_NE258DP,OPT,64 Front Street,Monkseaton,Whitley Bay,Tyne and Wear,,NE25 8DP,Tel: 0191 251 6102, - ,,,No ratings yet Rate it yourself - /Services/opticians/LeaveReview/DefaultView.aspx?id=OP_5D8_3792__000001_NE258DP,0,0,
Eyeworks Optical Limited,TP58Q,OPT,,"Unit 3, 38 Hepscott Drive, Beaumont Park",,Whitley Bay,,NE25 9XJ,, - ,,,No ratings yet Rate it yourself - /Services/opticians/LeaveReview/DefaultView.aspx?id=TP58Q,0,0,
Advanced Vision,OP_5D8_14190__000001_NE262TP,OPT,15 Park View,,Whitley Bay,Tyne and Wear,,NE26 2TP,Tel: 0191 252 1442, - ,,,No ratings yet Rate it yourself - /Services/opticians/LeaveReview/DefaultView.aspx?id=OP_5D8_14190__000001_NE262TP,0,0,
J A Hicks,OP_5D8_2606__000001_NE290AZ,OPT,25 Nile Street,,North Shields,Tyne and Wear,,NE29 0AZ,Tel: 0191 257 1093, - ,,,No ratings yet Rate it yourself - /Services/opticians/LeaveReview/DefaultView.aspx?id=OP_5D8_2606__000001_NE290AZ,0,0,yes
Roger Pickard Optometrist,OP_5D8_4705__000001_NE263ND,OPT,,11 Ilfracombe Gardens,,Whitley Bay,Tyne and Wear,NE26 3ND,Tel: 0191 252 8975, - ,,,1 rating Rate it yourself - /Services/opticians/LeaveReview/DefaultView.aspx?id=OP_5D8_4705__000001_NE263ND,,,yes
Gillie & Partners,OP_5D8_5644__000001_NE301QP,OPT,5 Northumberland Place,,North Shields,Tyne and Wear,,NE30 1QP,Tel: 0191 257 0733, - ,,,No ratings yet Rate it yourself - /Services/opticians/LeaveReview/DefaultView.aspx?id=OP_5D8_5644__000001_NE301QP,0,0,
Thompson Opticians Ltd,OP_5D8^01__000001_NE289PA,OPT,,Coastway Shopping Centre,Battle Hill Drive,Wallsend,Tyne and Wear,NE28 9PA,Tel: 0191 2638411, - ,,,No ratings yet Rate it yourself - /Services/opticians/LeaveReview/DefaultView.aspx?id=OP_5D8^01__000001_NE289PA,0,0,
Boots-Whitley Bay,OP_5D8_1456__000001_NE262TA,OPT,190 Whitley Road,,,Whitley Bay,Tyne and Wear,NE26 2TA,Tel: 0191 252 2525, - ,,,No ratings yet Rate it yourself - /Services/opticians/LeaveReview/DefaultView.aspx?id=OP_5D8_1456__000001_NE262TA,0,0,
Steel & Varley (WR),OP_5D8_289__000003_NE262SY,OPT,209-211 Whitley Road,,Whitley Bay,Tyne and Wear,,NE26 2SY,Tel: 0191 252 3549, - ,,,No ratings yet Rate it yourself - /Services/opticians/LeaveReview/DefaultView.aspx?id=OP_5D8_289__000003_NE262SY,0,0,
Specsavers North Shields,OP_5D8_14188__000001_NE296QA,OPT,35 Bedford Street,The Beacon Shopping Centre,North Shields,Tyne and Wear,,NE29 6QA,Tel: 0191 258 8220, - ,,,2 ratings Rate it yourself - /Services/opticians/LeaveReview/DefaultView.aspx?id=OP_5D8_14188__000001_NE296QA,,,
Thompson Opticians Ltd,OP_5D8_4476__000001_NE280LQ,OPT,78 Tynemouth Road,,Howdon,Wallsend,Tyne and Wear,NE28 0LQ,Tel: 0191 262 4302, - ,,,No ratings yet Rate it yourself - /Services/opticians/LeaveReview/DefaultView.aspx?id=OP_5D8_4476__000001_NE280LQ,0,0,
Asda Opticians,OPT_NE12 9SJ,OPT,,WHITLEY ROAD,,BENTON,,NE12 9SJ,Tel: 0191 2705720, - ,,,No ratings yet Rate it yourself - /Services/opticians/LeaveReview/DefaultView.aspx?id=OPT_NE12 9SJ,0,0,
Outlook Optical Benton Limited,OP_5D8__000001_NE129SZ,OPT,20 North Tyne Industrial Estate,Whitley Road,Benton,Newcastle Upon Tyne,,NE12 9SZ,Tel: 0191 266 6924, - ,,,No ratings yet Rate it yourself - /Services/opticians/LeaveReview/DefaultView.aspx?id=OP_5D8__000001_NE129SZ,0,0,
Advanced Vision ,OP_5D8_1498__000001_NE290BD,OPT,,7 Percy Park Road,Tynemouth,North Shields,,NE30 4LZ,Tel: 0191 257 0856, - ,,,No ratings yet Rate it yourself - /Services/opticians/LeaveReview/DefaultView.aspx?id=OP_5D8_1498__000001_NE290BD,0,0,
 Concept Eye Clinic,OPL/01-32579/5D7,OPT,,25 Front Street,Tynemouth,North Shields,,NE30 4DX,Tel: 0191 296 6124, - ,,,No ratings yet Rate it yourself - /Services/opticians/LeaveReview/DefaultView.aspx?id=OPL/01-32579/5D7,0,0,
South Shields Vision Express,OP_5KG_124__000001_NE331JE,OPT,,90-94 King Street,,South Shields,Tyne and Wear,NE33 1JE,Tel: 0191 454 1323, - ,,,No ratings yet Rate it yourself - /Services/opticians/LeaveReview/DefaultView.aspx?id=OP_5KG_124__000001_NE331JE,0,0,
Specsavers Opticians,OP_5KG_3225__000002_NE331DA,OPT,17-19 King Street,,South Shields,Tyne and Wear,,NE33 1DA,Tel: 0191 427 7272, - ,,,No ratings yet Rate it yourself - /Services/opticians/LeaveReview/DefaultView.aspx?id=OP_5KG_3225__000002_NE331DA,0,0,
Thompson Opticians Ltd,OP_5D8_6424__000001_NE288PF,OPT,,33-35 High Street East,,Wallsend,Tyne and Wear,NE28 8PF,Tel: 01665 600195, - ,,,No ratings yet Rate it yourself - /Services/opticians/LeaveReview/DefaultView.aspx?id=OP_5D8_6424__000001_NE288PF,0,0,
J S Lowry ,OP_5KG_3587__000001_NE323JA,OPT,9 Grange Road West,,Jarrow,Tyne and Wear,,NE32 3JA,Tel: 0191 489 7822, - ,,,1 rating Rate it yourself - /Services/opticians/LeaveReview/DefaultView.aspx?id=OP_5KG_3587__000001_NE323JA,,,
Specsavers,OP_5D8_1836__000001_NE288JA,OPT,9 High Street West,,Wallsend,Tyne and Wear,,NE28 8JA,Tel: 0191 262 5550, - ,,,No ratings yet Rate it yourself - /Services/opticians/LeaveReview/DefaultView.aspx?id=OP_5D8_1836__000001_NE288JA,0,0,
Thompson Opticians,OP_5D8_5346__000001_NE129AD,OPT,20 Station Road North,,Forest Hall,Newcastle Upon Tyne,,NE12 9AD,Tel: 0191 266 2840, - ,,,No ratings yet Rate it yourself - /Services/opticians/LeaveReview/DefaultView.aspx?id=OP_5D8_5346__000001_NE129AD,0,0,
The People's Optician,NE32 3LQ,OPT,,12 The Viking Precinct,,Jarrow,,NE32 3LQ,, - ,,,No ratings yet Rate it yourself - /Services/opticians/LeaveReview/DefaultView.aspx?id=NE32 3LQ,0,0,
J T McGuinness,OP_5KG_4134__000001_NE334LS,OPT,33 Westoe Road,,South Shields,Tyne and Wear,,NE33 4LS,Tel: 0191 456 1552, - ,,,No ratings yet Rate it yourself - /Services/opticians/LeaveReview/DefaultView.aspx?id=OP_5KG_4134__000001_NE334LS,0,0,
Thompson Opticians Ltd,CO-1751,OPT,,1 Station Road,,Newcastle Upon Tyne,Tyne and Wear,NE12 7AR,Tel: 0191 2666449, - ,,,No ratings yet Rate it yourself - /Services/opticians/LeaveReview/DefaultView.aspx?id=CO-1751,0,0,
Specsavers Opticians (Killingworth),TP85D ,OPT,,"Unit 37, The Killingworth Centre",,"Killingworth, Newcastle Upon Tyne ",,NE12 6YT,, - ,,,2 ratings Rate it yourself - /Services/opticians/LeaveReview/DefaultView.aspx?id=TP85D ,,,
Stevens Optical Group,OP_5D8_13483__000002_NE126YT,OPT,Unit 22,The Killingworth Centre,Killingworth,Newcastle Upon Tyne,,NE12 6YT,Tel: 0191 268 1317, - ,,,No ratings yet Rate it yourself - /Services/opticians/LeaveReview/DefaultView.aspx?id=OP_5D8_13483__000002_NE126YT,0,0,
Four Lane Ends Opticians,OP_5D7_9143__000002_NE77EE,OPT,341 Benton Road,,Benton,Newcastle Upon Tyne,,NE7 7EE,Tel: 0191 266 3218, - ,,,No ratings yet Rate it yourself - /Services/opticians/LeaveReview/DefaultView.aspx?id=OP_5D7_9143__000002_NE77EE,0,0,
Hankinson Optometrists,OP_5KG_11346__000001_NE311LA,OPT,29 Station Road,,Hebburn,Tyne and Wear,,NE31 1LA,Tel: 0191 483 2524, - ,,,No ratings yet Rate it yourself - /Services/opticians/LeaveReview/DefaultView.aspx?id=OP_5KG_11346__000001_NE311LA,0,0,
Sidney Walton Opticians Ltd,OP_5KG^CO3313__000001_NE334QX,OPT,515 Stanhope Road,,South Shields,,,NE33 4QX,Tel: 0191 456 8872, - ,,,2 ratings Rate it yourself - /Services/opticians/LeaveReview/DefaultView.aspx?id=OP_5KG^CO3313__000001_NE334QX,,,
Optica Eye Clinic Ltd,OP_5D8_14191__000001_NE128GA,OPT,9b The Boulevard,West Farm Avenue,,Longbenton,,NE12 8GA,Tel: 0191 266 3339, - ,,,1 rating Rate it yourself - /Services/opticians/LeaveReview/DefaultView.aspx?id=OP_5D8_14191__000001_NE128GA,,,
B L Ainley,OP_5D7_2884__000002_NE63DH,OPT,19 Churchwalk Shopping Centre,,Walker,Newcastle Upon Tyne,,NE6 3DH,Tel: 0191 263 1570, - ,,,No ratings yet Rate it yourself - /Services/opticians/LeaveReview/DefaultView.aspx?id=OP_5D7_2884__000002_NE63DH,0,0,
Querido and Davidson,OP_5D7_9832__000001_NE65LN,OPT,,196 Chillingham Road,Heaton,Newcastle Upon Tyne,Tyne and Wear,NE6 5LN,Tel: 0191 265 9898, - ,,,1 rating Rate it yourself - /Services/opticians/LeaveReview/DefaultView.aspx?id=OP_5D7_9832__000001_NE65LN,,,
C D HALL OPTICIANS LTD,OP_5D7_6967__000001_NE62QX,OPT,,335 Welbeck Road,Walker,Newcastle Upon Tyne,Tyne and Wear,NE6 2QX,Tel: 0191 276 0274, - ,,,1 rating Rate it yourself - /Services/opticians/LeaveReview/DefaultView.aspx?id=OP_5D7_6967__000001_NE62QX,,,
Thompsons Opticians Ltd,OP_5KG_12050__000002_NE348PL,OPT,,201 Prince Edward Road,,South Shields,Tyne and Wear,NE34 8PL,Tel: 0191 427 9192, - ,,,No ratings yet Rate it yourself - /Services/opticians/LeaveReview/DefaultView.aspx?id=OP_5KG_12050__000002_NE348PL,0,0,
Specs 4 U,OP_5KG_13439__000001_NE346QY,OPT,"Unit 1, The Nook",252 Sunderland Road,South Shields,",",,NE34 6QY,Tel: 0191 454 3641, - ,,,No ratings yet Rate it yourself - /Services/opticians/LeaveReview/DefaultView.aspx?id=OP_5KG_13439__000001_NE346QY,0,0,
Richardsons Opticians,OPL/01-25420/5D9,OPT,,"233 Shields Road, Byker",,Newcastle Upon Tyne,,NE6 1DQ,, - ,,,No ratings yet Rate it yourself - /Services/opticians/LeaveReview/DefaultView.aspx?id=OPL/01-25420/5D9,0,0,
Tynedale Eye Clinic,OP_5D7_9071__000001_NE61DL,OPT,110 - 112 Shields Road,,Byker,Newcastle Upon Tyne,,NE6 1DS,Tel: 0191 276 0242, - ,,,2 ratings Rate it yourself - /Services/opticians/LeaveReview/DefaultView.aspx?id=OP_5D7_9071__000001_NE61DL,,,
Long & Pickard,OP_5D7_8704__000001_NE22DN,OPT,113 St Georges Terrace,,Jesmond,Newcastle Upon Tyne,,NE2 2DN,Tel: 0191 281 8810, - ,,,No ratings yet Rate it yourself - /Services/opticians/LeaveReview/DefaultView.aspx?id=OP_5D7_8704__000001_NE22DN,0,0,
Evans Opticians,OP_5D7_505__000001_NE22DJ,OPT,28 Acorn Road,,Jesmond,Newcastle Upon Tyne,,NE2 2DJ,Tel: 0191 281 4145, - ,,,2 ratings Rate it yourself - /Services/opticians/LeaveReview/DefaultView.aspx?id=OP_5D7_505__000001_NE22DJ,,,
The Big Optician,OP_5D7_14441__000001_NE61JX,OPT,Stephen Street,,Byker,Newcastle Upon Tyne,,NE6 1JX,Tel: 0191 224 4555, - ,,,No ratings yet Rate it yourself - /Services/opticians/LeaveReview/DefaultView.aspx?id=OP_5D7_14441__000001_NE61JX,0,0,
Sight Service,OP_5KF^0002__000002_NE84YL,OPT,Saltwell Road,The Bradbury Centre for Sight,Unit 2B Stonehills Business Centre,Gateshead,Tyne and Wear,NE10 0HW,Tel: 0191 478 5959, - ,,,1 rating Rate it yourself - /Services/opticians/LeaveReview/DefaultView.aspx?id=OP_5KF^0002__000002_NE84YL,,,
Mark English Opticians,OP_5D7_10908__000001_NE32HH,OPT,228 High Street,,Gosforth,Newcastle Upon Tyne,,NE3 1HH,Tel: 0191 285 5930, - ,,,No ratings yet Rate it yourself - /Services/opticians/LeaveReview/DefaultView.aspx?id=OP_5D7_10908__000001_NE32HH,0,0,
Concept Eye Clinic,OP_5D7_1182__000001_NE31HP,OPT,57 – 159 High Street,,,Newcastle Upon Tyne,,NE3 1HE,Tel: 0191 285 1603, - ,,,No ratings yet Rate it yourself - /Services/opticians/LeaveReview/DefaultView.aspx?id=OP_5D7_1182__000001_NE31HP,0,0,
Thompson Opticians Ltd,OP_5D7_11345__000002_NE31JZ,OPT,,25 Gosforth Centre,Gosforth,Newcastle Upon Tyne,Tyne and Wear,NE3 1JZ,Tel: 0191 284 2538, - ,,,No ratings yet Rate it yourself - /Services/opticians/LeaveReview/DefaultView.aspx?id=OP_5D7_11345__000002_NE31JZ,0,0,
Asda Opticians,OP_5KG 2058__000001_OP_5KG2058,OPT,North Road,,Boldon Colliery,Tyne and Wear,,NE35 9AR,Tel: 0191 537 7520, - ,,,No ratings yet Rate it yourself - /Services/opticians/LeaveReview/DefaultView.aspx?id=OP_5KG 2058__000001_OP_5KG2058,0,0,
A & G Marshall Optometrists Ltd,OP_TAC_4111__000001_NE236UT,OPT,,2-3 The Old Church,"Village Square, Cramlington",Cramlington,,NE23 1DN,Tel: 01670 730 577, - ,,,No ratings yet Rate it yourself - /Services/opticians/LeaveReview/DefaultView.aspx?id=OP_TAC_4111__000001_NE236UT,0,0,
Yarrow & Harvey Optometrists,OP_TAC_6960__000001_NE236QW,OPT,Dudley Lane,Cramlington,Northumberland,,,NE23 6US,Tel: 01670 715 747, - ,,,No ratings yet Rate it yourself - /Services/opticians/LeaveReview/DefaultView.aspx?id=OP_TAC_6960__000001_NE236QW,0,0,
Specsavers Opticians,OP_TAC_6451__000001_NE236SD,OPT,"Unit H, Manor Walk Shopping Centre",,Cramlington,Northumberland,,NE23 6SD,Tel: 01670 733 327, - ,,,No ratings yet Rate it yourself - /Services/opticians/LeaveReview/DefaultView.aspx?id=OP_TAC_6451__000001_NE236SD,0,0,
G T Harvey & Partners Ltd,OP_5D7_56__000001_NE18JE,OPT,9 Saville Row,,Newcastle Upon Tyne,,,NE1 8JE,Tel: 0191 232 7615, - ,,,28 ratings Rate it yourself - /Services/opticians/LeaveReview/DefaultView.aspx?id=OP_5D7_56__000001_NE18JE,,,
C4 Sightcare,OP_5D7_3395__000001_NE16JE,OPT,Northumberland House,Princess Square,,Newcastle Upon Tyne,,NE1 8ER,Tel: 0191 232 1002, - ,,,No ratings yet Rate it yourself - /Services/opticians/LeaveReview/DefaultView.aspx?id=OP_5D7_3395__000001_NE16JE,0,0,
King & Wood,OP_5D7_9414__000001_NE31HA,OPT,Records at Keyes Eyecare,1-3 Ashburton Road,Gosforth,Newcastle Upon Tyne,,NE3 4XN,Tel: 0191 2847361, - ,,,No ratings yet Rate it yourself - /Services/opticians/LeaveReview/DefaultView.aspx?id=OP_5D7_9414__000001_NE31HA,0,0,
Keyes Eyecare,OP_5D7_14439__000002_NE34XN,OPT,1-3 Ashburton Road,.,Gosforth,Newcastle Upon Tyne,,NE3 4XN,Tel: 0191 284 7361, - ,,,3 ratings Rate it yourself - /Services/opticians/LeaveReview/DefaultView.aspx?id=OP_5D7_14439__000002_NE34XN,,,
Vision Express UK Ltd,OP_5D7_3169__000001_NE17DE,OPT,2 Northumberland Street,,Newcastle Upon Tyne,,,NE1 7DE,Tel: 0191 261 7622, - ,,,No ratings yet Rate it yourself - /Services/opticians/LeaveReview/DefaultView.aspx?id=OP_5D7_3169__000001_NE17DE,0,0,
C4 Sightcare-RVI,OP_5D7_2534__000001_NE14LP,OPT,"Eye Department,Royal Victoria Infirmary","Claremont Wing,Queen Victoria Road",Newcastle Upon Tyne,,,NE1 4LP,Tel: 0191 221 0934, - ,,,1 rating Rate it yourself - /Services/opticians/LeaveReview/DefaultView.aspx?id=OP_5D7_2534__000001_NE14LP,,,
Specsavers Opticians,OP_5D7_1164__000001_NE17XG,OPT,10 Eldon Way,Eldon Square,,Newcastle Upon Tyne,Tyne and Wear,NE1 7XS,Tel: 0191 233 0077, - ,,,No ratings yet Rate it yourself - /Services/opticians/LeaveReview/DefaultView.aspx?id=OP_5D7_1164__000001_NE17XG,0,0,
F Robson & Co,OP_5D7_5123__000001_NE16QG,OPT,16 Pilgrim Street,,Newcastle Upon Tyne,,,NE1 6QG,Tel: 0191 232 1631, - ,,,No ratings yet Rate it yourself - /Services/opticians/LeaveReview/DefaultView.aspx?id=OP_5D7_5123__000001_NE16QG,0,0,
Boots-Newcastle Upon Tyne - Hotspur Way,OP_5D7_3240__000002_NE17XE,OPT,Hotspur Way,Eldon Square,,Newcastle Upon Tyne,Tyne and Wear,NE1 7XE,Tel: 0191 2612 475, - ,,,1 rating Rate it yourself - /Services/opticians/LeaveReview/DefaultView.aspx?id=OP_5D7_3240__000002_NE17XE,,,
Grey St. Opticians,OP_5D7^1975__000001_NE16EG,OPT,103 Grey Street,Central Exchange Buildings,Newcastle Upon Tyne,Newcastle Upon Tyne,,NE1 6EG,Tel: 0191 260 5450, - ,,,1 rating Rate it yourself - /Services/opticians/LeaveReview/DefaultView.aspx?id=OP_5D7^1975__000001_NE16EG,,,
Opticial Express,OP_12345_NE1 7XJ,OPT,18 Blackettbridge,intu Eldon Square,,Newcastle,Tyne and Wear,NE1 7XJ,Tel: 0800 023 2020, - ,,,No ratings yet Rate it yourself - /Services/opticians/LeaveReview/DefaultView.aspx?id=OP_12345_NE1 7XJ,0,0,
Thompson Opticians Ltd,OP_5KF_14364__000002_NE109PW,OPT,9 Crowhall Lane,Victoria Square,Felling,Gateshead,Tyne and Wear,NE10 9PW,Tel: 01665 600195, - ,,,No ratings yet Rate it yourself - /Services/opticians/LeaveReview/DefaultView.aspx?id=OP_5KF_14364__000002_NE109PW,0,0,
OP & TOM,01-19825 NE1 1EN ,OPT,,8A High Bridge,,Newcastle,,NE1 1EN,Tel: 0191 2611426, - ,,,No ratings yet Rate it yourself - /Services/opticians/LeaveReview/DefaultView.aspx?id=01-19825 NE1 1EN,0,0,
Northern Optical Company Limited,OP_5D7_9676__000001_NE15QG,OPT,1-4 Grainger Market,,Newcastle Upon Tyne,,,NE1 5QG,Tel: 0191 232 7284, - ,,,No ratings yet Rate it yourself - /Services/opticians/LeaveReview/DefaultView.aspx?id=OP_5D7_9676__000001_NE15QG,0,0,
Boots-Newcastle Upon Tyne - High Friars,OP_5D7_5387__000001_NE17XQ,OPT,23 High Friars,Eldon Square,,Newcastle-Upon-Tyne,Staffordshire,NE1 7XQ,Tel: 0191 232 6837, - ,,,No ratings yet Rate it yourself - /Services/opticians/LeaveReview/DefaultView.aspx?id=OP_5D7_5387__000001_NE17XQ,0,0,
The Optometric Centre Ltd,OP_5KF_3294__000001_NE81AS,OPT,225 High Street,,Gateshead,Tyne and Wear,,NE8 1AS,Tel: 0191 477 2389, - ,,,No ratings yet Rate it yourself - /Services/opticians/LeaveReview/DefaultView.aspx?id=OP_5KF_3294__000001_NE81AS,0,0,
J Wood,OP_5KF_3262__000001_NE109HJ,OPT,10 Morley Terrace,,Gateshead,Tyne and Wear,,NE10 9HJ,Tel: 0191 469 4641, - ,,,No ratings yet Rate it yourself - /Services/opticians/LeaveReview/DefaultView.aspx?id=OP_5KF_3262__000001_NE109HJ,0,0,
Opticial Express,OP_12345_NE1 1RF,OPT,5 St. Nicholas Street,,,Newcastle,Tyne and Wear,NE1 1RF,Tel: 0800 023 2020, - ,,,1 rating Rate it yourself - /Services/opticians/LeaveReview/DefaultView.aspx?id=OP_12345_NE1 1RF,,,
Tesco Opticians,NE8 1EP,OPT,,241 High Street,,Gateshead,,NE8 1EP,Tel: 0191 403 1838, - ,,,No ratings yet Rate it yourself - /Services/opticians/LeaveReview/DefaultView.aspx?id=NE8 1EP,0,0,
Thompson Opticians Ltd,OP_5KF_10653__000002_NE108XQ,OPT,6 Fewster Square,Leam Lane Estate,,Gateshead,Tyne and Wear,NE10 8XQ,Tel: 0191 469 3357, - ,,,No ratings yet Rate it yourself - /Services/opticians/LeaveReview/DefaultView.aspx?id=OP_5KF_10653__000002_NE108XQ,0,0,
Specsavers Opticians,OP _ 5KF__000002_NE81EE,OPT,37 Jackson Street,,Gateshead,Tyne and Wear,,NE8 1EE,Tel: 0191 478 8060, - ,,,No ratings yet Rate it yourself - /Services/opticians/LeaveReview/DefaultView.aspx?id=OP _ 5KF__000002_NE81EE,0,0,
Hampton Graves Eyecare,OP_5KF_8342__000001_NE81EH,OPT,,11 High West Street,Gateshead,Tyne and Wear,,NE8 1EH,Tel: 0191 477 1357, - ,,,No ratings yet Rate it yourself - /Services/opticians/LeaveReview/DefaultView.aspx?id=OP_5KF_8342__000001_NE81EH,0,0,yes
Mark English Optometrist,OP_TAC_7874__000001_NE242DR,OPT,46 Beaconsfield Street,,Blyth,Northumberland,,NE24 2DR,Tel: 01670 352 839, - ,,,No ratings yet Rate it yourself - /Services/opticians/LeaveReview/DefaultView.aspx?id=OP_TAC_7874__000001_NE242DR,0,0,
Thompson Optician,OP_TAC_4811__000001_NE242BU,OPT,14 Stanley Street,,Blyth,Northumberland,,NE24 2BU,Tel: 01670 353 646, - ,,,No ratings yet Rate it yourself - /Services/opticians/LeaveReview/DefaultView.aspx?id=OP_TAC_4811__000001_NE242BU,0,0,
D J Preston,OP_TAC_4294__000002_NE241BL,OPT,,6 Bridge Street,,Blyth,,NE24 1BL,Tel: 01670 353 819, - ,,,No ratings yet Rate it yourself - /Services/opticians/LeaveReview/DefaultView.aspx?id=OP_TAC_4294__000002_NE241BL,0,0,
Coatsworth Eye Clinic Limited,NE8 1SR,OPT,,209 Coatsworth Road,,Gateshead,,NE8 1SR,, - ,,,2 ratings Rate it yourself - /Services/opticians/LeaveReview/DefaultView.aspx?id=NE8 1SR,,,
Specs Galore Limited,OP_TAC^03__000001_NE241DP,OPT,7 Wanley Street,,Blyth,Northumberland,,NE24 1DP,Tel: 01670 365 073, - ,,,No ratings yet Rate it yourself - /Services/opticians/LeaveReview/DefaultView.aspx?id=OP_TAC^03__000001_NE241DP,0,0,
Specsavers Opticians,OP_TAC_7611__000001_NE241LQ,OPT,5 Regent Street,,Blyth,Northumberland,,NE24 1LQ,Tel: 01670 354 000, - ,,,No ratings yet Rate it yourself - /Services/opticians/LeaveReview/DefaultView.aspx?id=OP_TAC_7611__000001_NE241LQ,0,0,
D Rosenberg,OP_5KF_13441__000001_NE81RD,OPT,210/212 Rectory Road,,Gateshead,Tyne and Wear,,NE8 4RR,Tel: 0191 477 0454, - ,,,No ratings yet Rate it yourself - /Services/opticians/LeaveReview/DefaultView.aspx?id=OP_5KF_13441__000001_NE81RD,0,0,
Michael Offord Optometrist,OP_5D7_9544__000002_NE32FP,OPT,,7 Kingston Court,Kingston Park Avenue,Kingston Park,,NE3 2FP,Tel: 0191 271 2140, - ,,,5 ratings Rate it yourself - /Services/opticians/LeaveReview/DefaultView.aspx?id=OP_5D7_9544__000002_NE32FP,,,
Tesco Opticians,OP_5D7_5881__000003_NE32FP,OPT,Tesco Extra,2917 Kingston Park Centre,,Kingston Park,,NE3 2FP,Tel: 0845 601 3479, - ,,,16 ratings Rate it yourself - /Services/opticians/LeaveReview/DefaultView.aspx?id=OP_5D7_5881__000003_NE32FP,,,
D Berry Optometrist,OP_5KF_2315__000001_NE84TH,OPT,56 Saltwell Road,,Gateshead,Tyne and Wear,,NE8 4XE,Tel: 0191 477 2516, - ,,,3 ratings Rate it yourself - /Services/opticians/LeaveReview/DefaultView.aspx?id=OP_5KF_2315__000001_NE84TH,,,
Asda Opticians,OPT_NE24 4LZ,OPT,,COWPEN  ROAD,,BLYTH,,NE24 4LZ,Tel: 01670 719356, - ,,,No ratings yet Rate it yourself - /Services/opticians/LeaveReview/DefaultView.aspx?id=OPT_NE24 4LZ,0,0,
Spicker & Steen Ltd,OP_5D7_13482__000001_NE49PT,OPT,5 West Road,,Newcastle Upon Tyne,,,NE4 9PT,Tel: 0191 273 6014, - ,,,1 rating Rate it yourself - /Services/opticians/LeaveReview/DefaultView.aspx?id=OP_5D7_13482__000001_NE49PT,,,
Thompson Opticians Ltd,OP_5D7_11344__000002_NE49RX,OPT,265 Two Ball Lonnen,,Fenham,Newcastle Upon Tyne,Tyne and Wear,NE4 9RX,Tel: 0191 274 3863, - ,,,No ratings yet Rate it yourself - /Services/opticians/LeaveReview/DefaultView.aspx?id=OP_5D7_11344__000002_NE49RX,0,0,
Summers Opticians,OP_5KF_3030__000001_NE95AN,OPT,407 Durham Road,Low Fell,Gateshead,Tyne and Wear,,NE9 5AN,Tel: 0191 487 9464, - ,,,No ratings yet Rate it yourself - /Services/opticians/LeaveReview/DefaultView.aspx?id=OP_5KF_3030__000001_NE95AN,0,0,
Sight Direct Ltd,OP_NE95EY_30494,OPT,,509 Durham Road,Low Fell,Gateshead,,NE9 5EY,Tel: 0191 482 0834, - ,,,No ratings yet Rate it yourself - /Services/opticians/LeaveReview/DefaultView.aspx?id=OP_NE95EY_30494,0,0,
Thompson Opticians Ltd,OP_5D7_5876__000001_NE48BF,OPT,Unit 4 Adelaide Shopping Centre,Adelaide Terrace,Benwell,Newcastle Upon Tyne,Tyne and Wear,NE4 8BE,Tel: 0191 273 2663, - ,,,No ratings yet Rate it yourself - /Services/opticians/LeaveReview/DefaultView.aspx?id=OP_5D7_5876__000001_NE48BF,0,0,
Wrekenton Eye Centre Ltd,OP_5KF_13443__000001_NE97JR,OPT,159 High Street,Wrekenton,Gateshead,Tyne and Wear,,NE9 7JR,Tel: 0191 487 3269, - ,,,1 rating Rate it yourself - /Services/opticians/LeaveReview/DefaultView.aspx?id=OP_5KF_13443__000001_NE97JR,,,
See Optical Company LLP,OP_5KL^1__000001_SR69AA,OPT,9 Station Road,Fulwell,Sunderland,,,SR6 9AA,Tel: 0191 549 9998, - ,,,No ratings yet Rate it yourself - /Services/opticians/LeaveReview/DefaultView.aspx?id=OP_5KL^1__000001_SR69AA,0,0,
Buckingham & Hickson,OP_5KL_1577__000001_SR69AP,OPT,290 Fulwell Road,Fulwell,Sunderland,,,SR6 9AP,Tel: 0191 548 5015, - ,,,No ratings yet Rate it yourself - /Services/opticians/LeaveReview/DefaultView.aspx?id=OP_5KL_1577__000001_SR69AP,0,0,
Asda Opticians,OPT_NE11 97A,OPT,,GIBSIDE WAY,,GATESHEAD,,NE11 9TA,Tel: 0191 4619514, - ,,,No ratings yet Rate it yourself - /Services/opticians/LeaveReview/DefaultView.aspx?id=OPT_NE11 97A,0,0,
J E Dickinson,OP_5KL_792__000001_NE372BN,OPT,7 Front Street,Concord,Washington,,,NE37 2BN,Tel: 0191 416 2730, - ,,,No ratings yet Rate it yourself - /Services/opticians/LeaveReview/DefaultView.aspx?id=OP_5KL_792__000001_NE372BN,0,0,
Diane J Raymond,OP^TAC^02__000001_NE225AU,OPT,78 Front Street West,Bedlington,Northumberland,,,NE22 5AU,Tel: 01670 823 347, - ,,,No ratings yet Rate it yourself - /Services/opticians/LeaveReview/DefaultView.aspx?id=OP^TAC^02__000001_NE225AU,0,0,
Doyles Opticians,OP_5KL_7390__000001_SR52AB,OPT,297 Southwick Road,Southwick,Sunderland,,,SR5 2AB,Tel: 0191 548 4258, - ,,,No ratings yet Rate it yourself - /Services/opticians/LeaveReview/DefaultView.aspx?id=OP_5KL_7390__000001_SR52AB,0,0,
Costco Wholesale UK Ltd,CO-1833-14,OPT,,Mandela Way,Off Handy Drive,Gateshead,Tyne and Wear,NE11 9DH,Tel: 0191 461 9812, - ,,,No ratings yet Rate it yourself - /Services/opticians/LeaveReview/DefaultView.aspx?id=CO-1833-14,0,0,