Organisation Name,NACS Code,Organisation Type,Address1,Address2,Address3,Address4,Address5,PostCode,Telephone Number,Opening time,Value  (Opening time),Banding Classification  (Opening time),NHS.UK users rating,Value  (NHS.UK users rating),Banding Classification  (NHS.UK users rating),Car parking (Is there car parking at this organisation?)
Morans Opticians,OP_5HN_8606__000001_SK224AE,OPT,,28 Market Street,New Mills,High Peak,Derbyshire,SK22 4AE,Tel: 01663 742338, - ,,,1 rating Rate it yourself - /Services/opticians/LeaveReview/DefaultView.aspx?id=OP_5HN_8606__000001_SK224AE,,,
School House Optometry Clinic,OPT_SK122BB_1,OPT,,School House Surgery,Buxton Old Road,Disley,Cheshire,SK12 2BB,Tel: 01663 764488, - ,,,No ratings yet Rate it yourself - /Services/opticians/LeaveReview/DefaultView.aspx?id=OPT_SK122BB_1,0,0,
Jenks & Burgess Opticians,OP_5HN_11466__000002_SK237LP,OPT,24 Market Street,Whaley Bridge,High Peak,,,SK23 7LP,Tel: 01663 733861, - ,,,No ratings yet Rate it yourself - /Services/opticians/LeaveReview/DefaultView.aspx?id=OP_5HN_11466__000002_SK237LP,0,0,
Roger Fisher Opticians,OP_5F7_2529__000001_SK66BD,OPT,18 Market Street,Marple,,Stockport,,SK6 7AD,Tel: 0161 427 1319, - ,,,1 rating Rate it yourself - /Services/opticians/LeaveReview/DefaultView.aspx?id=OP_5F7_2529__000001_SK66BD,,,
Riding Opticians,OP_5F7_13265__000002_SK67AA,OPT,20 Stockport Road,Marple,,Stockport,Cheshire,SK6 6AB,Tel: 0161 427 4945, - ,,,No ratings yet Rate it yourself - /Services/opticians/LeaveReview/DefaultView.aspx?id=OP_5F7_13265__000002_SK67AA,0,0,no
Scrivens Opticians & Hearing Care,OP_5HN_14734__000001_SK23OHH,OPT,,7 Market Street,Chapel-En-le-Frith,Chapel en le Frith,,SK23 0HH,Tel: 01298 812427, - ,,,No ratings yet Rate it yourself - /Services/opticians/LeaveReview/DefaultView.aspx?id=OP_5HN_14734__000001_SK23OHH,0,0,
Harries Opticians,OP_5F7_11476__000001_SK74PS,OPT,313 London Road,Hazel Grove,Stockport,,,SK7 4PS,Tel: 0161 483 8073   , - ,,,No ratings yet Rate it yourself - /Services/opticians/LeaveReview/DefaultView.aspx?id=OP_5F7_11476__000001_SK74PS,0,0,
M A Fox,OP_5H5_13525__000003_SK121RE,OPT,56 Park Lane,,Poynton,Cheshire,,SK12 1RE,Tel: 01625 877505, - ,,,No ratings yet Rate it yourself - /Services/opticians/LeaveReview/DefaultView.aspx?id=OP_5H5_13525__000003_SK121RE,0,0,
Atkins - Burgess Opticians,OP_5H5_4132__000002_SK121RE,OPT,100 Park Lane,,Poynton,Cheshire,,SK12 1RE,Tel: 01625 873245, - ,,,No ratings yet Rate it yourself - /Services/opticians/LeaveReview/DefaultView.aspx?id=OP_5H5_4132__000002_SK121RE,0,0,
Taylor & Dewhurst (Romiley) Ltd,OP_5F7_159__000002_SK64BT,OPT,33 Compstall Road,Romiley,Stockport,,,SK6 4BT,Tel: 0161 430 2037, - ,,,No ratings yet Rate it yourself - /Services/opticians/LeaveReview/DefaultView.aspx?id=OP_5F7_159__000002_SK64BT,0,0,
The Spectacle Studio,OP_5F7_14170__000002_SK83BL,OPT,155 London Road,Hazel Grove,Stockport,,,SK7 4HH,Tel: 0161 487 4335, - ,,,No ratings yet Rate it yourself - /Services/opticians/LeaveReview/DefaultView.aspx?id=OP_5F7_14170__000002_SK83BL,0,0,
G B Optical Ltd,OP_5F7_13263__000001_SK74HJ,OPT,146 London Road,Hazel Grove,Stockport,,,SK7 4DJ,Tel: 0161 419 9534, - ,,,No ratings yet Rate it yourself - /Services/opticians/LeaveReview/DefaultView.aspx?id=OP_5F7_13263__000001_SK74HJ,0,0,
Complete Community Care (Domicilliary Only),OP_SK136XR_45785,OPT,Complete Community Care,6 Springwood,Glossop,Derbyshire,,SK13 6XR,Tel: 0161 297 0240, - ,,,No ratings yet Rate it yourself - /Services/opticians/LeaveReview/DefaultView.aspx?id=OP_SK136XR_45785,0,0,
Garlands Opticians,OP_5F7_1511__000001_SK63AU,OPT,14 Berrycroft Lane,Romiley,Stockport,,,SK6 3AU,Tel: 0161 430 5198, - ,,,2 ratings Rate it yourself - /Services/opticians/LeaveReview/DefaultView.aspx?id=OP_5F7_1511__000001_SK63AU,,,yes
Glossop Eyewear,233 5LH__000001_SK138AY,OPT,11 George Street,,Glossop,Derbyshire,,SK13 8AY,Tel: 01457 862411, - ,,,No ratings yet Rate it yourself - /Services/opticians/LeaveReview/DefaultView.aspx?id=233 5LH__000001_SK138AY,0,0,
Jacksons Opticians,OP_5LH_6157__000002_SK138AZ,OPT,27 High Street West,,Glossop,,,SK13 8AZ,Tel: 01457 852233, - ,,,2 ratings Rate it yourself - /Services/opticians/LeaveReview/DefaultView.aspx?id=OP_5LH_6157__000002_SK138AZ,,,
Boots-Glossop,OP_5LH_11303__000001_SK138AZ,OPT,23 High Street West,,,Glossop,Derbyshire,SK13 8AL,Tel: 01457 852523, - ,,,No ratings yet Rate it yourself - /Services/opticians/LeaveReview/DefaultView.aspx?id=OP_5LH_11303__000001_SK138AZ,0,0,
Warburton Optometrists,OP_5F7_13266__000001_SK14QA,OPT,415 Hempshaw Lane,415 Hempshaw Lane,Stockport,"Stockport, Cheshire",,SK1 4QA,Tel: 0161 480 6432, - ,,,1 rating Rate it yourself - /Services/opticians/LeaveReview/DefaultView.aspx?id=OP_5F7_13266__000001_SK14QA,,,yes
K Frank Optometrist,OP_5F7_5963__000002_SK14JG,OPT,178 Hall Street,Offerton,Stockport,,,SK1 4JG,Tel: 0161 480 7423, - ,,,No ratings yet Rate it yourself - /Services/opticians/LeaveReview/DefaultView.aspx?id=OP_5F7_5963__000002_SK14JG,0,0,
Ladybrook Eyewear,5F718873__000001_SK71NP,OPT,12b Fir Road,Bramhall,Stockport,Cheshire,,SK7 2NP,Tel: 0161 439 6867, - ,,,1 rating Rate it yourself - /Services/opticians/LeaveReview/DefaultView.aspx?id=5F718873__000001_SK71NP,,,
Knuttons,OP_5F7_8309__000001_SK38SB,OPT,132 Bramhall Lane,Davenport,Stockport,,,SK3 8SB,Tel: 0161 456 3623, - ,,,No ratings yet Rate it yourself - /Services/opticians/LeaveReview/DefaultView.aspx?id=OP_5F7_8309__000001_SK38SB,0,0,
Optique,OP_5F7_8778__000002_SK71AH,OPT,30a Bramhall Lane South,Bramhall,,Stockport,,SK7 1AH,Tel: 0161 440 9700, - ,,,No ratings yet Rate it yourself - /Services/opticians/LeaveReview/DefaultView.aspx?id=OP_5F7_8778__000002_SK71AH,0,0,
Boots-Bramhall,OP_5F7_12739__000001_SK71JN,OPT,13 Woodford Road,,,Bramhill,Cheshire,SK7 1JN,Tel: 0161 439 1770, - ,,,No ratings yet Rate it yourself - /Services/opticians/LeaveReview/DefaultView.aspx?id=OP_5F7_12739__000001_SK71JN,0,0,
Jinkinson Opticians,OP_5F7_8504__000001_SK71AW,OPT,21 The Bramhall Centre,Bramhall,,Stockport,Lancashire,SK7 1AW,Tel: 0161 440 9845, - ,,,1 rating Rate it yourself - /Services/opticians/LeaveReview/DefaultView.aspx?id=OP_5F7_8504__000001_SK71AW,,,
Valli Opticians Hyde,B8V7X,OPT,,88 Market Street,,Hyde,Greater Manchester,SK14 1ES,Tel: 01613681183, - ,,,No ratings yet Rate it yourself - /Services/opticians/LeaveReview/DefaultView.aspx?id=B8V7X,0,0,
Mrs L Sheikholeslami (Domiciliary Only),OP_5F7_13781__000001_SK71HX,OPT,39 Patch Lane,Bramhall,Stockport,Stockport,,SK7 1HX,Tel: 0161 439 8029, - ,,,No ratings yet Rate it yourself - /Services/opticians/LeaveReview/DefaultView.aspx?id=OP_5F7_13781__000001_SK71HX,0,0,
Specsavers Opticians,OP_5LH_7336__000001_SK142NA,OPT,27 Market Place,,Hyde,,,SK14 2NA,Tel: 0161 367 8977, - ,,,3 ratings Rate it yourself - /Services/opticians/LeaveReview/DefaultView.aspx?id=OP_5LH_7336__000001_SK142NA,,,
Boots-Hyde,OP_5LH_743__000002_SK142QR,OPT,2 The Square,,,Hyde,Cheshire,SK14 2QR,Tel: 0161 368 2303, - ,,,No ratings yet Rate it yourself - /Services/opticians/LeaveReview/DefaultView.aspx?id=OP_5LH_743__000002_SK142QR,0,0,
Artingstall Opticians,OP_5LH_4834__000002_SK142EL,OPT,3 Clarendon Street,,Hyde,,,SK14 2EL,Tel: 0161 368 7460, - ,,,No ratings yet Rate it yourself - /Services/opticians/LeaveReview/DefaultView.aspx?id=OP_5LH_4834__000002_SK142EL,0,0,
Asda Opticians,OP_5LH_14164__000001_SK141BD,OPT,Asda Stores,Water Street,,Hyde,,SK14 1BD,Tel: 0161 882 5712, - ,,,1 rating Rate it yourself - /Services/opticians/LeaveReview/DefaultView.aspx?id=OP_5LH_14164__000001_SK141BD,,,
Sarah Dineen,OP_5LH_14385__000001_SK136XR,OPT,,107a Station Road,Hadfield,Glossop,,SK13 1AR,Tel: 01457 868111, - ,,,No ratings yet Rate it yourself - /Services/opticians/LeaveReview/DefaultView.aspx?id=OP_5LH_14385__000001_SK136XR,0,0,
Sarah Dineen Opticians,11600__000001_SK131AR,OPT,77 Station Road,Hadfield,Glossop,,,SK13 1AR,Tel: 01457 868111, - ,,,1 rating Rate it yourself - /Services/opticians/LeaveReview/DefaultView.aspx?id=11600__000001_SK131AR,,,
John Lyne Opticians,OP_5F7_14168__000001_SK11NT,OPT,15 Great Underbank,,Stockport,Cheshire,,SK1 1LF,Tel: 0161 474 0974, - ,,,No ratings yet Rate it yourself - /Services/opticians/LeaveReview/DefaultView.aspx?id=OP_5F7_14168__000001_SK11NT,0,0,
Kay Downs Opticians Ltd,OP_5F7_3520__000001_SK11XR,OPT,,41 Great Underbank,,Stockport,,SK1 1NE,Tel: 0161 480 4980, - ,,,1 rating Rate it yourself - /Services/opticians/LeaveReview/DefaultView.aspx?id=OP_5F7_3520__000001_SK11XR,,,
Vision Express,5F7V1__000009_S,OPT,,Unit 6-10 Adlington Walk,Off Merseyway,Stockport,Cheshire,SK1 1PR,Tel: 0161 476 4686, - ,,,No ratings yet Rate it yourself - /Services/opticians/LeaveReview/DefaultView.aspx?id=5F7V1__000009_S,0,0,
Boots-Stockport - Merseyway,OP_5F7_12755__000002_SK11PU,OPT,47-49 Merseyway,,Stockport,Stockport,,SK1 1PU,Tel: 0161 429 0515, - ,,,No ratings yet Rate it yourself - /Services/opticians/LeaveReview/DefaultView.aspx?id=OP_5F7_12755__000002_SK11PU,0,0,
Optical Express,OP_SK11PJ_89441,OPT,18-20 Mersey Way,,,Stockport,Cheshire,SK1 1PJ,Tel: 0800 023 2020, - ,,,No ratings yet Rate it yourself - /Services/opticians/LeaveReview/DefaultView.aspx?id=OP_SK11PJ_89441,0,0,
Specsavers Opticians,OP_5F7_3917__000001_SK11RY,OPT,65 Merseyway,,,Stockport,,SK1 1QW,Tel: 0161 477 6161, - ,,,No ratings yet Rate it yourself - /Services/opticians/LeaveReview/DefaultView.aspx?id=OP_5F7_3917__000001_SK11RY,0,0,
Cunninghams Opticians Ltd,OP_5F7_4763__000001_SK11RW,OPT,83a Princes Street,,Stockport,,,SK1 1RW,Tel: 0161 480 0066, - ,,,1 rating Rate it yourself - /Services/opticians/LeaveReview/DefaultView.aspx?id=OP_5F7_4763__000001_SK11RW,,,
Barker S K,OP_5HN_14729__000001_SK178NF,OPT,The New Surgery,Parke Road,Tideswell,,,SK17 8NF,Tel: 01298 871396, - ,,,No ratings yet Rate it yourself - /Services/opticians/LeaveReview/DefaultView.aspx?id=OP_5HN_14729__000001_SK178NF,0,0,
Community Eye Care UK,OP_5HP_14298__000012_SK30XA,OPT,Europa Business Park,Bird Hall Lane,Cheadle Heath,,,SK3 0XA,Tel: 0161 491 5222, - ,,,No ratings yet Rate it yourself - /Services/opticians/LeaveReview/DefaultView.aspx?id=OP_5HP_14298__000012_SK30XA,0,0,
Valli Opticians Cheadle Hulme,J9U9Z,OPT,,21B The Shopping Centre,,Cheadle Hulme,Hampshire,SK8 5BB,Tel: 01614851164, - ,,,2 ratings Rate it yourself - /Services/opticians/LeaveReview/DefaultView.aspx?id=J9U9Z,,,
Station Road Opticians,,OPT,,"8a Station Road, Cheadle Hulme",,Cheadle,,SK8 5AE,Tel: 0161 4100051, - ,,,N/A - Data not available,,,
Eyes Right Ltd,OP_5LH_14171__000001_M436AB,OPT,12 Stockport Road,Denton,,Manchester,,M34 6AB,Tel: 0161 335 9500, - ,,,1 rating Rate it yourself - /Services/opticians/LeaveReview/DefaultView.aspx?id=OP_5LH_14171__000001_M436AB,,,
S K Barker,OP_5HN_293__000001_SK176AZ,OPT,4 The Square,,Buxton,,,SK17 6AZ,Tel: 01298 25361, - ,,,No ratings yet Rate it yourself - /Services/opticians/LeaveReview/DefaultView.aspx?id=OP_5HN_293__000001_SK176AZ,0,0,
Buxton VE Ltd,VISION__000001_SK176DF,OPT,19 Spring Gardens Centre,,,Buxton,Derbyshire,SK17 6DF,Tel: 01298 214613, - ,,,No ratings yet Rate it yourself - /Services/opticians/LeaveReview/DefaultView.aspx?id=VISION__000001_SK176DF,0,0,
M A Stoker & Partner,OP_5HN_10060__000001_SK176AS,OPT,5,The Grove,,Buxton,,SK17 6AS,Tel: 01298 23380, - ,,,1 rating Rate it yourself - /Services/opticians/LeaveReview/DefaultView.aspx?id=OP_5HN_10060__000001_SK176AS,,,
Specsavers Opticians,OP_5HN_12247__000001_SK176DE,OPT,Unit 14,Spring Gardens Centre,Buxton,,,SK17 6DE,Tel: 01298 766130, - ,,,No ratings yet Rate it yourself - /Services/opticians/LeaveReview/DefaultView.aspx?id=OP_5HN_12247__000001_SK176DE,0,0,
Boots-Buxton,OP_5HN_14731__000001_SK176BE,OPT,4 Spring Gardens,,Derbyshire,Buxton,,SK17 6DE,Tel: 01298 22443, - ,,,No ratings yet Rate it yourself - /Services/opticians/LeaveReview/DefaultView.aspx?id=OP_5HN_14731__000001_SK176BE,0,0,
Cartwright Optometrists,OP_5LH_14166__000001_M343JU,OPT,41 Manchester Road,Denton,Manchester,,,M34 3JU,Tel: 0161 336 3726, - ,,,2 ratings Rate it yourself - /Services/opticians/LeaveReview/DefaultView.aspx?id=OP_5LH_14166__000001_M343JU,,,
Boots-Denton,OP_5LH_4597__000001_M343LE,OPT,32 Manchester Road,,,Denton,Lancashire,M34 3LE,Tel: 0161 336 6944, - ,,,1 rating Rate it yourself - /Services/opticians/LeaveReview/DefaultView.aspx?id=OP_5LH_4597__000001_M343LE,,,
Boots-Stockport - Wellington Rd Nth,OP_5F7_2001__000001_SK42QN,OPT,186 Wellington Road North,,,Stockport,Cheshire,SK4 2QN,Tel: 0161 442 7570, - ,,,No ratings yet Rate it yourself - /Services/opticians/LeaveReview/DefaultView.aspx?id=OP_5F7_2001__000001_SK42QN,0,0,
Dixon Optometrists Ltd,OP_5F7_8275__000001_SK57AA,OPT,416 Reddish Road,Reddish,,Stockport,Cheshire,SK5 7AA,Tel: 0161 432 8101, - ,,,4 ratings Rate it yourself - /Services/opticians/LeaveReview/DefaultView.aspx?id=OP_5F7_8275__000001_SK57AA,,,Data not available
Tesco Stores Ltd,SK9 3PA__000002_SK93PA,OPT,Kiln Croft Lane,,Handforth,Cheshire,,SK9 3PA,Tel: 0345 601 3479, - ,,,No ratings yet Rate it yourself - /Services/opticians/LeaveReview/DefaultView.aspx?id=SK9 3PA__000002_SK93PA,0,0,
Hantman Eye Care,OP_5F7_6933__000003_SK86AW,OPT,122 Turves Road,Cheadle Hulme,Cheadle,Stockport,Cheshire,SK8 6AW,Tel: 0161 488 4846, - ,,,1 rating Rate it yourself - /Services/opticians/LeaveReview/DefaultView.aspx?id=OP_5F7_6933__000003_SK86AW,,,
Steve Mayer Opticians,OP_5LH_1963__000001_SK151RR,OPT,46 A Grosvenor Street,,Stalybridge,,,SK15 1RR,Tel: 0161 303 7773, - ,,,No ratings yet Rate it yourself - /Services/opticians/LeaveReview/DefaultView.aspx?id=OP_5LH_1963__000001_SK151RR,0,0,
Stalybridge Eyecare,5LH 225__000001_SK152JJ,OPT,47 Melbourne Street,Stalybridge,Cheshire,,,SK15 2JJ,Tel: 0161 338 2561, - ,,,No ratings yet Rate it yourself - /Services/opticians/LeaveReview/DefaultView.aspx?id=5LH 225__000001_SK152JJ,0,0,
F S L Opticians Ltd,OP_5F7_4648__000001_SK44DT,OPT,1a Moorside Road,Heaton Moor,Stockport,,,SK4 4DT,Tel: 0161 442 8141, - ,,,No ratings yet Rate it yourself - /Services/opticians/LeaveReview/DefaultView.aspx?id=OP_5F7_4648__000001_SK44DT,0,0,
Macclesfield Visionplus Limited,OP_5H5_2588__000002_SK116AJ,OPT,Unit 6,"Mill Street Mall, Grosvenor Centre",Macclesfield,Cheshire,,SK11 6AJ,Tel: 01625 501 111, - ,,,No ratings yet Rate it yourself - /Services/opticians/LeaveReview/DefaultView.aspx?id=OP_5H5_2588__000002_SK116AJ,0,0,
Dollond & Aitchison Professional Services Ltd,OP_5H5_4983__000001_SK116LT,OPT,36 Mill Street,,Macclesfield,Cheshire,,SK11 6LT,Tel: 01625 425582, - ,,,No ratings yet Rate it yourself - /Services/opticians/LeaveReview/DefaultView.aspx?id=OP_5H5_4983__000001_SK116LT,0,0,
Boots-Macclesfield - Mill St,OP_5H5_13524__000002_SK116LT,OPT,46 Mill Street,,Macclesfield,Cheshire,,SK11 6LT,Tel: 01625 424108, - ,,,1 rating Rate it yourself - /Services/opticians/LeaveReview/DefaultView.aspx?id=OP_5H5_13524__000002_SK116LT,,,
Macclesfield VE Limited,SK11 6NE__000001_SK116NE,OPT,31 Mill Street,,,Macclesfield,Cheshire,SK11 6NE,Tel: 01625 429831, - ,,,No ratings yet Rate it yourself - /Services/opticians/LeaveReview/DefaultView.aspx?id=SK11 6NE__000001_SK116NE,0,0,
Oldbury & Cruickshank Optometrists,OP_5H5_28__000001_SK116JD,OPT,73 Pickford Street,,,Macclesfield,Cheshire,SK11 6JD,Tel: 01625 615002, - ,,,1 rating Rate it yourself - /Services/opticians/LeaveReview/DefaultView.aspx?id=OP_5H5_28__000001_SK116JD,,,
Fox - Stevens Optometrists,OP_5H5_13413__000001_SK93LQ,OPT,108 Wilmslow Road,,Handforth,Cheshire,,SK9 3ES,Tel: 01625 527991, - ,,,9 ratings Rate it yourself - /Services/opticians/LeaveReview/DefaultView.aspx?id=OP_5H5_13413__000001_SK93LQ,,,
Roberts Opticians,OP_5LH_333__000001_SK164JZ,OPT,125 King Street,,Dukinfield,,,SK16 4JZ,Tel: 0161 330 2394, - ,,,1 rating Rate it yourself - /Services/opticians/LeaveReview/DefaultView.aspx?id=OP_5LH_333__000001_SK164JZ,,,
H J Wheeldon Ltd,OP_5F7_3664__000001_SK82AA,OPT,4 Stockport Road,,Cheadle,,,SK8 2AA,Tel: 0161 428 2396, - ,,,No ratings yet Rate it yourself - /Services/opticians/LeaveReview/DefaultView.aspx?id=OP_5F7_3664__000001_SK82AA,0,0,
Boots-Cheadle,88888__000001_SK81AY,OPT,15 High Street,Cheadle,Cheshire,Cheshire,,SK8 1AX,Tel: 0161 495 7217, - ,,,1 rating Rate it yourself - /Services/opticians/LeaveReview/DefaultView.aspx?id=88888__000001_SK81AY,,,
Park Lane Opticians,OP_5H5_13346__000001_SK116UA,OPT,141 Park Lane,,Macclesfield,Cheshire,,SK11 6UB,Tel: 01625 432777, - ,,,8 ratings Rate it yourself - /Services/opticians/LeaveReview/DefaultView.aspx?id=OP_5H5_13346__000001_SK116UA,,,
W H Ashworth & Son,OP_5F7_3157__000002_SK81DW,OPT,19 Wilmslow Road,,Cheadle,,,SK8 1DW,Tel: 0161 428 3717, - ,,,No ratings yet Rate it yourself - /Services/opticians/LeaveReview/DefaultView.aspx?id=OP_5F7_3157__000002_SK81DW,0,0,
Mrs S French-Teeling,OP_5F7_13259__000001_SK81DW,OPT,2 Rectory Court,13 Wilmslow Road,,Cheadle,,SK8 1DW,Tel: 0161 491 4271, - ,,,No ratings yet Rate it yourself - /Services/opticians/LeaveReview/DefaultView.aspx?id=OP_5F7_13259__000001_SK81DW,0,0,
Asda Opticians,OPT_OL6 7DP,OPT,,Cavendish Street,,Ashton-Under-Lyne,,OL6 7DP,Tel: 0161 342 6612, - ,,,No ratings yet Rate it yourself - /Services/opticians/LeaveReview/DefaultView.aspx?id=OPT_OL6 7DP,0,0,
Muldoon & Tonge Opticians,OP_5LH_8867__000001_OL67LR,OPT,178 Stamford Street,,Ashton-under-Lyne,,,OL6 7LR,Tel: 0161 330 4643, - ,,,1 rating Rate it yourself - /Services/opticians/LeaveReview/DefaultView.aspx?id=OP_5LH_8867__000001_OL67LR,,,
Vikesh Measuria,5LH 243__000001_OL66HG,OPT,28 - 30 Penny Meadow,,Ashton-under-Lyne,Lancashire,,OL6 6HG,Tel: 0161 330 9437, - ,,,No ratings yet Rate it yourself - /Services/opticians/LeaveReview/DefaultView.aspx?id=5LH 243__000001_OL66HG,0,0,
John H. Blease,OP_5LH_14165__000001_OL66BY,OPT,15 Fletcher Street,,Ashton-under-Lyne,,,OL6 6BY,Tel: 0161 330 2321, - ,,,No ratings yet Rate it yourself - /Services/opticians/LeaveReview/DefaultView.aspx?id=OP_5LH_14165__000001_OL66BY,0,0,
Boots-Ashton Under Lyne,OP_5LH_12363__000002_OL67JL,OPT,15-17 Staveleigh Way,Ladysmith Centre,Ashton-under-Lyne,Ashton-under-Lyne,,OL6 7JL,Tel: 0161 308 4428, - ,,,3 ratings Rate it yourself - /Services/opticians/LeaveReview/DefaultView.aspx?id=OP_5LH_12363__000002_OL67JL,,,
Specsavers Opticians,OP_5LH_11788__000001_OL67JG,OPT,Unit 12,Ladysmith Shopping Centre,Ashton-under-Lyne,Greater Manchester,,OL6 7JQ,Tel: 0161 339 4449, - ,,,No ratings yet Rate it yourself - /Services/opticians/LeaveReview/DefaultView.aspx?id=OP_5LH_11788__000001_OL67JG,0,0,
W H Ashworth & Son,OP_5F7_8072__000002_SK83QA,OPT,214 Finney Lane,Heald Green,Cheadle,,,SK8 3QA,Tel: 0161 437 3400, - ,,,1 rating Rate it yourself - /Services/opticians/LeaveReview/DefaultView.aspx?id=OP_5F7_8072__000002_SK83QA,,,
Lindop Opticians ,OP_5CL_8706__000001_M193PZ,OPT,923 Stockport Road,Levenshulme,,Manchester,Greater Manchester,M19 3PZ,Tel: 0161 224 6878, - ,,,No ratings yet Rate it yourself - /Services/opticians/LeaveReview/DefaultView.aspx?id=OP_5CL_8706__000001_M193PZ,0,0,
Vision Express,OP_5LH_3021__000001_OL67JH,OPT,,12 Mercian Way,,Ashton-under-Lyne,,OL6 7JH,Tel: 0161 339 6502, - ,,,No ratings yet Rate it yourself - /Services/opticians/LeaveReview/DefaultView.aspx?id=OP_5LH_3021__000001_OL67JH,0,0,
Direct Vision ,OP_5CL_4381__000001_M193PN,OPT,904 Stockport Road,Levenshulme,,Manchester,Greater Manchester,M19 3AD,Tel: 0161 248 4200, - ,,,No ratings yet Rate it yourself - /Services/opticians/LeaveReview/DefaultView.aspx?id=OP_5CL_4381__000001_M193PN,0,0,
Visioncare at Home North West Ltd (Domicilliary Only),OP_OL70AU_46385,OPT,,"Unit 5c, Kayley Industrial Estate",,Ashton-under-Lyne,,OL7 0AU,, - ,,,No ratings yet Rate it yourself - /Services/opticians/LeaveReview/DefaultView.aspx?id=OP_OL70AU_46385,0,0,
Murray & Haggerty,OP_5AA_1531__000001_M206EL,OPT,238 Fog Lane,Didsbury,,Manchester,,M20 6EL,Tel: 0161 434 4597, - ,,,1 rating Rate it yourself - /Services/opticians/LeaveReview/DefaultView.aspx?id=OP_5AA_1531__000001_M206EL,,,
Selby & Glover,OP_5CL_4761__000001_M188LY,OPT,167 Chapman Street,Gorton,Manchester,,,M18 8TJ,Tel: 0161 223 0694, - ,,,No ratings yet Rate it yourself - /Services/opticians/LeaveReview/DefaultView.aspx?id=OP_5CL_4761__000001_M188LY,0,0,
Optique ,OP_5F7_6932__000001_SK84BB,OPT,179 Gatley Road,Gatley,Cheadle,Cheadle,,SK8 4BB,Tel: 0161 428 4858, - ,,,2 ratings Rate it yourself - /Services/opticians/LeaveReview/DefaultView.aspx?id=OP_5F7_6932__000001_SK84BB,,,
Optieye Care,OP_5CL_1490__000001_M187EE,OPT,646 Hyde Road,Gorton,,Manchester,,M18 7EE,Tel: 0161 223 2001, - ,,,No ratings yet Rate it yourself - /Services/opticians/LeaveReview/DefaultView.aspx?id=OP_5CL_1490__000001_M187EE,0,0,
H J Wheeldon Ltd,OP_5H5_3907__000001_SK95DD,OPT,11 Hawthorn Lane,,Wilmslow,Cheshire,,SK9 5DD,Tel: 01625 524311, - ,,,1 rating Rate it yourself - /Services/opticians/LeaveReview/DefaultView.aspx?id=OP_5H5_3907__000001_SK95DD,,,
Tesco Opticians,TES5NT__000002_M188LD,OPT,Hyde Road,Gorton,Manchester,,,M18 8LD,Tel: 0161 255 9438, - ,,,No ratings yet Rate it yourself - /Services/opticians/LeaveReview/DefaultView.aspx?id=TES5NT__000002_M188LD,0,0,
Clare & Illingworth Ltd,OP_5H5_2749__000001_SK95AA,OPT,28 Water Lane,28 Water Lane,Wilmslow,Cheshire,,SK9 5AA,Tel: 01625 530498, - ,,,No ratings yet Rate it yourself - /Services/opticians/LeaveReview/DefaultView.aspx?id=OP_5H5_2749__000001_SK95AA,0,0,
Domiciliary only Primary Ophthalmic Services,2415LH__000001_OL69DD,OPT,2 Lowfield Avenue,,Ashton-under-Lyne,Lancashire,,OL6 9DD,, - ,,,No ratings yet Rate it yourself - /Services/opticians/LeaveReview/DefaultView.aspx?id=2415LH__000001_OL69DD,0,0,
Boots-Wilmslow,SK9 1JX_19282,OPT,,16 Alderley Road,,Wilmslow,Cheshire,SK9 1JX,Tel: 01625 527210, - ,,,No ratings yet Rate it yourself - /Services/opticians/LeaveReview/DefaultView.aspx?id=SK9 1JX_19282,0,0,
Dollond & Aitchison Professional Services Ltd,SK9 1NX__000001_SK91NX,OPT,16 Albert Road,,Wilmslow,Cheshire,,SK9 1NX,Tel: Unknown, - ,,,No ratings yet Rate it yourself - /Services/opticians/LeaveReview/DefaultView.aspx?id=SK9 1NX__000001_SK91NX,0,0,
James Doyle Opticians,OP_5H5_13465__000001_SK91NZ,OPT,53 Alderley Road,,Wilmslow,Cheshire,,SK9 1NZ,Tel: 01625 548848, - ,,,No ratings yet Rate it yourself - /Services/opticians/LeaveReview/DefaultView.aspx?id=OP_5H5_13465__000001_SK91NZ,0,0,
Wass Opticians,OP_5LH_9513__000001_M437BP,OPT,48-50 Ashton Road,Droylsden,Manchester,,,M43 7BP,Tel: 0161 370 2037, - ,,,1 rating Rate it yourself - /Services/opticians/LeaveReview/DefaultView.aspx?id=OP_5LH_9513__000001_M437BP,,,
Your Home Eyecare,SK11 8TQ__000002_SK118TQ,OPT,1 Tenby Road,,Macclesfield,Cheshire,,SK11 8TQ,Tel: 0800 952 0064, - ,,,No ratings yet Rate it yourself - /Services/opticians/LeaveReview/DefaultView.aspx?id=SK11 8TQ__000002_SK118TQ,0,0,
Eyes Right Opticians Ltd,OP_5LH_4840__000001_M437AA,OPT,124 Market Street,,Manchester,Droylsden,,M43 7AA,Tel: 0161 301 1400, - ,,,No ratings yet Rate it yourself - /Services/opticians/LeaveReview/DefaultView.aspx?id=OP_5LH_4840__000001_M437AA,0,0,
Hearing & Vision World Ltd,OP_5H5_13497__000001_SK95HT,OPT,18 Albert Road,,Wilmslow,Cheshire,,SK9 5HT,Tel: 01625 533087, - ,,,No ratings yet Rate it yourself - /Services/opticians/LeaveReview/DefaultView.aspx?id=OP_5H5_13497__000001_SK95HT,0,0,
Specsavers Opticians,OP_5AA_8734__000002_M146SQ,OPT,114 Mauldeth Road,Fallowfield,Manchester,,,M14 6SQ,Tel: 0161 434 2755, - ,,,No ratings yet Rate it yourself - /Services/opticians/LeaveReview/DefaultView.aspx?id=OP_5AA_8734__000002_M146SQ,0,0,
Eyes Right Opticians,OP_5CR_3014__000003_M111JG,OPT,1304 Ashton Old Road,Openshaw,Manchester,,,M11 1JG,Tel: 0161 370 1553, - ,,,No ratings yet Rate it yourself - /Services/opticians/LeaveReview/DefaultView.aspx?id=OP_5CR_3014__000003_M111JG,0,0,