Organisation Name,NACS Code,Organisation Type,Address1,Address2,Address3,Address4,Address5,PostCode,Telephone Number,Opening time,Value  (Opening time),Banding Classification  (Opening time),NHS.UK users rating,Value  (NHS.UK users rating),Banding Classification  (NHS.UK users rating),Car parking (Is there car parking at this organisation?)
Real Eyes The Eye Clinic,OP_5K9_9387__000002_CR00JB,OPT,26 Central Parade,New Addington,,Croydon,,CR0 0JB,Tel: 01689 842152, - ,,,No ratings yet Rate it yourself - /Services/opticians/LeaveReview/DefaultView.aspx?id=OP_5K9_9387__000002_CR00JB,0,0,
Specsavers Opticians,19223__000002_BR40NH,OPT,15 High Street,,West Wickham,Kent,,BR4 0LP,Tel: 020 8916 8280, - ,,,No ratings yet Rate it yourself - /Services/opticians/LeaveReview/DefaultView.aspx?id=19223__000002_BR40NH,0,0,
AK Bennett Opticians,OP_5A7_1909__000001_BR40LS,OPT,65 High Street,65 High Street,West Wickham,Bromley,Kent,BR4 0LS,Tel: 020 8777 1337, - ,,,1 rating Rate it yourself - /Services/opticians/LeaveReview/DefaultView.aspx?id=OP_5A7_1909__000001_BR40LS,,,
Boots-West Wickham,OP_5A7__000002_BR40PX,OPT,115 Station Road,,,West Wickham,Kent,BR4 0PX,Tel: 0208 777 2211, - ,,,1 rating Rate it yourself - /Services/opticians/LeaveReview/DefaultView.aspx?id=OP_5A7__000002_BR40PX,,,
J C Setton Opticians,OP_5A7_1927__000001_BR40NH,OPT,58 High Street,,West Wickham,,,BR4 0NH,Tel: 020 8777 1106, - ,,,No ratings yet Rate it yourself - /Services/opticians/LeaveReview/DefaultView.aspx?id=OP_5A7_1927__000001_BR40NH,0,0,
Basil H Bloom Optometrist,OP_5K9_2344__000002_CR28LH,OPT,121 Addington Road,,,South Croydon,,CR2 8LH,Tel: 020 8657 2000, - ,,,No ratings yet Rate it yourself - /Services/opticians/LeaveReview/DefaultView.aspx?id=OP_5K9_2344__000002_CR28LH,0,0,
Boots-Hayes,BR2 7EH__000001_BR27EH,OPT,2 Station Buildings,Station Approach,Hayes,Kent,,BR2 7EN,Tel: 020 8462 5332, - ,,,No ratings yet Rate it yourself - /Services/opticians/LeaveReview/DefaultView.aspx?id=BR2 7EH__000001_BR27EH,0,0,
Baileys Opticians,OP_5K9_7651__000002_CR29LA,OPT,1 Limpsfield Road,Sanderstead,,South Croydon,,CR2 9LA,Tel: 020 8657 3525, - ,,,No ratings yet Rate it yourself - /Services/opticians/LeaveReview/DefaultView.aspx?id=OP_5K9_7651__000002_CR29LA,0,0,
Leadbeater & Harris Opticians,OP_5K9_414__000001_CR06RF,OPT,305 Lower Addiscombe Road,,,Croydon,Surrey,CR0 6RF,Tel: 020 8654 5559, - ,,,No ratings yet Rate it yourself - /Services/opticians/LeaveReview/DefaultView.aspx?id=OP_5K9_414__000001_CR06RF,0,0,
Lambrou Eye Studio,OP_5A7_5488__000002_BR68NN,OPT,350 Crofton Road,,Orpington,Bromley,,BR6 8NN,Tel: 01689 850 593, - ,,,2 ratings Rate it yourself - /Services/opticians/LeaveReview/DefaultView.aspx?id=OP_5A7_5488__000002_BR68NN,,,
Broadgreen Eye Centre,OP - 5N5__000001_CR07TH,OPT,254 London Road,,West Croydon,Surrey,,CR0 7TH,, - ,,,No ratings yet Rate it yourself - /Services/opticians/LeaveReview/DefaultView.aspx?id=OP - 5N5__000001_CR07TH,0,0,
Day Lewis Opticians,OP_5A7_1378__000001_TN163AY,OPT,116 Main Road,Biggin Hill,Westerham,,,TN16 3AY,Tel: 01959 572535, - ,,,No ratings yet Rate it yourself - /Services/opticians/LeaveReview/DefaultView.aspx?id=OP_5A7_1378__000001_TN163AY,0,0,
Dermott Optical Limited,5A7:20__000001_BR33RB,OPT,147 Croydon Road,,Beckenham,Kent,,BR3 3RB,Tel: 020 8663 3323, - ,,,No ratings yet Rate it yourself - /Services/opticians/LeaveReview/DefaultView.aspx?id=5A7:20__000001_BR33RB,0,0,
Specology Limited,OP_TN163BA_29288,OPT,,"Unit 9, 160-166 Main Road",,"Biggin Hill, Kent",,TN16 3BA,Tel: 01959 928001, - ,,,No ratings yet Rate it yourself - /Services/opticians/LeaveReview/DefaultView.aspx?id=OP_TN163BA_29288,0,0,
Healthcall Optical Services Ltd,OP_5K9_11724__000001_CR26EB,OPT,The Pavillions,31-33 Brighton Road,South Croydon,,,CR2 6EB,Tel: 0845 601 7241, - ,,,No ratings yet Rate it yourself - /Services/opticians/LeaveReview/DefaultView.aspx?id=OP_5K9_11724__000001_CR26EB,0,0,
Visual Eyes Opticians,OP_5K9_14395__000001_CR06BB,OPT,144 Cherry Orchard Road,Croydon,,,,CR0 6BB,Tel: 020 8688 0047, - ,,,No ratings yet Rate it yourself - /Services/opticians/LeaveReview/DefaultView.aspx?id=OP_5K9_14395__000001_CR06BB,0,0,
Croydon Vision Care,TP8EP,OPT,Croydon Vision Care,Opticians,44 Lower Addiscombe Road,Croydon,Surrey,CR0 6AA,Tel: 0203 645 1456, - ,,,No ratings yet Rate it yourself - /Services/opticians/LeaveReview/DefaultView.aspx?id=TP8EP,0,0,
William J Wilkinson Limited,OP_5A7_4486__000001_BR11EA,OPT,42 High Street,,Bromley,,,BR1 1EA,Tel: 020 8464 5347, - ,,,No ratings yet Rate it yourself - /Services/opticians/LeaveReview/DefaultView.aspx?id=OP_5A7_4486__000001_BR11EA,0,0,
Glasses Lab,01-19725,OPT,,62 High Street,,Bromley,,BR1 1EG,Tel: 0208 466 1315, - ,,,No ratings yet Rate it yourself - /Services/opticians/LeaveReview/DefaultView.aspx?id=01-19725,0,0,
Steven Harris Opticians,OP_5A7_2625__000001_BR33NP,OPT,2-6 Village Way,,Beckenham,,,BR3 3NP,Tel: 020 8650 6172, - ,,,2 ratings Rate it yourself - /Services/opticians/LeaveReview/DefaultView.aspx?id=OP_5A7_2625__000001_BR33NP,,,
Optical Express,OP_5K9_7722__000001_CR01UY,OPT,Woolwich House,43 George Street,,Croydon,Surrey,CR0 1LB,Tel: 0800 023 2020, - ,,,No ratings yet Rate it yourself - /Services/opticians/LeaveReview/DefaultView.aspx?id=OP_5K9_7722__000001_CR01UY,0,0,
Young's Opticians,OP_5K9_4107__000001_CR01YG,OPT,12 St. Georges Walk,,,Croydon,,CR0 1YG,Tel: 020 8686 0676, - ,,,2 ratings Rate it yourself - /Services/opticians/LeaveReview/DefaultView.aspx?id=OP_5K9_4107__000001_CR01YG,,,
Boots-Beckenham,BR3 1EN_98721,OPT,,64 High Street,,Beckenham,Kent,BR3 1EN,Tel: 0208 650 0033, - ,,,No ratings yet Rate it yourself - /Services/opticians/LeaveReview/DefaultView.aspx?id=BR3 1EN_98721,0,0,
Boots Opticians,OP_5A7_112__000002_BR31ED,OPT,64 High Street,,Beckenham,Beckenham,,BR3 1EN,Tel: 020 8650 0033, - ,,,No ratings yet Rate it yourself - /Services/opticians/LeaveReview/DefaultView.aspx?id=OP_5A7_112__000002_BR31ED,0,0,
M&S Opticians,,OPT,,123 High Street,,Bromley,,BR1 1JL,Tel: 0203 0054415, - ,,,N/A - Data not available,,,
Ellis & Edwards Opticians,BR3 1DZ__000001_BR31DZ,OPT,254 High Street,,Beckenham,Kent,,BR3 1DZ,Tel: 020 8658 2313, - ,,,No ratings yet Rate it yourself - /Services/opticians/LeaveReview/DefaultView.aspx?id=BR3 1DZ__000001_BR31DZ,0,0,
Specsavers Opticians,OP_5A7_1174__000003_BR11EY,OPT,146 High Street,,Bromley,,,BR1 1EZ,Tel: 020 8466 9666, - ,,,No ratings yet Rate it yourself - /Services/opticians/LeaveReview/DefaultView.aspx?id=OP_5A7_1174__000003_BR11EY,0,0,
The Bromley Eye Centre,2BR1 1DD__000003_BR11DD,OPT,"Unit 48, The Glades",,Bromley,Kent,,BR1 1DD,Tel: 020 8466 8333, - ,,,1 rating Rate it yourself - /Services/opticians/LeaveReview/DefaultView.aspx?id=2BR1 1DD__000003_BR11DD,,,
Vision Express (UK) Limited,OP_5A7_11781__000002_BR11DN,OPT,29 Glades Shopping Centre,High Street,Bromley,,,BR1 1DN,Tel: 020 8313 1545, - ,,,No ratings yet Rate it yourself - /Services/opticians/LeaveReview/DefaultView.aspx?id=OP_5A7_11781__000002_BR11DN,0,0,
Whitgift Foundation,OP_5K9_1004__000001_CR91SS,OPT,North End,,Croydon,,,CR9 1SS,Tel: 020 8681 2876, - ,,,No ratings yet Rate it yourself - /Services/opticians/LeaveReview/DefaultView.aspx?id=OP_5K9_1004__000001_CR91SS,0,0,
Specsavers Opticians,BR3 1EW__000002_BR31EW,OPT,176 High Street,,Beckenham,Kent,,BR3 1EW,Tel: 020 8658 5252, - ,,,2 ratings Rate it yourself - /Services/opticians/LeaveReview/DefaultView.aspx?id=BR3 1EW__000002_BR31EW,,,
Rawling and Sons,OP_5K9_14389__000001_CR01YA,OPT,8 High Street,Croydon,,Surrey,,CR0 1YA,Tel: 020 8688 1040, - ,,,No ratings yet Rate it yourself - /Services/opticians/LeaveReview/DefaultView.aspx?id=OP_5K9_14389__000001_CR01YA,0,0,
Arthur Hayes Opticians,OP_5K9_10535__000001_CR01UX,OPT,1070 Whitgift Centre,,,Croydon,,CR0 1UX,Tel: 020 8686 0707, - ,,,No ratings yet Rate it yourself - /Services/opticians/LeaveReview/DefaultView.aspx?id=OP_5K9_10535__000001_CR01UX,0,0,
Croydon Optical Ltd,OP_5K9_13029__000001_CR01XB,OPT,1143 Whitgift Centre,,,Croydon,,CR0 1XB,Tel: 020 8680 2828, - ,,,No ratings yet Rate it yourself - /Services/opticians/LeaveReview/DefaultView.aspx?id=OP_5K9_13029__000001_CR01XB,0,0,
Specsavers Opticians,OP_5K9_916__000001_CR01RH,OPT,19 Church Street,,,Croydon,,CR0 1RH,Tel: 0208 760 0574, - ,,,No ratings yet Rate it yourself - /Services/opticians/LeaveReview/DefaultView.aspx?id=OP_5K9_916__000001_CR01RH,0,0,
For Eyes (Optimistry Ltd),OPT_CR01TB_1,OPT,,55 Frith Road,,Croydon,Surrey,CR0 1TB,Tel: 020 8662 8012, - ,,,1 rating Rate it yourself - /Services/opticians/LeaveReview/DefaultView.aspx?id=OPT_CR01TB_1,,,
Vision Express ,OP_5K9_12585__000001_CR01TJ,OPT,73 North End,,,Croydon,,CR0 1TJ,Tel: 020 8649 7280, - ,,,1 rating Rate it yourself - /Services/opticians/LeaveReview/DefaultView.aspx?id=OP_5K9_12585__000001_CR01TJ,,,
Boots-Croydon - Whitgift Centre,OP_5K9_2997__000001_CR91SN,OPT,12-18 Whitgift Centre,,,Croydon,Surrey,CR9 1SN,Tel: 0208 680 2733, - ,,,5 ratings Rate it yourself - /Services/opticians/LeaveReview/DefaultView.aspx?id=OP_5K9_2997__000001_CR91SN,,,
Specsavers Opticians,OP_5K9_765__000001_CR01UD,OPT,112 North End,Croydon,,Surrey,,CR0 1UD,Tel: 020 8681 8688, - ,,,No ratings yet Rate it yourself - /Services/opticians/LeaveReview/DefaultView.aspx?id=OP_5K9_765__000001_CR01UD,0,0,
R.W.H. Clements,OP_5K9_5641__000001_SE254UG,OPT,1 Portland Road,,,London,,SE25 4UG,Tel: 020 8654 4171, - ,,,No ratings yet Rate it yourself - /Services/opticians/LeaveReview/DefaultView.aspx?id=OP_5K9_5641__000001_SE254UG,0,0,
Kerr Eyecare,OP_5K9_9062__000001_CR02RE,OPT,37 London Road,,,West Croydon,Surrey,CR0 2RE,Tel: 020 8688 5076, - ,,,6 ratings Rate it yourself - /Services/opticians/LeaveReview/DefaultView.aspx?id=OP_5K9_9062__000001_CR02RE,,,
Spex Direct,OP_5K9_10386__000001_CR04JA,OPT,21 Rectory Grove,,Croydon,,,CR0 4JA,Tel: 020 8407 1728, - ,,,No ratings yet Rate it yourself - /Services/opticians/LeaveReview/DefaultView.aspx?id=OP_5K9_10386__000001_CR04JA,0,0,
Boots-Bromley - The Glades,OP_5A7_7470__000001_BR11DD,OPT,40 The Glades,,,Bromley,Kent,BR1 2QG,Tel: 0208 460 4944, - ,,,5 ratings Rate it yourself - /Services/opticians/LeaveReview/DefaultView.aspx?id=OP_5A7_7470__000001_BR11DD,,,
Balham Eyecare Centre,OPT_CR82AA_1,OPT,,4 High Street,Purley,Croydon,,CR8 2AA,Tel: 0207 998 3595, - ,,,No ratings yet Rate it yourself - /Services/opticians/LeaveReview/DefaultView.aspx?id=OPT_CR82AA_1,0,0,
Specsavers,01-14901,OPT,,943 Brighton Road,,Purley,,CR8 2UN,Tel: 0208 6605129, - ,,,No ratings yet Rate it yourself - /Services/opticians/LeaveReview/DefaultView.aspx?id=01-14901,0,0,
A M S Ophthalmic Opticians,OP_5K9_632__000002_CR82HA,OPT,15 Purley Road,,Purley,,,CR8 2HA,Tel: 020 8660 0472, - ,,,15 ratings Rate it yourself - /Services/opticians/LeaveReview/DefaultView.aspx?id=OP_5K9_632__000002_CR82HA,,,
Tesco Opticians,CR82HA060716,OPT,,8 Purley Road,,Purley,Surrey,CR8 2HA,Tel: 0208 218 9438, - ,,,No ratings yet Rate it yourself - /Services/opticians/LeaveReview/DefaultView.aspx?id=CR82HA060716,0,0,
Rawling & Sons Ltd,OP_5K9_10711__000001_CR22LP,OPT,946 Brighton Road,Purley,,Surrey,Surrey,CR8 2LP,Tel: 020 8660 3271, - ,,,No ratings yet Rate it yourself - /Services/opticians/LeaveReview/DefaultView.aspx?id=OP_5K9_10711__000001_CR22LP,0,0,
Pursers Optometrists,OP_5K9_956__000001_CR82LA,OPT,,958 Brighton Road,Purley,Croydon,,CR8 2LP,Tel: 020 8660 2147, - ,,,No ratings yet Rate it yourself - /Services/opticians/LeaveReview/DefaultView.aspx?id=OP_5K9_956__000001_CR82LA,0,0,
Costco Wholesale,OP_CR04RR_46729,OPT,,23-29 Imperial Way,,Croydon,,CR0 4RR,Tel: 0208 253 4115, - ,,,No ratings yet Rate it yourself - /Services/opticians/LeaveReview/DefaultView.aspx?id=OP_CR04RR_46729,0,0,
Optilabs Ltd,OP_5K9_12617__000001_CR04NN,OPT,109 Stafford Road,,Croydon,,,CR0 4NN,Tel: 020 8686 5708, - ,,,2 ratings Rate it yourself - /Services/opticians/LeaveReview/DefaultView.aspx?id=OP_5K9_12617__000001_CR04NN,,,
Specsavers Opticians,16797__000002_SE207PF,OPT,191 High Street,,Penge,London,,SE20 7PF,Tel: 020 8659 4040, - ,,,No ratings yet Rate it yourself - /Services/opticians/LeaveReview/DefaultView.aspx?id=16797__000002_SE207PF,0,0,
Boots-Petts Wood,BR5 1DE__000001_BR51DE,OPT,12 Chatsworth Parade,,,Petts Wood,Kent,BR5 1DF,Tel: 01689 823 250, - ,,,No ratings yet Rate it yourself - /Services/opticians/LeaveReview/DefaultView.aspx?id=BR5 1DE__000001_BR51DE,0,0,
Steven Harris Opticians,OP_5A7_831__000002_BR51NA,OPT,16 Station Square,Petts Wood,Orpington,Kent,,BR5 1NA,Tel: 01689 831726, - ,,,No ratings yet Rate it yourself - /Services/opticians/LeaveReview/DefaultView.aspx?id=OP_5A7_831__000002_BR51NA,0,0,
Boots-Thornton Heath,OP_5K9_742__000001_CR78RY,OPT,87 High Street,,,Thornton Heath,Surrey,CR7 8RY,Tel: 0208 684 1155, - ,,,No ratings yet Rate it yourself - /Services/opticians/LeaveReview/DefaultView.aspx?id=OP_5K9_742__000001_CR78RY,0,0,yes
Maxivise Eyecare Centre,OP_5A7_1649__000001_SE207HB,OPT,,88 High Street,London,Penge,,SE20 7HB,Tel: 020 8659 4342, - ,,,No ratings yet Rate it yourself - /Services/opticians/LeaveReview/DefaultView.aspx?id=OP_5A7_1649__000001_SE207HB,0,0,
Boots-Croydon - London Rd,OP_5K9_2446__000001_CR76AR,OPT,511 London Road,,Thornton Heath,Croydon,Surrey,CR7 6AR,Tel: 0208 689 5565, - ,,,2 ratings Rate it yourself - /Services/opticians/LeaveReview/DefaultView.aspx?id=OP_5K9_2446__000001_CR76AR,,,
Points Of View Opticians,OP_5LF_10152__000002_BR14PQ,OPT,495a Bromley Road,,Bromley,Kent,,BR1 4PQ,Tel: 020 8697 2321, - ,,,No ratings yet Rate it yourself - /Services/opticians/LeaveReview/DefaultView.aspx?id=OP_5LF_10152__000002_BR14PQ,0,0,
Tesco Opticians,5A7:15__000002_BR60NH,OPT,9 Augustus Lane,Orpington,Orpington,Kent,,BR6 0NH,, - ,,,No ratings yet Rate it yourself - /Services/opticians/LeaveReview/DefaultView.aspx?id=5A7:15__000002_BR60NH,0,0,
Asda Opticians,OPT_CR0 4XS,OPT,,Marlow Way,,Croydon,,CR0 4XS,Tel: 0208 6837614, - ,,,1 rating Rate it yourself - /Services/opticians/LeaveReview/DefaultView.aspx?id=OPT_CR0 4XS,,,
William J Wilkinson Limited,OP_5A7_470__000001_BR60PD,OPT,277 High Street,,Orpington,,,BR6 0NW,Tel: 01689 820866, - ,,,No ratings yet Rate it yourself - /Services/opticians/LeaveReview/DefaultView.aspx?id=OP_5A7_470__000001_BR60PD,0,0,
The Eye Centre,00-1411 - 00-1410__000001_CR77PA,OPT,830 London Road,Thornton Heath,,Croydon,,CR7 7PA,Tel: 020 8689 0011, - ,,,No ratings yet Rate it yourself - /Services/opticians/LeaveReview/DefaultView.aspx?id=00-1411 - 00-1410__000001_CR77PA,0,0,
Boots-Orpington - High St,OP_5A7_10401__000002_BR60LS,OPT,232 High Street,,,Orpington,Kent,BR6 0LS,Tel: 01689 820 848, - ,,,No ratings yet Rate it yourself - /Services/opticians/LeaveReview/DefaultView.aspx?id=OP_5A7_10401__000002_BR60LS,0,0,
Rawling & Sons (Opticians) Ltd,OP_5KQ_12732__000001_CR36QB,OPT,2-4 Croydon Road,,,Caterham,Surrey,CR3 6QB,Tel: 01883 343370, - ,,,No ratings yet Rate it yourself - /Services/opticians/LeaveReview/DefaultView.aspx?id=OP_5KQ_12732__000001_CR36QB,0,0,
Eye Matrix Ltd,10007__000001_CR51HE,OPT,DOMICILIARY SERVICE ONLY,,,Old Coulsdon,Surrey,CR5 1HE,Tel: 0800 612 3144, - ,,,No ratings yet Rate it yourself - /Services/opticians/LeaveReview/DefaultView.aspx?id=10007__000001_CR51HE,0,0,
Boots Opticians ,OP_5A7_6080__000002_BR60JN,OPT,194 High Street,,Orpington,,,BR6 0JN,Tel: 01689 891303, - ,,,No ratings yet Rate it yourself - /Services/opticians/LeaveReview/DefaultView.aspx?id=OP_5A7_6080__000002_BR60JN,0,0,
Eye Contact Vision Clinic,OPT_SM69BS_1,OPT,,152 Stafford Road,,Wallington,,SM6 9BS,Tel: 020 8773 3888, - ,,,No ratings yet Rate it yourself - /Services/opticians/LeaveReview/DefaultView.aspx?id=OPT_SM69BS_1,0,0,
Specsavers Opticians,BR6 0TW__000001_BR60TW,OPT,,175 High Street,,Orpington,Kent,BR6 0LW,Tel: 01689 890 168, - ,,,No ratings yet Rate it yourself - /Services/opticians/LeaveReview/DefaultView.aspx?id=BR6 0TW__000001_BR60TW,0,0,
Boots-Caterham,CR3 6LB_18273,OPT,,15-17 Station Avenue,,Caterham,Surrey,CR3 6LB,Tel: 01883 337645, - ,,,No ratings yet Rate it yourself - /Services/opticians/LeaveReview/DefaultView.aspx?id=CR3 6LB_18273,0,0,
Boots Opticians (Caterham),OPT_CR36LB_1,OPT,,15-17 Station Avenue,,Caterham,Surrey,CR3 6LB,Tel: 01883 337645, - ,,,2 ratings Rate it yourself - /Services/opticians/LeaveReview/DefaultView.aspx?id=OPT_CR36LB_1,,,
Specsavers Opticians,00000831__000003_CR36RT,OPT,,10 Church Walk Shopping Centre,,Caterham,Surrey,CR3 6RT,Tel: 01883 333 830, - ,,,No ratings yet Rate it yourself - /Services/opticians/LeaveReview/DefaultView.aspx?id=00000831__000003_CR36RT,0,0,
R Woodfall Opticians,OP_5LF_6203__000003_SE265QW,OPT,6 Sydenham Road,,London,,,SE26 5QW,Tel: 020 8778 4557, - ,,,1 rating Rate it yourself - /Services/opticians/LeaveReview/DefaultView.aspx?id=OP_5LF_6203__000003_SE265QW,,,
Miller & Son (Opticians) Ltd,OP_5K9_9904__000001_SE192ET,OPT,28-30 Church Road,,London,,,SE19 2ET,Tel: 020 8653 1366, - ,,,No ratings yet Rate it yourself - /Services/opticians/LeaveReview/DefaultView.aspx?id=OP_5K9_9904__000001_SE192ET,0,0,
Jay Opticians,OP_5LF_10821__000002_SE265EX,OPT,23 Sydenham Road,,London,,,SE26 5EX,Tel: 020 8778 7956, - ,,,No ratings yet Rate it yourself - /Services/opticians/LeaveReview/DefaultView.aspx?id=OP_5LF_10821__000002_SE265EX,0,0,
Crystal Eye Centre,OP_5K9_14393__000002_SE191XX,OPT,20 Westow Hill,Upper Norwood,,London,,SE19 1RX,Tel: 0208 766 7476, - ,,,No ratings yet Rate it yourself - /Services/opticians/LeaveReview/DefaultView.aspx?id=OP_5K9_14393__000002_SE191XX,0,0,
Coulsdon Opticians,OP_5K9_7089__000001_CR52NJ,OPT,141 Brighton Road,,Coulsdon,,,CR5 2NJ,Tel: 020 8660 7343, - ,,,No ratings yet Rate it yourself - /Services/opticians/LeaveReview/DefaultView.aspx?id=OP_5K9_7089__000001_CR52NJ,0,0,
Grove Park opticians,OP_5LF__000003_SE120EF,OPT,384 Baring Road,Grove Park,London,,,SE12 0EF,, - ,,,No ratings yet Rate it yourself - /Services/opticians/LeaveReview/DefaultView.aspx?id=OP_5LF__000003_SE120EF,0,0,
Oakmead Opticians,02991__000002_BR75LX,OPT,Sunnyways,Prince Imperial Way,Chislehurst,Kent,,BR7 5LX,, - ,,,1 rating Rate it yourself - /Services/opticians/LeaveReview/DefaultView.aspx?id=02991__000002_BR75LX,,,
SPECSAVERS,SM6 0LY__000002_SM60LY,OPT,,76 Woodcote Road,,Wallington,Surrey,SM6 0LY,Tel: 0208 835 3680, - ,,,1 rating Rate it yourself - /Services/opticians/LeaveReview/DefaultView.aspx?id=SM6 0LY__000002_SM60LY,,,
For Your Eyes,OP_5M7_14651__000001_SM60LY,OPT,,116 Woodcote Road,,Wallington,Surrey,SM6 0LY,Tel: 0208 647 3644, - ,,,No ratings yet Rate it yourself - /Services/opticians/LeaveReview/DefaultView.aspx?id=OP_5M7_14651__000001_SM60LY,0,0,
Wallington Opticians,OPT_SM60LY_1,OPT,,116 Woodcote Road,,Wallington,Surrey,SM6 0LY,Tel: 020 8647 3644, - ,,,No ratings yet Rate it yourself - /Services/opticians/LeaveReview/DefaultView.aspx?id=OPT_SM60LY_1,0,0,
Punch Opticians,OP_5LG_14644__000002_SM60NN,OPT,400 Garrett Lane,,Wandsworth,,,SM6 0NN,Tel: 0208 669 2631, - ,,,No ratings yet Rate it yourself - /Services/opticians/LeaveReview/DefaultView.aspx?id=OP_5LG_14644__000002_SM60NN,0,0,
Linklater & Warren Opticians,RL_04122014_CO-4763,OPT,,30a High Street,,Chislehurst,Kent,BR7 5AN,Tel: 020 8295 5131, - ,,,2 ratings Rate it yourself - /Services/opticians/LeaveReview/DefaultView.aspx?id=RL_04122014_CO-4763,,,no
Barlindene Ltd,OP_5M7_7788__000001_SM67NY,OPT,,381 Croydon Road,,Wallington,Surrey,SM6 7NY,Tel: 0208 647 8992, - ,,,No ratings yet Rate it yourself - /Services/opticians/LeaveReview/DefaultView.aspx?id=OP_5M7_7788__000001_SM67NY,0,0,
London Eye Care Centre,OPT_SW164AH_1,OPT,,1415 London Road,,London,,SW16 4AH,Tel: 0208 679 0955, - ,,,No ratings yet Rate it yourself - /Services/opticians/LeaveReview/DefaultView.aspx?id=OPT_SW164AH_1,0,0,
London Eye Care Centre,OP_5K9_1006__000001_SW164AH,OPT,1415 London Road,,,London,,SW16 4AH,Tel: 020 8679 0955, - ,,,No ratings yet Rate it yourself - /Services/opticians/LeaveReview/DefaultView.aspx?id=OP_5K9_1006__000001_SW164AH,0,0,
Vision Express (UK) Limited,BR5 3RP__000001_BR53RP,OPT,"Unit 9,",Nugent Shopping Park,Orpington,Kent,,BR5 3RP,Tel: 01689 875737, - ,,,No ratings yet Rate it yourself - /Services/opticians/LeaveReview/DefaultView.aspx?id=BR5 3RP__000001_BR53RP,0,0,
Batemans (Opticians) Ltd,OP_5KQ_10850__000001_RH80QE,OPT,,149 Station Road East,,Oxted,Surrey,RH8 0QE,Tel: 01883 715 510, - ,,,No ratings yet Rate it yourself - /Services/opticians/LeaveReview/DefaultView.aspx?id=OP_5KQ_10850__000001_RH80QE,0,0,
Hatton Opticians,OP_5LF_234__000001_SE232ND,OPT,4 Westbourne Terrace,,London,,,SE23 2ND,Tel: 020 8699 5575, - ,,,No ratings yet Rate it yourself - /Services/opticians/LeaveReview/DefaultView.aspx?id=OP_5LF_234__000001_SE232ND,0,0,
Jonathan Kerr Optometrists,TP454,OPT,80 Station Road East,80 Station Road East,Oxted,Surrey,,RH8 0PG,Tel: 01883 722 808, - ,,,No ratings yet Rate it yourself - /Services/opticians/LeaveReview/DefaultView.aspx?id=TP454,0,0,
Thakar Opticians,OP_5KQ_14541__000001_RH80AX,OPT,,81 Station Road East,,Oxted,Surrey,RH8 0AX,Tel: 01883 714 696, - ,,,No ratings yet Rate it yourself - /Services/opticians/LeaveReview/DefaultView.aspx?id=OP_5KQ_14541__000001_RH80AX,0,0,
Marratt & Ellis,OP_5LF_10028__000001_SE233HF,OPT,50 London Road,,London,,,SE23 3HF,Tel: 020 8699 3196, - ,,,No ratings yet Rate it yourself - /Services/opticians/LeaveReview/DefaultView.aspx?id=OP_5LF_10028__000001_SE233HF,0,0,
Specsavers Opticians (Oxted),OPT_RH80BD_1,OPT,,25 Station Road East,,Oxted,Surrey,RH8 0BD,Tel: 01883 772288, - ,,,1 rating Rate it yourself - /Services/opticians/LeaveReview/DefaultView.aspx?id=OPT_RH80BD_1,,,
Brian Ashby Opticians Ltd,TP425,OPT,,"24 West Park, Mottingham",,London,,SE9 4RQ,Tel: 020 8851 7422, - ,,,No ratings yet Rate it yourself - /Services/opticians/LeaveReview/DefaultView.aspx?id=TP425,0,0,
Ronald Brown Opticians,OP_5LF_1993__000002_SE64HQ,OPT,154 Rushey Green,,Catford,London,,SE6 4HQ,Tel: 020 8690 6788, - ,,,1 rating Rate it yourself - /Services/opticians/LeaveReview/DefaultView.aspx?id=OP_5LF_1993__000002_SE64HQ,,,
Catford Specsavers,5LF 41__000003_SE64HQ,OPT,,130-134 Rushey Green,Catford,London,,SE6 4HQ,Tel: 02083142370, - ,,,1 rating Rate it yourself - /Services/opticians/LeaveReview/DefaultView.aspx?id=5LF 41__000003_SE64HQ,,,
K Rowland Ltd,OP_5LF_8908__000003_SE64HW,OPT,112 Rushey Green,,London,Catford,,SE6 4HW,Tel: 020 8690 7734, - ,,,No ratings yet Rate it yourself - /Services/opticians/LeaveReview/DefaultView.aspx?id=OP_5LF_8908__000003_SE64HW,0,0,
Roger Pope & Partners,OP_5LE_4217__000002_SE217BN,OPT,96 Park Hall Road,,,London,,SE21 8BW,Tel: 020 8299 0230, - ,,,No ratings yet Rate it yourself - /Services/opticians/LeaveReview/DefaultView.aspx?id=OP_5LE_4217__000002_SE217BN,0,0,
Westerham Eye Care,TN16 1RF,OPT,,18 High Street,,Westerham,,TN16 1RF,Tel: 01959447611, - ,,,1 rating Rate it yourself - /Services/opticians/LeaveReview/DefaultView.aspx?id=TN16 1RF,,,
The London Eye Care Centre,OP_5LD_11088__000001_SE270HY,OPT,30 Knights Hill,,London,,,SE27 0HY,Tel: 020 8670 1845, - ,,,1 rating Rate it yourself - /Services/opticians/LeaveReview/DefaultView.aspx?id=OP_5LD_11088__000001_SE270HY,,,
Visionary Eyecare Limited,OP_5EA_14803__000001_SW165RT,OPT,24 Westwell Road,,London,,,SW16 5RT,Tel: 0800 052 0355, - ,,,No ratings yet Rate it yourself - /Services/opticians/LeaveReview/DefaultView.aspx?id=OP_5EA_14803__000001_SW165RT,0,0,
R Woodfall Opticians,OP_5LD_667__000001_SE279AF,OPT,286 Norwood Road,,London,,,SE27 9AF,Tel: 020 8670 4100, - ,,,No ratings yet Rate it yourself - /Services/opticians/LeaveReview/DefaultView.aspx?id=OP_5LD_667__000001_SE279AF,0,0,
J S Robin,OP_5LD_3788__000001_SW162DQ,OPT,Whittington Centre,11-13 Rutford Road,London,,,SW16 2DQ,Tel: 020 3049 5323, - ,,,No ratings yet Rate it yourself - /Services/opticians/LeaveReview/DefaultView.aspx?id=OP_5LD_3788__000001_SW162DQ,0,0,