Organisation Name,NACS Code,Organisation Type,Address1,Address2,Address3,Address4,Address5,PostCode,Telephone Number,Opening time,Value  (Opening time),Banding Classification  (Opening time),NHS.UK users rating,Value  (NHS.UK users rating),Banding Classification  (NHS.UK users rating),Car parking (Is there car parking at this organisation?)
K A Heath,OP_5HN_14730__000001_DE451BT,OPT,Burgons Buildings,Bath Gardens,Bakewell,Derbyshire,,DE45 1BT,Tel: 01629 813532, - ,,,No ratings yet Rate it yourself - /Services/opticians/LeaveReview/DefaultView.aspx?id=OP_5HN_14730__000001_DE451BT,0,0,
The Eye Place,OP_5HN_12438__000001_DE451HD,OPT,4 Royal Oak Place,Matlock Street,,Bakewell,Derbyshire,DE45 1HD,Tel: 01629 813603, - ,,,No ratings yet Rate it yourself - /Services/opticians/LeaveReview/DefaultView.aspx?id=OP_5HN_12438__000001_DE451HD,0,0,
Hope Valley Opticians Ltd,00568__000001_S321DQ,OPT,Unit 5b Hathersage Park,Heather Lane,Hathersage,,,S32 1DP,Tel: 01433 659565, - ,,,No ratings yet Rate it yourself - /Services/opticians/LeaveReview/DefaultView.aspx?id=00568__000001_S321DQ,0,0,
C & N Witham Ltd,OP_5EA_14799__000001_S419SD,OPT,2 Abbey Croft,,Cutthorpe,Chesterfield,,S41 9SB,Tel: 01246 297001, - ,,,No ratings yet Rate it yourself - /Services/opticians/LeaveReview/DefaultView.aspx?id=OP_5EA_14799__000001_S419SD,0,0,
Martyn Kemp Opticians,OP_5EP_13324__000002_S174DL,OPT,63 Baslow Road,Totley,Sheffield,,,S17 4DL,Tel: 0114 236 4485, - ,,,No ratings yet Rate it yourself - /Services/opticians/LeaveReview/DefaultView.aspx?id=OP_5EP_13324__000002_S174DL,0,0,
Lorraine Bonete Opticians,00566__000001_S188UE,OPT,Gosforth Valley Medical Centre,,Dronfield Woodhouse,Derbyshire,,S18 8UE,Tel: 01246 292088, - ,,,No ratings yet Rate it yourself - /Services/opticians/LeaveReview/DefaultView.aspx?id=00566__000001_S188UE,0,0,
Dore Opticians,OP_5EP_1672__000002_S173GD,OPT,,25 Townhead Road,Dore,Sheffield,,S17 3GD,Tel: 0114 327 3737, - ,,,No ratings yet Rate it yourself - /Services/opticians/LeaveReview/DefaultView.aspx?id=OP_5EP_1672__000002_S173GD,0,0,
The Eye Place,,OPT,,28 Causeway Head Road,,Sheffield,,S17 3DT,Tel: 01144300028, - ,,,N/A - Data not available,,,
Ian Truelove (Optometrist) Ltd,OP_5N4_2648__000003_S64GU,OPT,100 Causeway Head Road,,Sheffield,,,S17 3DW,Tel: 0114 2620123, - ,,,No ratings yet Rate it yourself - /Services/opticians/LeaveReview/DefaultView.aspx?id=OP_5N4_2648__000003_S64GU,0,0,
Lawrence and Jenkinson,OP_5EG_14738__000001_S181PP,OPT,Yorkshire House,Civic Centre,Dronfield,Sheffield,,S18 1PD,Tel: 01246 291999, - ,,,No ratings yet Rate it yourself - /Services/opticians/LeaveReview/DefaultView.aspx?id=OP_5EG_14738__000001_S181PP,0,0,
Thomas & Holloway (Opticians),OP_5EG_9992__000001_S182XA,OPT,33 Chesterfield Road,,Dronfield,,,S18 2XA,Tel: 01246 419408, - ,,,No ratings yet Rate it yourself - /Services/opticians/LeaveReview/DefaultView.aspx?id=OP_5EG_9992__000001_S182XA,0,0,
B Davies,OP_5EA_8221__000001_S401BA,OPT,73 West Bars,,Chesterfield,,,S40 1BA,Tel: 01246 273069, - ,,,No ratings yet Rate it yourself - /Services/opticians/LeaveReview/DefaultView.aspx?id=OP_5EA_8221__000001_S401BA,0,0,
Watson & Jenkins Opticians Ltd,OL2238/5N6__000001_S401PA,OPT,86 Saltergate,Chesterfield,Derbyshire,.,,S40 1LG,Tel: 01246 205792, - ,,,No ratings yet Rate it yourself - /Services/opticians/LeaveReview/DefaultView.aspx?id=OL2238/5N6__000001_S401PA,0,0,
"Elliott, AG & Heath, RA",OP_5EA_2593__000001_S417QA,OPT,79 Newbold Road,,Chesterfield,,,S41 7QA,Tel: 01246 275847, - ,,,No ratings yet Rate it yourself - /Services/opticians/LeaveReview/DefaultView.aspx?id=OP_5EA_2593__000001_S417QA,0,0,
Crown Optical Centre,OP_5EA_14787__000001_S401JN,OPT,4 and 6 Soresby Street,Chesterfield,Derbyshire,,,S40 1JN,Tel: 01246 200209, - ,,,No ratings yet Rate it yourself - /Services/opticians/LeaveReview/DefaultView.aspx?id=OP_5EA_14787__000001_S401JN,0,0,
Boots-Chesterfield - Low Pavement (in Boots UK),OP_5EA_3089__000003_S401PB,OPT,35-37 Low Pavement,,,Chesterfield,Derbyshire,S40 1PB,Tel: 01246 204693, - ,,,No ratings yet Rate it yourself - /Services/opticians/LeaveReview/DefaultView.aspx?id=OP_5EA_3089__000003_S401PB,0,0,
Boots Opticians,OP_5EA_1576__000002_S401PQ,OPT,,35-37 Low Pavement,,Chesterfield,,S40 1PB,Tel: 01246 204693, - ,,,No ratings yet Rate it yourself - /Services/opticians/LeaveReview/DefaultView.aspx?id=OP_5EA_1576__000002_S401PQ,0,0,
Scrivens Optical and Hearing,OP_5EA_2134__000001_S401PW,OPT,21 Market Place,,,Chesterfield,Derbyshire,S40 1PJ,Tel: 01246 232747, - ,,,No ratings yet Rate it yourself - /Services/opticians/LeaveReview/DefaultView.aspx?id=OP_5EA_2134__000001_S401PW,0,0,
Lancaster & Thorpe Ltd,OP_5EA_2059__000002_S401RQ,OPT,5 Low Pavement,,,Chesterfield,Derbyshire,S40 1PF,Tel: 01246 234205, - ,,,No ratings yet Rate it yourself - /Services/opticians/LeaveReview/DefaultView.aspx?id=OP_5EA_2059__000002_S401RQ,0,0,no
Ray-Lewis Opticians,TP4CW,OPT,7 Packers Row,7 Packers Row,Derbyshire,Chesterfield,,S40 1RB,Tel: 01246 551115, - ,,,No ratings yet Rate it yourself - /Services/opticians/LeaveReview/DefaultView.aspx?id=TP4CW,0,0,
Specsavers Opticians,OP_5EA_14786__000002_S401RB,OPT,2 Burlington Street,,Chesterfield,Derbyshire,,S40 1RB,Tel: 01246 222334, - ,,,No ratings yet Rate it yourself - /Services/opticians/LeaveReview/DefaultView.aspx?id=OP_5EA_14786__000002_S401RB,0,0,
Vision Express (UK) Ltd,OP_5EA_7070__000001_S401PY,OPT,"Unit 4, 10 Steeplegate",Vicar Lane Shopping Centre,Chesterfield,,,S40 1PY,Tel: 01246 277432, - ,,,No ratings yet Rate it yourself - /Services/opticians/LeaveReview/DefaultView.aspx?id=OP_5EA_7070__000001_S401PY,0,0,
Crown Eyeglass (Manufacturing Opticians),OP_5EA_14802__000001_S417SA,OPT,15 Holywell Street,Chesterfield,Derbyshire,,,S41 7SA,Tel: 01246 277025, - ,,,No ratings yet Rate it yourself - /Services/opticians/LeaveReview/DefaultView.aspx?id=OP_5EA_14802__000001_S417SA,0,0,
David Bray Opticians,OP_5HN_9217__000001_DE43AQ,OPT,6 Bank Road,,Matlock,Derby,Derbyshire,DE4 3AQ,Tel: 01629 584280, - ,,,No ratings yet Rate it yourself - /Services/opticians/LeaveReview/DefaultView.aspx?id=OP_5HN_9217__000001_DE43AQ,0,0,
Lancaster and Thorpe,OP_5HN_14732__000002_DE43AR,OPT,,13 Causeway Lane,,Matlock,Derbyshire,DE4 3AR,Tel: 01629 582590, - ,,,No ratings yet Rate it yourself - /Services/opticians/LeaveReview/DefaultView.aspx?id=OP_5HN_14732__000002_DE43AR,0,0,no
Tesco Opticians,S417BJ__000001_S417JB,OPT,,Lockerford Lane,,Chesterfield,,S41 7JB,Tel: 0845 601 3479, - ,,,No ratings yet Rate it yourself - /Services/opticians/LeaveReview/DefaultView.aspx?id=S417BJ__000001_S417JB,0,0,
Dale Opticians,OP_DE43LT_46230,OPT,1 Dale Road,,,Matlock,,DE4 3LT,Tel: 01629 57751, - ,,,No ratings yet Rate it yourself - /Services/opticians/LeaveReview/DefaultView.aspx?id=OP_DE43LT_46230,0,0,
Victoria J Smith Opticians,OPT_S72LH_1,OPT,26 Terminus Road,,,Sheffield,,S7 2LH,Tel: 0114 262 1955, - ,,,No ratings yet Rate it yourself - /Services/opticians/LeaveReview/DefaultView.aspx?id=OPT_S72LH_1,0,0,
Boyden-Hare Opticians,OP-5N4__000003_S117PX,OPT,276 Ringinglow Road,,Sheffield,South Yorkshire,,S11 7PX,Tel: 0114 230 7888, - ,,,No ratings yet Rate it yourself - /Services/opticians/LeaveReview/DefaultView.aspx?id=OP-5N4__000003_S117PX,0,0,
Tesco Opticians,OP_S72QB_29805,OPT,,"Tesco Stores Ltd, Abbeydale Drive",,Sheffield,,S7 2QB,Tel: 0845 601 3479, - ,,,No ratings yet Rate it yourself - /Services/opticians/LeaveReview/DefaultView.aspx?id=OP_S72QB_29805,0,0,
Boyden-Hare Opticians,OP-5N4-0001__000001_S104GA,OPT,8 Brooklands Avenue,Fulwood,Sheffield,South Yorkshire,,S10 4GA,Tel: 0114 230 3065, - ,,,No ratings yet Rate it yourself - /Services/opticians/LeaveReview/DefaultView.aspx?id=OP-5N4-0001__000001_S104GA,0,0,
Alex Gage Opticians,OP_5EP_6453__000001_S80SQ,OPT,Alex Gage Opticians,857 Chesterfield Road,,Sheffield,,S8 0SQ,Tel: 0114 274 8582, - ,,,No ratings yet Rate it yourself - /Services/opticians/LeaveReview/DefaultView.aspx?id=OP_5EP_6453__000001_S80SQ,0,0,
Lawrence Jenkinson Opticians,OP_5EP_1848__000001_S80SF,OPT,784 Chesterfield Road,,Sheffield,,,S8 0SF,Tel: 0114 255 4490, - ,,,No ratings yet Rate it yourself - /Services/opticians/LeaveReview/DefaultView.aspx?id=OP_5EP_1848__000001_S80SF,0,0,
Chesterfield Royal Hospital,OP_5EA_11486__000002_S445BL,OPT,Eye Department,Calow,,Chesterfield,,S44 5BL,Tel: 01246 277271, - ,,,No ratings yet Rate it yourself - /Services/opticians/LeaveReview/DefaultView.aspx?id=OP_5EA_11486__000002_S445BL,0,0,
David Inman Opticians,OP_5EP_12553__000002_S118TR,OPT,902 Ecclesall Road,,Sheffield,,,S11 8TR,Tel: 0114 266 3377, - ,,,No ratings yet Rate it yourself - /Services/opticians/LeaveReview/DefaultView.aspx?id=OP_5EP_12553__000002_S118TR,0,0,
Martyn Kemp Opticians,OP_5EP_3416__000001_S72BG,OPT,634 Abbeydale Road,,Sheffield,,,S7 2BA,Tel: 0114 255 6554, - ,,,No ratings yet Rate it yourself - /Services/opticians/LeaveReview/DefaultView.aspx?id=OP_5EP_3416__000001_S72BG,0,0,
Meersbrook Optical Centre,OP-5N4-0004__000004_S80RT,OPT,243-245 Chesterfield Road,Meersbrook,Sheffield,South Yorkshire,,S8 0RT,Tel: 0114 279 9900, - ,,,No ratings yet Rate it yourself - /Services/opticians/LeaveReview/DefaultView.aspx?id=OP-5N4-0004__000004_S80RT,0,0,
Eyefinity Ltd,OP_5EN_13330__000001_S12\HN,OPT,,243-245 Chesterfield Road,,Sheffield,,S8 0RT,Tel: 0114 279 9900, - ,,,No ratings yet Rate it yourself - /Services/opticians/LeaveReview/DefaultView.aspx?id=OP_5EN_13330__000001_S12\HN,0,0,
Daybell & Choo Optometrists,OP_5EP_13320__000001_S118ZL,OPT,,290-294 Sharrowvale Road,Hunters Bar,Sheffield,,S11 8ZL,Tel: 0114 267 1828, - ,,,No ratings yet Rate it yourself - /Services/opticians/LeaveReview/DefaultView.aspx?id=OP_5EP_13320__000001_S118ZL,0,0,
Insight Opticians,OP_5EN_3688__000001_S118PX,OPT,434 Ecclesall Road,Ecclesall,Sheffield,,,S11 8PX,Tel: 0114 266 0945, - ,,,No ratings yet Rate it yourself - /Services/opticians/LeaveReview/DefaultView.aspx?id=OP_5EN_3688__000001_S118PX,0,0,
Tesco Opticians,C/19982__000002_S459AE,OPT,Bridge Street,Clay Cross,Chesterfield,,,S45 9AE,, - ,,,No ratings yet Rate it yourself - /Services/opticians/LeaveReview/DefaultView.aspx?id=C/19982__000002_S459AE,0,0,
Alex Gage Opticians,OP_5EP_10287__000001_S105BB,OPT,48 Sandygate Road,Crosspool,,Sheffield,,S10 5RY,Tel: 0114 266 7066, - ,,,No ratings yet Rate it yourself - /Services/opticians/LeaveReview/DefaultView.aspx?id=OP_5EP_10287__000001_S105BB,0,0,
Boots-Sheffield - Queens Rd,OP_5EQ_2778__000001_S24DX,OPT,633 Queens Road,,Heeley,Sheffield,,S2 4DX,Tel: 0114 250 0690, - ,,,No ratings yet Rate it yourself - /Services/opticians/LeaveReview/DefaultView.aspx?id=OP_5EQ_2778__000001_S24DX,0,0,
GF Lewis Opticians,OP_5EG_14739__000001_S459PE,OPT,36 Eldon Street,Clay Cross,Chesterfield,,,S45 9PE,Tel: 01246 863197, - ,,,No ratings yet Rate it yourself - /Services/opticians/LeaveReview/DefaultView.aspx?id=OP_5EG_14739__000001_S459PE,0,0,
David Inman Opticians,OP_5N4_2559__000002_S103BD,OPT,265 Fulwood Road,,Sheffield,South Yorkshire,,S10 3BD,Tel: 0114 2662292, - ,,,No ratings yet Rate it yourself - /Services/opticians/LeaveReview/DefaultView.aspx?id=OP_5N4_2559__000002_S103BD,0,0,
IKON Eyewear,OL73175N6__000002_S459JE,OPT,5 B Market Street,Clay Cross,Chesterfield,Derbyshire,,S45 9JE,Tel: 01246 250377, - ,,,No ratings yet Rate it yourself - /Services/opticians/LeaveReview/DefaultView.aspx?id=OL73175N6__000002_S459JE,0,0,
J Harvey & Co,OP_5EQ_2947__000001_S24LT,OPT,160 London Road,,Sheffield,,,S2 4LT,Tel: 0114 255 0707, - ,,,No ratings yet Rate it yourself - /Services/opticians/LeaveReview/DefaultView.aspx?id=OP_5EQ_2947__000001_S24LT,0,0,
Westfield Opticians,OP_5EQ_7054__000001_S123GG,OPT,201 White Lane,Gleadless,Sheffield,,,S12 3GG,Tel: 0114 264 6818, - ,,,No ratings yet Rate it yourself - /Services/opticians/LeaveReview/DefaultView.aspx?id=OP_5EQ_7054__000001_S123GG,0,0,
Peter Bland Opticians,OP_5EN_13319__000002_S102HP,OPT,339 Glossop Road,,Sheffield,,,S10 2HP,Tel: 0114 270 0803, - ,,,No ratings yet Rate it yourself - /Services/opticians/LeaveReview/DefaultView.aspx?id=OP_5EN_13319__000002_S102HP,0,0,
H S Eyecare,OP_5N4_3395__000001_S101TE,OPT,229 Crookes,Crookes,Sheffield,South Yorkshire,,S10 1TE,Tel: 0114 268 6000, - ,,,No ratings yet Rate it yourself - /Services/opticians/LeaveReview/DefaultView.aspx?id=OP_5N4_3395__000001_S101TE,0,0,yes
Scrivens Ltd,OP_5EN_4882__000001_S102HW,OPT,356 Glossop Road,,,Sheffield,Yorkshire,S10 2HW,Tel: 0114 272 5864, - ,,,No ratings yet Rate it yourself - /Services/opticians/LeaveReview/DefaultView.aspx?id=OP_5EN_4882__000001_S102HW,0,0,
Tesco Opticians,C/19982/5N6__000001_S459AE,OPT,Bridge Street,Clay Cross,,Chesterfield,,S45 9SL,Tel: 0845 601 3479, - ,,,No ratings yet Rate it yourself - /Services/opticians/LeaveReview/DefaultView.aspx?id=C/19982/5N6__000001_S459AE,0,0,
Armstrongs Opticians,OP_5EP_13318__000001_S122TA,OPT,198 Ridgeway Road,,Sheffield,,,S12 2TA,Tel: 0114 239 8388, - ,,,No ratings yet Rate it yourself - /Services/opticians/LeaveReview/DefaultView.aspx?id=OP_5EP_13318__000001_S122TA,0,0,
Specsavers Opticians,OP_5EN_9435__000001_S12HL,OPT,121-123 Pinstone Street,,Sheffield,,,S1 2HL,Tel: 0114 275 5121, - ,,,No ratings yet Rate it yourself - /Services/opticians/LeaveReview/DefaultView.aspx?id=OP_5EN_9435__000001_S12HL,0,0,
Dollond & Aitchison,OP_5EN_374__000001_S12HP,OPT,76 Pinstone Street,Sheffield,South Yorkshire,,,S1 2HP,Tel: 0114 272 0400, - ,,,No ratings yet Rate it yourself - /Services/opticians/LeaveReview/DefaultView.aspx?id=OP_5EN_374__000001_S12HP,0,0,
Forbes PL,OP_5EA_14792__000002_S433UU,OPT,T/A Jean Holmes Opticians,33 High Street,Staveley,,,S43 3UU,Tel: 01246 477199, - ,,,No ratings yet Rate it yourself - /Services/opticians/LeaveReview/DefaultView.aspx?id=OP_5EA_14792__000002_S433UU,0,0,
Martyn Kemp Opticians,OP_5EQ_12176__000001_S21GP,OPT,926-928 City Road,,,Sheffield,,S2 1GQ,Tel: 0114 239 7230, - ,,,No ratings yet Rate it yourself - /Services/opticians/LeaveReview/DefaultView.aspx?id=OP_5EQ_12176__000001_S21GP,0,0,
Bird Opticians,OP_5EN_13321__000001_S12LG,OPT,41/43 Surrey Street,,Sheffield,South Yorkshire,,S1 2LG,Tel: 0114 270 1423, - ,,,No ratings yet Rate it yourself - /Services/opticians/LeaveReview/DefaultView.aspx?id=OP_5EN_13321__000001_S12LG,0,0,
Scrivens Opticians Ltd,OP_5EN_11701__000001_S12GY,OPT,Alliance House,9 Leopold Street,,Sheffield,South Yorkshire,S1 2GY,Tel: 0114 272 7307, - ,,,No ratings yet Rate it yourself - /Services/opticians/LeaveReview/DefaultView.aspx?id=OP_5EN_11701__000001_S12GY,0,0,
Vision Express ,OP_5EN_6145__000001_S14PF,OPT,,41-43 Fargate,,Sheffield,,S1 2HD,Tel: 0114 278 0838, - ,,,No ratings yet Rate it yourself - /Services/opticians/LeaveReview/DefaultView.aspx?id=OP_5EN_6145__000001_S14PF,0,0,
Martyn Kemp Opticians,OP_5EN_6829__000001_S63TA,OPT,301 South Road,Walkley,Sheffield,,,S6 3TA,Tel: 0114 233 3083, - ,,,No ratings yet Rate it yourself - /Services/opticians/LeaveReview/DefaultView.aspx?id=OP_5EN_6829__000001_S63TA,0,0,
Boots-Sheffield - High Street,OP-5N4-0006__000003_S11QF,OPT,4-6 High Street,,Sheffield,South Yorkshire,,S1 1QF,Tel: 0114 276 1662, - ,,,No ratings yet Rate it yourself - /Services/opticians/LeaveReview/DefaultView.aspx?id=OP-5N4-0006__000003_S11QF,0,0,
Specialeyes NE ,OP-5N4-0005__000002_S11QH,OPT,T J Hughes,50 High Street,Sheffield,South Yorkshire,,S1 1QH,Tel: 0114 263 4147, - ,,,No ratings yet Rate it yourself - /Services/opticians/LeaveReview/DefaultView.aspx?id=OP-5N4-0005__000002_S11QH,0,0,
Carter Bailey Opticians,OP-5N4-3412__000002_S14JL,OPT,,Daisy Spring Works,2 Cornish Street,Sheffield,South Yorkshire,S3 8BU,Tel: 0114 272 5418, - ,,,No ratings yet Rate it yourself - /Services/opticians/LeaveReview/DefaultView.aspx?id=OP-5N4-3412__000002_S14JL,0,0,
A C Smith Opticians,OP-5N4-0002__000003_S25TR,OPT,7 Exchange Street,,Sheffield,South Yorkshire,,S2 5TR,Tel: 0114 275 2695, - ,,,No ratings yet Rate it yourself - /Services/opticians/LeaveReview/DefaultView.aspx?id=OP-5N4-0002__000003_S25TR,0,0,
Scrivens Ltd,OP_5EE_1083__000002_S38LB,OPT,36 Waingate,,Sheffield,Sheffield,Yorkshire,S3 8LB,Tel: 0114 272 3504, - ,,,No ratings yet Rate it yourself - /Services/opticians/LeaveReview/DefaultView.aspx?id=OP_5EE_1083__000002_S38LB,0,0,
Dollond & Aitchison,OP_5EE_553__000001_S38LB,OPT,4 Waingate,Sheffield,South Yorkshire,,,S3 8LB,Tel: 0114 272 0388, - ,,,No ratings yet Rate it yourself - /Services/opticians/LeaveReview/DefaultView.aspx?id=OP_5EE_553__000001_S38LB,0,0,
Portland Opticians,OP_5EG_4851__000001_S434DN,OPT,5 - 7 Southgate,Eckington,Sheffield,,,S21 4FS,Tel: 01246 432209, - ,,,No ratings yet Rate it yourself - /Services/opticians/LeaveReview/DefaultView.aspx?id=OP_5EG_4851__000001_S434DN,0,0,
Portland Opticians,OP_5EA_8615__000001_S319EG,OPT,53 Market Street,Eckington,Chesterfield,,,S31 9EG,Tel: 01246 432209, - ,,,No ratings yet Rate it yourself - /Services/opticians/LeaveReview/DefaultView.aspx?id=OP_5EA_8615__000001_S319EG,0,0,
Fosman Ltd,OP_5H7_9628__000001_DE44DR,OPT,7 St. John Street,Wirksworth,Derbyshire,,,DE4 4DR,Tel: 01629 825125, - ,,,No ratings yet Rate it yourself - /Services/opticians/LeaveReview/DefaultView.aspx?id=OP_5H7_9628__000001_DE44DR,0,0,
Premier Eyecare,OP-5N4-2653__000001_S62LR,OPT,3 Learoyd Way,,Sheffield,South Yorkshire,,S6 2LR,Tel: 0114 285 2696, - ,,,No ratings yet Rate it yourself - /Services/opticians/LeaveReview/DefaultView.aspx?id=OP-5N4-2653__000001_S62LR,0,0,
Ian Colin Truelove,OP_5EA_14808__000002_S64GU,OPT,13 Middlewood Road,Hillsborough,Sheffield,,,S6 4GU,Tel: 0114 2295967, - ,,,No ratings yet Rate it yourself - /Services/opticians/LeaveReview/DefaultView.aspx?id=OP_5EA_14808__000002_S64GU,0,0,
Martin Johnson Opticians Ltd,OP_5EN_12940__000001_S64GU,OPT,13 Middlewood Road,Hillsborough,Sheffield,,,S6 4GU,Tel: 0114 233 2600, - ,,,No ratings yet Rate it yourself - /Services/opticians/LeaveReview/DefaultView.aspx?id=OP_5EN_12940__000001_S64GU,0,0,
Hillsborough Specsavers Ltd,OP-5N4-12783__000001_S64GY,OPT,12-14 Middlewood Road,,Sheffield,South Yorkshire,,S6 4GY,Tel: 0114 283 4020, - ,,,No ratings yet Rate it yourself - /Services/opticians/LeaveReview/DefaultView.aspx?id=OP-5N4-12783__000001_S64GY,0,0,
Vision Insight Opticians,CO-5143,OPT,,"In store Unit 2, Wm Morrison Supermakets Plc, 699 Penistone Road",Hillsborough,Sheffield,South Yorkshire,S6 2GY,Tel: 0114 3830138, - ,,,No ratings yet Rate it yourself - /Services/opticians/LeaveReview/DefaultView.aspx?id=CO-5143,0,0,yes
Vision Insight Opticians,OPT_S62GY_1,OPT,,"In store Unit 2, Wm Morrison Supermakets Plc, 699 Penistone Road, Hillsborough",,Sheffield,,S6 2GY,, - ,,,No ratings yet Rate it yourself - /Services/opticians/LeaveReview/DefaultView.aspx?id=OPT_S62GY_1,0,0,
Vision Insight Opticians,OPT_S62GY_3,OPT,,"In store Unit 2, Wm Morrison Supermakets Plc, 699 Penistone Road, Hillsborough",,Sheffield,,S6 2GY,, - ,,,No ratings yet Rate it yourself - /Services/opticians/LeaveReview/DefaultView.aspx?id=OPT_S62GY_3,0,0,
Vision Insight Opticians,OPT_S62GY_2,OPT,,"In store Unit 2, Wm Morrison Supermakets Plc, 699 Penistone Road, Hillsborough",,Sheffield,,S6 2GY,, - ,,,No ratings yet Rate it yourself - /Services/opticians/LeaveReview/DefaultView.aspx?id=OPT_S62GY_2,0,0,
Vision Express (UK) Ltd,OPT_S64HA_1,OPT,,88 Middlewood Road,,"Hillsborough, Sheffield",South Yorkshire,S6 4HA,Tel: 0114 234 3638, - ,,,No ratings yet Rate it yourself - /Services/opticians/LeaveReview/DefaultView.aspx?id=OPT_S64HA_1,0,0,
Costco Wholesale UK Ltd,OPT_S94WU_2,OPT,,"Unit 8, The Parkway",1 Parkway Drive,Sheffield,,S9 4WU,Tel: 01142 427 605, - ,,,No ratings yet Rate it yourself - /Services/opticians/LeaveReview/DefaultView.aspx?id=OPT_S94WU_2,0,0,yes
Boots-Buxton,OP_5HN_14731__000001_SK176BE,OPT,4 Spring Gardens,,Derbyshire,Buxton,,SK17 6DE,Tel: 01298 22443, - ,,,No ratings yet Rate it yourself - /Services/opticians/LeaveReview/DefaultView.aspx?id=OP_5HN_14731__000001_SK176BE,0,0,
Specsavers Opticians,OP_5HN_12247__000001_SK176DE,OPT,Unit 14,Spring Gardens Centre,Buxton,,,SK17 6DE,Tel: 01298 766130, - ,,,No ratings yet Rate it yourself - /Services/opticians/LeaveReview/DefaultView.aspx?id=OP_5HN_12247__000001_SK176DE,0,0,
Buxton VE Ltd,VISION__000001_SK176DF,OPT,19 Spring Gardens Centre,,,Buxton,Derbyshire,SK17 6DF,Tel: 01298 214613, - ,,,No ratings yet Rate it yourself - /Services/opticians/LeaveReview/DefaultView.aspx?id=VISION__000001_SK176DF,0,0,
Barker S K,OP_5HN_14729__000001_SK178NF,OPT,The New Surgery,Parke Road,Tideswell,,,SK17 8NF,Tel: 01298 871396, - ,,,No ratings yet Rate it yourself - /Services/opticians/LeaveReview/DefaultView.aspx?id=OP_5HN_14729__000001_SK178NF,0,0,
M A Stoker & Partner,OP_5HN_10060__000001_SK176AS,OPT,5,The Grove,,Buxton,,SK17 6AS,Tel: 01298 23380, - ,,,No ratings yet Rate it yourself - /Services/opticians/LeaveReview/DefaultView.aspx?id=OP_5HN_10060__000001_SK176AS,0,0,
Asda Opticians,OPT_S20 7AB,OPT,,BEIGHTON ROAD EAST,,SHEFFIELD,,S20 7AB,Tel: 0114 229 1006, - ,,,No ratings yet Rate it yourself - /Services/opticians/LeaveReview/DefaultView.aspx?id=OPT_S20 7AB,0,0,
S K Barker,OP_5HN_293__000001_SK176AZ,OPT,4 The Square,,Buxton,,,SK17 6AZ,Tel: 01298 25361, - ,,,No ratings yet Rate it yourself - /Services/opticians/LeaveReview/DefaultView.aspx?id=OP_5HN_293__000001_SK176AZ,0,0,
The Glebe Field Centre,OP_5ED_13289__000002_DE45EU,OPT,Glebe Field Close,Crich,Derbyshire,,,DE4 5EU,Tel: 01773 857894, - ,,,No ratings yet Rate it yourself - /Services/opticians/LeaveReview/DefaultView.aspx?id=OP_5ED_13289__000002_DE45EU,0,0,
Parkhurst Opticians,OP_5EQ_13326__000001_S93FQ,OPT,439 Staniforth Road,,Sheffield,,,S9 3FQ,Tel: 0114 244 2271, - ,,,No ratings yet Rate it yourself - /Services/opticians/LeaveReview/DefaultView.aspx?id=OP_5EQ_13326__000001_S93FQ,0,0,
Robert Hughes Eyecare,OP_5EQ_9756__000001_S137JP,OPT,38 Chapel Street,Woodhouse,,Sheffield,South Yorkshire,S13 7JN,Tel: 0114 269 3521, - ,,,No ratings yet Rate it yourself - /Services/opticians/LeaveReview/DefaultView.aspx?id=OP_5EQ_9756__000001_S137JP,0,0,
Specsavers Opticians,OP_5EQ_12873__000002_S207PN,OPT,50d Crystal Peaks Shopping Centre,Crystal Peaks,Sheffield,,,S20 7PN,Tel: 0114 251 3111, - ,,,No ratings yet Rate it yourself - /Services/opticians/LeaveReview/DefaultView.aspx?id=OP_5EQ_12873__000002_S207PN,0,0,
Martin Kemp Opticians,OP_5EE_217__000001_S58TJ,OPT,443 Herries Road,,Sheffield,Sheffield,,S5 8TJ,Tel: 0114 232 5503, - ,,,No ratings yet Rate it yourself - /Services/opticians/LeaveReview/DefaultView.aspx?id=OP_5EE_217__000001_S58TJ,0,0,
Bamforth Opticians,OP_5EQ_8135__000001_S94LP,OPT,628 Staniforth Road,,Sheffield,,,S9 4LP,Tel: 0114 244 2496, - ,,,No ratings yet Rate it yourself - /Services/opticians/LeaveReview/DefaultView.aspx?id=OP_5EQ_8135__000001_S94LP,0,0,
Asda Opticians,OP_5EQ_13327__000003_S139BN,OPT,Handsworth Road,Handsworth,Sheffield,,,S13 9BN,Tel: 0114 263 5020, - ,,,No ratings yet Rate it yourself - /Services/opticians/LeaveReview/DefaultView.aspx?id=OP_5EQ_13327__000003_S139BN,0,0,
Boots-Sheffield - Crystal Peaks,OP_5EQ_7148__000001_S207PQ,OPT,Unit 17,Crystal Peaks Shopping Centre,Crystal Peaks,Sheffield,,S20 7PQ,Tel: 0114 247 7860, - ,,,No ratings yet Rate it yourself - /Services/opticians/LeaveReview/DefaultView.aspx?id=OP_5EQ_7148__000001_S207PQ,0,0,
Eyecare-Optical,,OPT,,197-199 Main Road,,Sheffield ,,S9 5HP,, - ,,,N/A - Data not available,,,
Eyecare-Optical,,OPT,,197-199 Main Road,,Sheffield ,,S9 5HP,Tel: 01142434584, - ,,,N/A - Data not available,,,
Tunnacliffe & Lambert ,OP_5EQ_12144__000001_S95HQ,OPT,186 Main Road,Darnall,Sheffield,,,S9 5HQ,Tel: 0114 244 1187, - ,,,No ratings yet Rate it yourself - /Services/opticians/LeaveReview/DefaultView.aspx?id=OP_5EQ_12144__000001_S95HQ,0,0,