Organisation Name,NACS Code,Organisation Type,Address1,Address2,Address3,Address4,Address5,PostCode,Telephone Number,Opening time,Value  (Opening time),Banding Classification  (Opening time),NHS.UK users rating,Value  (NHS.UK users rating),Banding Classification  (NHS.UK users rating),Car parking (Is there car parking at this organisation?)
Tesco Opticians,CV6 6AS__000003_CV66AS,OPT,Arena Retail Park,,,Coventry,,CV6 6AS,Tel: 024 76817238, - ,,,No ratings yet Rate it yourself - /Services/opticians/LeaveReview/DefaultView.aspx?id=CV6 6AS__000003_CV66AS,0,0,
Eyesite Eyecare Centre,OP_5MD_4162__000002_CV63ET,OPT,50 Jubilee Crescent,"50 Jubilee Crescent, Radford",Coventry,Coventry,,CV6 3ET,Tel: 024 7660 1113, - ,,,No ratings yet Rate it yourself - /Services/opticians/LeaveReview/DefaultView.aspx?id=OP_5MD_4162__000002_CV63ET,0,0,yes
Foleshill Eye Centre,OP_5MD_4758__000002_CV65JX,OPT,436c Foleshill Road,,,Coventry,,CV6 5JX,Tel: 024 7663 8399, - ,,,1 rating Rate it yourself - /Services/opticians/LeaveReview/DefaultView.aspx?id=OP_5MD_4758__000002_CV65JX,,,
Taylor Opticians,OP_5MD_9953__000001_CV65AU,OPT,515 Foleshill Road,,,Coventry,,CV6 5AU,Tel: 024 7668 5258, - ,,,No ratings yet Rate it yourself - /Services/opticians/LeaveReview/DefaultView.aspx?id=OP_5MD_9953__000001_CV65AU,0,0,
Eyesite Eyecare Centre,OP_5MD_6988__000001_CV21LP,OPT,8 Henley Road,8 Henley Road,Coventry,Coventry,,CV2 1LP,Tel: 024 76663583, - ,,,No ratings yet Rate it yourself - /Services/opticians/LeaveReview/DefaultView.aspx?id=OP_5MD_6988__000001_CV21LP,0,0,
Smith and Varley Opticians,5PM-CV12 8LX__000001_CV128LX,OPT,19 - 21 Congreve Walk,,Bedworth,Warwickshire,,CV12 8LX,Tel: 024 76314958, - ,,,No ratings yet Rate it yourself - /Services/opticians/LeaveReview/DefaultView.aspx?id=5PM-CV12 8LX__000001_CV128LX,0,0,
Boots-Bedworth,OP_5MP_10394__000002_CV128LY,OPT,Boots Opticians,8 Congreve Walk,,Bedworth,Warwickshire,CV12 8LY,Tel: 02476 313 126, - ,,,1 rating Rate it yourself - /Services/opticians/LeaveReview/DefaultView.aspx?id=OP_5MP_10394__000002_CV128LY,,,
Specsavers Opticians,00001-CV12 8ND__000001_CV128ND,OPT,22 All Saints Square,,Bedworth,Warwickshire,,CV12 8ND,Tel: 02476 499100, - ,,,No ratings yet Rate it yourself - /Services/opticians/LeaveReview/DefaultView.aspx?id=00001-CV12 8ND__000001_CV128ND,0,0,
"Standell, Teers & Davies",OP_5MD_8223__000001_CV65GA,OPT,639a Stoney Stanton Road,,Coventry,,,CV6 5GA,Tel: 024 7668 9594, - ,,,No ratings yet Rate it yourself - /Services/opticians/LeaveReview/DefaultView.aspx?id=OP_5MD_8223__000001_CV65GA,0,0,
Boots-Coventry - Radford Rd,OP_5MD_9322__000001_CV63BU,OPT,258 Radford Road,,,Coventry,Warwickshire,CV6 3BU,Tel: 02476 598 233, - ,,,1 rating Rate it yourself - /Services/opticians/LeaveReview/DefaultView.aspx?id=OP_5MD_9322__000001_CV63BU,,,
Jason Rice i-Care,OP_5MD_8668__000001_CV61JF,OPT,1a Engleton Road,,Coventry,,,CV6 1JF,Tel: 024 7659 2173, - ,,,1 rating Rate it yourself - /Services/opticians/LeaveReview/DefaultView.aspx?id=OP_5MD_8668__000001_CV61JF,,,
The Eyewear House,OP_5MD_9650__000001_CV14FW,OPT,65 Stoney Stanton Road,,,Coventry,,CV1 4FW,Tel: 024 7655 5573, - ,,,No ratings yet Rate it yourself - /Services/opticians/LeaveReview/DefaultView.aspx?id=OP_5MD_9650__000001_CV14FW,0,0,
Adams Eyehealth Eyeheath Opticians,CV2 3PD__000001_CV23PD,OPT,219 Sewall Highway,Wyken,,Coventry,,CV2 3PD,Tel: 024 76 458600, - ,,,No ratings yet Rate it yourself - /Services/opticians/LeaveReview/DefaultView.aspx?id=CV2 3PD__000001_CV23PD,0,0,
The Eyewear House,76594999__000002_CV58HU,OPT,467 Holyhead Road,,,Coventry,,CV5 8HU,Tel: 024 76594999, - ,,,No ratings yet Rate it yourself - /Services/opticians/LeaveReview/DefaultView.aspx?id=76594999__000002_CV58HU,0,0,
Boots Opticians Ltd,OP_5MD_6983__000002_CV11HF,OPT,49 Lower Precinct,,Coventry,,,CV1 1HF,Tel: 024 7622 2225, - ,,,No ratings yet Rate it yourself - /Services/opticians/LeaveReview/DefaultView.aspx?id=OP_5MD_6983__000002_CV11HF,0,0,
Vision Express (UK) Ltd,OP_5MD_11409__000001_CV11QS,OPT,11 West Orchard Shopping Centre,,Coventry,,,CV1 1QS,Tel: 024 7623 1123, - ,,,No ratings yet Rate it yourself - /Services/opticians/LeaveReview/DefaultView.aspx?id=OP_5MD_11409__000001_CV11QS,0,0,
Eyesite Eyecare Centre,OP_5MD_9156__000002_CV24BA,OPT,249 Walsgrave Road,"249 Walsgrave Road, Ball Hill",,Coventry,,CV2 4BA,Tel: 024 76443366, - ,,,No ratings yet Rate it yourself - /Services/opticians/LeaveReview/DefaultView.aspx?id=OP_5MD_9156__000002_CV24BA,0,0,
The Eye Clinics(Ball Hill),19042017115402,OPT,,213 Walsgrave Road,,Coventry,,CV2 4HH,, - ,,,No ratings yet Rate it yourself - /Services/opticians/LeaveReview/DefaultView.aspx?id=19042017115402,0,0,
Specsavers Opticians,OP_5MD_12567__000001_CV11DX,OPT,56-58 Lower Precinct,,Coventry,West Midlands,,CV1 1DS,Tel: 024 7663 3378, - ,,,No ratings yet Rate it yourself - /Services/opticians/LeaveReview/DefaultView.aspx?id=OP_5MD_12567__000001_CV11DX,0,0,
Boots-Coventry - Lower Precinct,CV1 1DS_01918,OPT,,49 Lower Precinct,,Coventry,West Midlands,CV1 1DS,Tel: 02476226561, - ,,,1 rating Rate it yourself - /Services/opticians/LeaveReview/DefaultView.aspx?id=CV1 1DS_01918,,,
I-Care Vision Specialists,OP_CV24BE_29819,OPT,,291-293 Walsgrave Road,,Coventry,,CV2 4BE,Tel: 024 76442272, - ,,,1 rating Rate it yourself - /Services/opticians/LeaveReview/DefaultView.aspx?id=OP_CV24BE_29819,,,
Eye Tech Optometrists,OP_5MD_13717__000001_CV23FJ,OPT,EYETECH Optometrists,175 Ansty Road,,Coventry,,CV2 3FJ,Tel: 024 76444566, - ,,,No ratings yet Rate it yourself - /Services/opticians/LeaveReview/DefaultView.aspx?id=OP_5MD_13717__000001_CV23FJ,0,0,
Opticial Express,OP_12345_CV1 2JZ,OPT,4th Floor Sun Alliance House,Little Park Street,,Coventry,West Midlands,CV1 2JZ,Tel: 0800 023 2020, - ,,,No ratings yet Rate it yourself - /Services/opticians/LeaveReview/DefaultView.aspx?id=OP_12345_CV1 2JZ,0,0,
C R Williams Opticians,OP_5MD_982__000001_CV59JE,OPT,1 Whitaker Road,,,Coventry,,CV5 9JE,Tel: 024 7667 7511, - ,,,No ratings yet Rate it yourself - /Services/opticians/LeaveReview/DefaultView.aspx?id=OP_5MD_982__000001_CV59JE,0,0,
Asda Opticians,OPT_CV2 2PN,OPT,,BRADE DRIVE,,COVENTRY,,CV2 2PN,Tel: 02476 625 812, - ,,,No ratings yet Rate it yourself - /Services/opticians/LeaveReview/DefaultView.aspx?id=OPT_CV2 2PN,0,0,
ZMP:  Healthcall Optical Services,OL/CO-2008/5EY__000001_CV13EZ,OPT,25 Warwick Road,,Coventry,,,CV1 3EZ,Tel: 0845 601 7241, - ,,,No ratings yet Rate it yourself - /Services/opticians/LeaveReview/DefaultView.aspx?id=OL/CO-2008/5EY__000001_CV13EZ,0,0,
Hayward Opticians,OP_5MD_3483__000001_CV22QZ,OPT,Brade Drive,Coventry,,,,CV2 2QZ,Tel: 024 7661 7823, - ,,,No ratings yet Rate it yourself - /Services/opticians/LeaveReview/DefaultView.aspx?id=OP_5MD_3483__000001_CV22QZ,0,0,
Stoke Opticians ,CV3 1FQ__000003_CV31FQ,OPT,106 Binley Road,Stoke Green,,Coventry,,CV3 1FQ,Tel: 024 76456123, - ,,,No ratings yet Rate it yourself - /Services/opticians/LeaveReview/DefaultView.aspx?id=CV3 1FQ__000003_CV31FQ,0,0,
Boots-Coventry - Central Six Retail Park,OP_5MD_6233__000002_CV36TA,OPT,Unit 7,Central Six Retail Park,,Coventry,West Midlands,CV3 6TA,Tel: 0247 6226051, - ,,,No ratings yet Rate it yourself - /Services/opticians/LeaveReview/DefaultView.aspx?id=OP_5MD_6233__000002_CV36TA,0,0,
Bulkington Eye Clinic,?????__000001_CV129NG,OPT,64 Leicester Street,,Bulkington,Warwickshire,,CV12 9NG,Tel: 02476 312000, - ,,,1 rating Rate it yourself - /Services/opticians/LeaveReview/DefaultView.aspx?id=?????__000001_CV129NG,,,
Michael P Harris (Opticians) Ltd,OP_5MD_3452__000002_CV56EP,OPT,25 Earlsdon Street,,,Coventry,,CV5 6EP,Tel: 024 7671 1620, - ,,,No ratings yet Rate it yourself - /Services/opticians/LeaveReview/DefaultView.aspx?id=OP_5MD_3452__000002_CV56EP,0,0,
Katie Hattersley Opticians,CV5 6EJ__000002_CV56EJ,OPT,56 Earlsdon Street,,,Coventry,,CV5 6EJ,Tel: 024 76675885, - ,,,No ratings yet Rate it yourself - /Services/opticians/LeaveReview/DefaultView.aspx?id=CV5 6EJ__000002_CV56EJ,0,0,
Susan Bowers Opticians,OP_5MD_12273__000002_CV49DU,OPT,349 Tile Hill Lane,Tile Hill,Coventry,Coventry,West Midlands,CV4 9DU,Tel: 02476466661, - ,,,No ratings yet Rate it yourself - /Services/opticians/LeaveReview/DefaultView.aspx?id=OP_5MD_12273__000002_CV49DU,0,0,
Specsavers Opticians,000CV35HD,OPT,,129 Daventry Road,,"Cheylesmore, Coventry",West Midlands,CV3 5HD,Tel: 02476 507950, - ,,,No ratings yet Rate it yourself - /Services/opticians/LeaveReview/DefaultView.aspx?id=000CV35HD,0,0,
Boots-Coventry - Daventry Rd,OP_5MD_7170__000001_CV35HF,OPT,179 Daventry Road,Cheylesmore,Coventry,West Midlands,,CV3 5HF,Tel: 02476 502825, - ,,,2 ratings Rate it yourself - /Services/opticians/LeaveReview/DefaultView.aspx?id=OP_5MD_7170__000001_CV35HF,,,
Clarke Opticians Ltd,OP_5MD_3230__000001_CV35HW,OPT,8 Quinton Parade,,,Coventry,,CV3 5HW,Tel: 024 7650 6300, - ,,,No ratings yet Rate it yourself - /Services/opticians/LeaveReview/DefaultView.aspx?id=OP_5MD_3230__000001_CV35HW,0,0,
First Care Optical Ltd,T3F4,OPT,,"16 GAINFORD RISE, BINLEY",,COVENTRY,,CV3 2RH,Tel: 07854401178, - ,,,No ratings yet Rate it yourself - /Services/opticians/LeaveReview/DefaultView.aspx?id=T3F4,0,0,
Eyesite Eyecare Centres,OP_5MD_9954__000001_CV49PQ,OPT,44 Jardine Crescent,,,Coventry,,CV4 9PQ,Tel: 024 7647 3739, - ,,,No ratings yet Rate it yourself - /Services/opticians/LeaveReview/DefaultView.aspx?id=OP_5MD_9954__000001_CV49PQ,0,0,
Healthcall Optical Services,5EJ_01582__000003_LU48EF,OPT,"Unit 3, Bow Court",Fletchworth Gate,Canley,Coventry,,CV5 6SP,Tel: 0800 198 1132, - ,,,No ratings yet Rate it yourself - /Services/opticians/LeaveReview/DefaultView.aspx?id=5EJ_01582__000003_LU48EF,0,0,
C R Williams Opticians,OP_5MD_13721__000001_CV31HX,OPT,,27 Princethorpe Way,Ernesford Grange,Coventry,,CV3 2HE,Tel: 024 7645 5187, - ,,,9 ratings Rate it yourself - /Services/opticians/LeaveReview/DefaultView.aspx?id=OP_5MD_13721__000001_CV31HX,,,
Costco Wholesale UK Ltd,CO-1833-5,OPT,,51 Torrington Avenue,,Coventry,,CV4 9AQ,Tel: 02476 854 675, - ,,,No ratings yet Rate it yourself - /Services/opticians/LeaveReview/DefaultView.aspx?id=CO-1833-5,0,0,
Hayward Opticians,OP_5MP_1598__000002_CV115LF,OPT,112 Queens Road,,Nuneaton,,,CV11 5LF,Tel: 024 76370114, - ,,,No ratings yet Rate it yourself - /Services/opticians/LeaveReview/DefaultView.aspx?id=OP_5MP_1598__000002_CV115LF,0,0,
Specsavers Opticians,OP_5MP_9764__000001_CV115JL,OPT,15a The Ropewalk Shopping Centre,,Nuneaton,,,CV11 5TZ,Tel: 02476 342078, - ,,,No ratings yet Rate it yourself - /Services/opticians/LeaveReview/DefaultView.aspx?id=OP_5MP_9764__000001_CV115JL,0,0,
Vision Express ,OP_5MP_12449__000001_CV115JW,OPT,4 Queens Road,Nuneaton,Warwickshire,Nuneaton,,CV11 5JW,Tel: 02476 325610, - ,,,No ratings yet Rate it yourself - /Services/opticians/LeaveReview/DefaultView.aspx?id=OP_5MP_12449__000001_CV115JW,0,0,
Boots-Nuneaton,OP_5MP_11580__000001_CV114EF,OPT,18 Market Place,,,Nuneaton,Warwickshire,CV11 4EF,Tel: 02476 374332, - ,,,No ratings yet Rate it yourself - /Services/opticians/LeaveReview/DefaultView.aspx?id=OP_5MP_11580__000001_CV114EF,0,0,
Whitehouse Opticians,OP_5MP_7193__000001_CV114EJ,OPT,31 Newdegate Square,Nuneaton,Warwickshire,,,CV11 4EJ,Tel: 02476 383262, - ,,,No ratings yet Rate it yourself - /Services/opticians/LeaveReview/DefaultView.aspx?id=OP_5MP_7193__000001_CV114EJ,0,0,
Jason Rice I-Care,OP_5MP_6005__000001_CV114HA,OPT,7 Harefield Road,,Nuneaton,,,CV11 4HA,Tel: 02476 383250, - ,,,No ratings yet Rate it yourself - /Services/opticians/LeaveReview/DefaultView.aspx?id=OP_5MP_6005__000001_CV114HA,0,0,
Eye Tech Optometrists,CV36BP1901,OPT,Eyetech Optometrists,42 Kenpas Highway,,Coventry,,CV3 6BP,Tel: 02476 233 993, - ,,,No ratings yet Rate it yourself - /Services/opticians/LeaveReview/DefaultView.aspx?id=CV36BP1901,0,0,
My Optician,OP_5MD_8278__000002_CV47EH,OPT,8 Cannon Park Centre,Lynchgate Road,,Coventry,,CV4 7EH,Tel: 024 7641 6667, - ,,,5 ratings Rate it yourself - /Services/opticians/LeaveReview/DefaultView.aspx?id=OP_5MD_8278__000002_CV47EH,,,
Asda Vision Centre,000001_CV11 4FL__000003_CV114FL,OPT,Newtown Road,,Nuneaton,Warwickshire,,CV11 4FL,Tel: 024 76328642, - ,,,No ratings yet Rate it yourself - /Services/opticians/LeaveReview/DefaultView.aspx?id=000001_CV11 4FL__000003_CV114FL,0,0,
The Eye Clinics (Binley),190420171152,OPT,,"Unit 19, Warwickshire shopping park",,Coventry,,CV3 2SB,, - ,,,3 ratings Rate it yourself - /Services/opticians/LeaveReview/DefaultView.aspx?id=190420171152,,,
Maginnis Opticians (Optometrists) Ltd,OP_5D1_4086__000001_CV77ER,OPT,384 Kenilworth Road,Balsall Common,Coventry,,,CV7 7ER,Tel: 01676 532180, - ,,,1 rating Rate it yourself - /Services/opticians/LeaveReview/DefaultView.aspx?id=OP_5D1_4086__000001_CV77ER,,,
Deakin - Timothy,MOB/01-18851/5N8__000001_LE102SS,OPT,10 Begonia Close,,Burbage,Leicestershire,,LE10 2SS,, - ,,,No ratings yet Rate it yourself - /Services/opticians/LeaveReview/DefaultView.aspx?id=MOB/01-18851/5N8__000001_LE102SS,0,0,
Burton & Wright,OP_5JA_LE10 1HU__000002_LE101AP,OPT,36 Station Road,,Hinckley,Leicestershire,,LE10 1AP,Tel: 01455 637616, - ,,,No ratings yet Rate it yourself - /Services/opticians/LeaveReview/DefaultView.aspx?id=OP_5JA_LE10 1HU__000002_LE101AP,0,0,
Community Eyecare trading as Vision Call,OP_B920AJ_20418,OPT,463-465 Warwick Road,"Cleeves House, Hampton Court, 55 Marsh Lane, Hampton-in-Arden",,Solihull,,B92 0AJ,Tel: 01675 446 065, - ,,,No ratings yet Rate it yourself - /Services/opticians/LeaveReview/DefaultView.aspx?id=OP_B920AJ_20418,0,0,
Specsavers,OP_5JA_604__000003_LE101DB,OPT,,46 Castle Street,,Hinckley,,LE10 1DB,Tel: 01455 233723, - ,,,No ratings yet Rate it yourself - /Services/opticians/LeaveReview/DefaultView.aspx?id=OP_5JA_604__000003_LE101DB,0,0,
Vision Express,OP_5JA_13176__000002_LE101DB,OPT,14 Castle Street,Hinckley,Leicestershire,,,LE10 1DB,Tel: 01455 618491, - ,,,No ratings yet Rate it yourself - /Services/opticians/LeaveReview/DefaultView.aspx?id=OP_5JA_13176__000002_LE101DB,0,0,
Boots-Hinckley,OP_5JA_13025__000001_LE101DB,OPT,2 Castle Street,,,Hinckley,Leicestershire,LE10 1DB,Tel: 01455 637 429, - ,,,No ratings yet Rate it yourself - /Services/opticians/LeaveReview/DefaultView.aspx?id=OP_5JA_13025__000001_LE101DB,0,0,
Maginnis Opticians (Optometrists) Ltd,OP_5MP_7063__000002_CV91AD,OPT,163 Long Street,,Atherstone,,,CV9 1AD,Tel: 01827 716633, - ,,,1 rating Rate it yourself - /Services/opticians/LeaveReview/DefaultView.aspx?id=OP_5MP_7063__000002_CV91AD,,,
Specsavers Opticians,5PM-CV8 1EF__000003_CV81EF,OPT,17 The Square,,Kenilworth,Warwickshire,,CV8 1EF,Tel: 01926 865030, - ,,,2 ratings Rate it yourself - /Services/opticians/LeaveReview/DefaultView.aspx?id=5PM-CV8 1EF__000003_CV81EF,,,
Boots-Kenilworth,5PM-CV8 1JB__000002_CV81JB,OPT,20 Talisman Square,,,Kenilworth,Warwickshire,CV8 1JB,Tel: 01926 856025, - ,,,No ratings yet Rate it yourself - /Services/opticians/LeaveReview/DefaultView.aspx?id=5PM-CV8 1JB__000002_CV81JB,0,0,
Vision Express,OP_5MQ_7051__000001_CV81HE,OPT,,28 Warwick Rd,,Kenilworth,Warwickshire,CV8 1HE,Tel: 01926 853331, - ,,,No ratings yet Rate it yourself - /Services/opticians/LeaveReview/DefaultView.aspx?id=OP_5MQ_7051__000001_CV81HE,0,0,
Keith Murphy Opticians Ltd,OP_5MQ_14437__000001_CV81HN,OPT,69 Warwick Road,Kenilworth,Warwickshire,,,CV8 1HN,Tel: 01926 853366, - ,,,7 ratings Rate it yourself - /Services/opticians/LeaveReview/DefaultView.aspx?id=OP_5MQ_14437__000001_CV81HN,,,
Whitehouse & Son,OP_5MP_1314__000001_CV91AY,OPT,35 Long Street,,Atherstone,,,CV9 1AY,Tel: 01827 713395, - ,,,No ratings yet Rate it yourself - /Services/opticians/LeaveReview/DefaultView.aspx?id=OP_5MP_1314__000001_CV91AY,0,0,
D&J Fenton Mobile Opticians,01 - 16010 - 5PC__000001_LE102BG,OPT,12 Cambourne Road,Burbage,Hinckley,Leicestershire,,LE10 2BG,Tel: 07503267129, - ,,,No ratings yet Rate it yourself - /Services/opticians/LeaveReview/DefaultView.aspx?id=01 - 16010 - 5PC__000001_LE102BG,0,0,
Scrivens Opticians,OP_5MP_453__000002_B463AG,OPT,91 High Street,Coleshill,Birmingham,,,B46 3AG,Tel: 01675 464507, - ,,,No ratings yet Rate it yourself - /Services/opticians/LeaveReview/DefaultView.aspx?id=OP_5MP_453__000002_B463AG,0,0,
Specsavers Opticians,5QW048,OPT,,"Unit 34, 2-4 Greenwood Square",Chelmsley Wood Shopping Centre,Birmingham,,B37 5TR,Tel: 0121 329 5510, - ,,,No ratings yet Rate it yourself - /Services/opticians/LeaveReview/DefaultView.aspx?id=5QW048,0,0,
Special Eyes,OP_5JA_LE9 8DS__000002_LE98DS,OPT,43 High Street,,Barwell,Leicestershire,,LE9 8DS,Tel: 01455 848050, - ,,,No ratings yet Rate it yourself - /Services/opticians/LeaveReview/DefaultView.aspx?id=OP_5JA_LE9 8DS__000002_LE98DS,0,0,
Maginnis Opticians (Optometrists) Ltd,OP_5D1_4083__000001_B377AE,OPT,32a Holly Lane,Marston Green,Birmingham,,,B37 7AE,Tel: 0121 779 4242, - ,,,No ratings yet Rate it yourself - /Services/opticians/LeaveReview/DefaultView.aspx?id=OP_5D1_4083__000001_B377AE,0,0,
Ian Michael Hadfield,OP_5D1_13860__000001_B376BB,OPT,,37 The Parade,Kingshurst,Birmingham,,B37 6BB,Tel: 0121 770 3226, - ,,,No ratings yet Rate it yourself - /Services/opticians/LeaveReview/DefaultView.aspx?id=OP_5D1_13860__000001_B376BB,0,0,
Greys Opticians,OP_5D1_4664__000001_B93ONA,OPT,1642 High Street,Knowle,,Solihull,West Midlands,B93 0NA,Tel: 01564 773466, - ,,,No ratings yet Rate it yourself - /Services/opticians/LeaveReview/DefaultView.aspx?id=OP_5D1_4664__000001_B93ONA,0,0,
Bannister Opticians Ltd,OP_5D1_8378__000001_B930LE,OPT,,17 St. Johns Way,Knowle,Solihull,,B93 0LE,Tel: 01564 778206, - ,,,3 ratings Rate it yourself - /Services/opticians/LeaveReview/DefaultView.aspx?id=OP_5D1_8378__000001_B930LE,,,
Optical People,CO - 5129,OPT,,"Rugby House, Hinckley Road,",Sapcote,Leicestershire,Leicestershire,LE9 4FS,Tel: 01455 886850, - ,,,No ratings yet Rate it yourself - /Services/opticians/LeaveReview/DefaultView.aspx?id=CO - 5129,0,0,
Cook Eyecare Ltd,COOKS__000001_B347HR,OPT,,6 Hurst Lane,Castle Bromwich,Birmingham,,B34 7HR,Tel: 0121 747 3847, - ,,,2 ratings Rate it yourself - /Services/opticians/LeaveReview/DefaultView.aspx?id=COOKS__000001_B347HR,,,
Complete Community Care Warwickshire Ltd,COMPLETE COMMUNITYCAREWARWICKSHIRELTD1,OPT,,120 Heath Lane,,Earl Shilton,Leicestershire,LE9 7PD,Tel: 02476 951951, - ,,,No ratings yet Rate it yourself - /Services/opticians/LeaveReview/DefaultView.aspx?id=COMPLETE COMMUNITYCAREWARWICKSHIRELTD1,0,0,
Eyecare at Home,EYECAREATHOME1,OPT,208 Wharf lane,,,Solihull,West Midlands,B91 2UN,Tel: 0845 299 6069, - ,,,No ratings yet Rate it yourself - /Services/opticians/LeaveReview/DefaultView.aspx?id=EYECAREATHOME1,0,0,
Direct Vision Opticians at Pan Pharmacy,,OPT,Direct Vision Opticians,297-299 Church Road,Sheldon,Birmingham,West Midlands,B26 3YH,Tel: 0121 742 9599 (ext. 3), - ,,,N/A - Data not available,,,yes
Boots-Sheldon,OP_5MY_2665__000002_B263JH,OPT,2236 Coventry Road,Sheldon,,Birmingham,,B26 3JH,Tel: 0121 743 3360, - ,,,No ratings yet Rate it yourself - /Services/opticians/LeaveReview/DefaultView.aspx?id=OP_5MY_2665__000002_B263JH,0,0,
Boots-Leamington Spa - The Parade (in Boots UK),OP_5MQ_1847__000001_CV324BL,OPT,31 The Parade,,,Leamington Spa,Warwickshire,CV32 4BL,Tel: 01926 332404, - ,,,2 ratings Rate it yourself - /Services/opticians/LeaveReview/DefaultView.aspx?id=OP_5MQ_1847__000001_CV324BL,,,
Wood Street Optical,V8H3D,OPT,,7-9 Wood Street,Earl Shilton,Leicester,Leicestershire,LE9 7NE,Tel: 01455 841364, - ,,,No ratings yet Rate it yourself - /Services/opticians/LeaveReview/DefaultView.aspx?id=V8H3D,0,0,
Vision Express ,OP_5MQ_1910__000001_CV324XU,OPT,Royal Priors Shopping Centre,,Leamington Spa,,,CV32 4XU,Tel: 01926 831989, - ,,,1 rating Rate it yourself - /Services/opticians/LeaveReview/DefaultView.aspx?id=OP_5MQ_1910__000001_CV324XU,,,
Charnley's Opticians,OP_5MQ_832__000002_CV324BA,OPT,,71 Parade,,Leamington Spa,Warwickshire,CV32 4BA,Tel: 01926 424820, - ,,,No ratings yet Rate it yourself - /Services/opticians/LeaveReview/DefaultView.aspx?id=OP_5MQ_832__000002_CV324BA,0,0,
Specsavers Opticians,OP_5MQ_2679__000003_CV324BA,OPT,69 The Parade,Leamington Spa,Warwickshire,,,CV32 4BA,Tel: 01926 427822, - ,,,1 rating Rate it yourself - /Services/opticians/LeaveReview/DefaultView.aspx?id=OP_5MQ_2679__000003_CV324BA,,,
My Specs Direct T/A Gohil and Grey Opticians,CO-4010,OPT,,53 Parade,,leamington Spa,,CV32 4BA,, - ,,,No ratings yet Rate it yourself - /Services/opticians/LeaveReview/DefaultView.aspx?id=CO-4010,0,0,
Scrivens Ltd,OP_5MY_5456__000002_B339SB,OPT,300 Kitts Green Road,Lea Hall,,Birmingham,West Midlands,B33 9SB,Tel: 0121 783 3159, - ,,,No ratings yet Rate it yourself - /Services/opticians/LeaveReview/DefaultView.aspx?id=OP_5MY_5456__000002_B339SB,0,0,
Vision Replublic Opticians,5PG129,OPT,,15 Ownall Road,Shard End,Birmingham,,B34 7AH,Tel: 0121 439 7979, - ,,,No ratings yet Rate it yourself - /Services/opticians/LeaveReview/DefaultView.aspx?id=5PG129,0,0,
Scrivens Ltd,OP_5MY_6315__000002_B263JB,OPT,2162 Coventry Road,Sheldon,,Birmingham,West Midlands,B26 3JB,Tel: 0121 743 2704, - ,,,No ratings yet Rate it yourself - /Services/opticians/LeaveReview/DefaultView.aspx?id=OP_5MY_6315__000002_B263JB,0,0,
Perspective Opticians ,OP_5D1_5333__000001_B913BH,OPT,56 Drury Lane,Mell Square,Solihull,Solihull,,B91 3BH,Tel: 0121 709 1000, - ,,,No ratings yet Rate it yourself - /Services/opticians/LeaveReview/DefaultView.aspx?id=OP_5D1_5333__000001_B913BH,0,0,
A B Optics,OP_5D1_13858__000001_B913DA,OPT,,681 Warwick Road,,Solihull,,B91 3DA,Tel: 0121 704 2615, - ,,,5 ratings Rate it yourself - /Services/opticians/LeaveReview/DefaultView.aspx?id=OP_5D1_13858__000001_B913DA,,,
Boots-Solihull,OP_5D1_3193__000001_B913AT,OPT,57 Mill Lane,,,Solihull,West Midlands,B91 3AT,Tel: 0121 705 2152, - ,,,No ratings yet Rate it yourself - /Services/opticians/LeaveReview/DefaultView.aspx?id=OP_5D1_3193__000001_B913AT,0,0,
Eye Specialist Opticians,OP_5D1_13861__000002_B928JL,OPT,,83 Hobs Moat Road,,Solihull,,B92 8JL,Tel: 0121 742 6043, - ,,,1 rating Rate it yourself - /Services/opticians/LeaveReview/DefaultView.aspx?id=OP_5D1_13861__000002_B928JL,,,
Sarah Martin Opticians,OP_5JA_LE9 4DQ__000002_LE94DQ,OPT,17 Long Street,,,Stoney Stanton,,LE9 4DQ,Tel: 01455 273020, - ,,,3 ratings Rate it yourself - /Services/opticians/LeaveReview/DefaultView.aspx?id=OP_5JA_LE9 4DQ__000002_LE94DQ,,,
Specsavers Opticians,OP_5D1_3685__000001_B913TA,OPT,,90 High Street,,Solihull,,B91 3TA,Tel: 0121 711 3411, - ,,,No ratings yet Rate it yourself - /Services/opticians/LeaveReview/DefaultView.aspx?id=OP_5D1_3685__000001_B913TA,0,0,
Alan Tyler Opticians,5QW047,OPT,,11 Arden Buildings,Station Road,Solihull,,B93 8HH,Tel: 01564 772217, - ,,,No ratings yet Rate it yourself - /Services/opticians/LeaveReview/DefaultView.aspx?id=5QW047,0,0,
ZMP:  Charles Barlow (domiciliary),OL/01-10826/5EY__000003_B946JG,OPT,171 Station Lane,Lapworth,Solihull,West Midlands,,B94 6JG,Tel: 0800 652 5505, - ,,,No ratings yet Rate it yourself - /Services/opticians/LeaveReview/DefaultView.aspx?id=OL/01-10826/5EY__000003_B946JG,0,0,
Vision Express (UK) Ltd,5QW005,OPT,,Touchwood Shopping Centre,,Solihull,,B91 3QE,Tel: 0121 704 7150, - ,,,No ratings yet Rate it yourself - /Services/opticians/LeaveReview/DefaultView.aspx?id=5QW005,0,0,
Specsavers Opticians,OP_5M9_1049__000001_CV213BX,OPT,26 Northway,The Clock Tower Shopping Centre,Rugby,Warwickshire,,CV21 2JS,Tel: 01788 540703, - ,,,No ratings yet Rate it yourself - /Services/opticians/LeaveReview/DefaultView.aspx?id=OP_5M9_1049__000001_CV213BX,0,0,
Vision Express ,OP_5M9_7880__000002_CV212JR,OPT,1-2 Market Mall,The Clock Towers Shopping Cent,Rugby,,,CV21 2JR,Tel: 01788 552460, - ,,,No ratings yet Rate it yourself - /Services/opticians/LeaveReview/DefaultView.aspx?id=OP_5M9_7880__000002_CV212JR,0,0,