Organisation Name,NACS Code,Organisation Type,Address1,Address2,Address3,Address4,Address5,PostCode,Telephone Number,Opening time,Value  (Opening time),Banding Classification  (Opening time),NHS.UK users rating,Value  (NHS.UK users rating),Banding Classification  (NHS.UK users rating),Car parking (Is there car parking at this organisation?)
Boots-Wellingborough - Corn Lane,OP_5LV_2140__000002_NN81EY,OPT,73-76 Corn Lane,,,Wellingborough,Northamptonshire,NN8 1EZ,Tel: 01933 273334, - ,,,No ratings yet Rate it yourself - /Services/opticians/LeaveReview/DefaultView.aspx?id=OP_5LV_2140__000002_NN81EY,0,0,
Boots-Wellingborough - Swansgate Centre,OP_5LV_4626__000001_NN81HA,OPT,Unit 41,Swansgate Shopping Centre,23 Spring Lane,Wellingborough,,NN8 1EY,Tel: 01933 222539, - ,,,2 ratings Rate it yourself - /Services/opticians/LeaveReview/DefaultView.aspx?id=OP_5LV_4626__000001_NN81HA,,,
Specsavers,OP_5LV_656__000001_NN81EY,OPT,26 Spring Lane,Swansgate Shopping Centre,Wellingborough,,,NN8 1EY,Tel: 01933 228600, - ,,,No ratings yet Rate it yourself - /Services/opticians/LeaveReview/DefaultView.aspx?id=OP_5LV_656__000001_NN81EY,0,0,
Halsey & Parkinson Opticians,OP_5LV_5103__000001_NN81BL,OPT,2a Sheep Street,,,Wellingborough,Northamptonshire,NN8 1BL,Tel: 01933 224488, - ,,,No ratings yet Rate it yourself - /Services/opticians/LeaveReview/DefaultView.aspx?id=OP_5LV_5103__000001_NN81BL,0,0,
BLINK,OP_5LV_3402__000001_NN81AT,OPT,20 Market Street,,Wellingborough,,,NN8 1AT,Tel: 01933 279203, - ,,,No ratings yet Rate it yourself - /Services/opticians/LeaveReview/DefaultView.aspx?id=OP_5LV_3402__000001_NN81AT,0,0,
Bellamy Opticians,OP_5LV_14725__000001_NN95TN,OPT,24 High Street,,Irthlingborough,Near Wellingborough,,NN9 5TN,Tel: 01933 653226, - ,,,No ratings yet Rate it yourself - /Services/opticians/LeaveReview/DefaultView.aspx?id=OP_5LV_14725__000001_NN95TN,0,0,
Eye to Eye Opticians,COL/CO-6890/5PD__000001_NN60ND,OPT,58 Broad Street,Earls Barton,Northampton,Northamptonshire,,NN6 0ND,Tel: 01604 810777, - ,,,1 rating Rate it yourself - /Services/opticians/LeaveReview/DefaultView.aspx?id=COL/CO-6890/5PD__000001_NN60ND,,,
I-Care Opticians,OP_5LV_2360__000001_NN100PQ,OPT,104 High Street,,Rushden,,,NN10 0PQ,Tel: 01933 312632, - ,,,No ratings yet Rate it yourself - /Services/opticians/LeaveReview/DefaultView.aspx?id=OP_5LV_2360__000001_NN100PQ,0,0,
J.B. Noble Opticians,OP_5LV_1555__000001_NN109YU,OPT,37 Church Street,,Rushden,,,NN10 9YU,Tel: 01933 312551, - ,,,No ratings yet Rate it yourself - /Services/opticians/LeaveReview/DefaultView.aspx?id=OP_5LV_1555__000001_NN109YU,0,0,
Scrivens Ltd,OP_5LV_3326__000002_NN100QE,OPT,55 High Street,,,Rushden,Northamptonshire,NN10 0QE,Tel: 01933 410554, - ,,,No ratings yet Rate it yourself - /Services/opticians/LeaveReview/DefaultView.aspx?id=OP_5LV_3326__000002_NN100QE,0,0,
Higham Eye Care,OP_5LV_NN98BP__000001_NN98BP,OPT,6 High Street,,Higham Ferrers,Northamptonshire,Northamptonshire,NN10 8BN,Tel: 01933 317000, - ,,,No ratings yet Rate it yourself - /Services/opticians/LeaveReview/DefaultView.aspx?id=OP_5LV_NN98BP__000001_NN98BP,0,0,yes
Latimer Opticians,OP_5LV_NN155LA__000002_NN155LA,OPT,Old Coach House,101high Street,Burton Latimer,Northamptonshire,,NN15 5LB,Tel: 01536 724212, - ,,,1 rating Rate it yourself - /Services/opticians/LeaveReview/DefaultView.aspx?id=OP_5LV_NN155LA__000002_NN155LA,,,
Tesco Opticians Kettering ,CO1998_24092015,OPT,,Carina Road,,Kettering,,NN15 6XB,, - ,,,No ratings yet Rate it yourself - /Services/opticians/LeaveReview/DefaultView.aspx?id=CO1998_24092015,0,0,
Boots-Northampton - Weston Favell,OP_5LW_2967__000003_NN38JZ,OPT,10 Weston Favell Centre,,,Northampton,Northamptonshire,NN3 8JZ,Tel: 01604 411 776, - ,,,No ratings yet Rate it yourself - /Services/opticians/LeaveReview/DefaultView.aspx?id=OP_5LW_2967__000003_NN38JZ,0,0,
Tesco Opticians,OP_5LW_498__000002_NN38JZ,OPT,Tesco Extra 3377,12 Weston Favell Centre,,Northampton,Northamptonshire,NN3 8JZ,Tel: 01604 529838, - ,,,No ratings yet Rate it yourself - /Services/opticians/LeaveReview/DefaultView.aspx?id=OP_5LW_498__000002_NN38JZ,0,0,
Davis Optometrists,OP_5LV_6599__000001_NN168JA,OPT,Moyune House,Crispin Place,,Kettering,Northamptonshire,NN16 8SP,Tel: 01536 512792, - ,,,2 ratings Rate it yourself - /Services/opticians/LeaveReview/DefaultView.aspx?id=OP_5LV_6599__000001_NN168JA,,,
Dollond & Aitchison,OP_5LV_4632__000001_NN160BL,OPT,1-2 Meeting Lane,,Kettering,,,NN16 0BL,Tel: 01536 519479, - ,,,No ratings yet Rate it yourself - /Services/opticians/LeaveReview/DefaultView.aspx?id=OP_5LV_4632__000001_NN160BL,0,0,
Boots-Kettering - Gold St,OP_5LV_6061__000003_NN168JB,OPT,35 Gold Street,,,Kettering,Northamptonshire,NN16 8JB,Tel: 01536 482 914, - ,,,No ratings yet Rate it yourself - /Services/opticians/LeaveReview/DefaultView.aspx?id=OP_5LV_6061__000003_NN168JB,0,0,
Stirling Opticians,OP_5LV_6247__000001_NN160BN,OPT,14a Silver Street,16-18 Gold Street,Kettering,Kettering,,NN16 8JB,Tel: 01536 512931, - ,,,No ratings yet Rate it yourself - /Services/opticians/LeaveReview/DefaultView.aspx?id=OP_5LV_6247__000001_NN160BN,0,0,
Krog & Whitehead,OP_5LV_8937__000001_NN96HS,OPT,21 High Street,Raunds,Northamptonshire,,,NN9 6HS,Tel: 01933 460035, - ,,,No ratings yet Rate it yourself - /Services/opticians/LeaveReview/DefaultView.aspx?id=OP_5LV_8937__000001_NN96HS,0,0,
Specsavers,OP_5LV_2837__000001_NN168JL,OPT,49 The Mall,Newlands,Kettering,,,NN16 8JL,Tel: 01536 412171, - ,,,No ratings yet Rate it yourself - /Services/opticians/LeaveReview/DefaultView.aspx?id=OP_5LV_2837__000001_NN168JL,0,0,
Vision Express,OP_5LV_9672__000001_NN168DP,OPT,Unit 9,Newlands Shopping Centre,Kettering,,,NN16 8DP,Tel: 01536 510642, - ,,,No ratings yet Rate it yourself - /Services/opticians/LeaveReview/DefaultView.aspx?id=OP_5LV_9672__000001_NN168DP,0,0,
Mawsley opticians,CO-4951,OPT,,Mawsley Village Surgery,,Mawsley,,NN14 1SN,, - ,,,No ratings yet Rate it yourself - /Services/opticians/LeaveReview/DefaultView.aspx?id=CO-4951,0,0,
Abington Eye Care Opticians,OP_5LW_1821__000002_NN32JG,OPT,Abington Health Complex,Beech Avenue,Northampton,Northampton,,NN3 2JG,Tel: 01604 791977, - ,,,No ratings yet Rate it yourself - /Services/opticians/LeaveReview/DefaultView.aspx?id=OP_5LW_1821__000002_NN32JG,0,0,yes
"Tompkins, Knight & Son Optometrists",OP_5LW_6548__000001_NN27BL,OPT,Chichele House,42 Kingsley Road,Northampton,,,NN2 7BL,Tel: 01604 714413, - ,,,1 rating Rate it yourself - /Services/opticians/LeaveReview/DefaultView.aspx?id=OP_5LW_6548__000001_NN27BL,,,
Davis Optometrists,OP_5LV_1199__000002_NN144JH,OPT,6 High Street,,,Thrapston,Northamptonshire,NN14 4JH,Tel: 01832 733415, - ,,,No ratings yet Rate it yourself - /Services/opticians/LeaveReview/DefaultView.aspx?id=OP_5LV_1199__000002_NN144JH,0,0,
Elite Eyecare,122260,OPT,,"182 Kettering Road, ",,Abington,,NN1 4BH,, - ,,,No ratings yet Rate it yourself - /Services/opticians/LeaveReview/DefaultView.aspx?id=122260,0,0,
Burgess & Lewis Opticians,OP_5LW_5104__000002_NN27SL,OPT,7 Alexandra Terrace,Kingsthorpe,Northampton,,,NN2 7SJ,Tel: 01604 792930, - ,,,No ratings yet Rate it yourself - /Services/opticians/LeaveReview/DefaultView.aspx?id=OP_5LW_5104__000002_NN27SL,0,0,
Boots-Northampton - Harborough Rd,OP_5LW_7211__000001_NN27SH,OPT,63 Harborough Road,,,Kingsthorpe Centre,Northamptonshire,NN2 7SH,Tel: 01604 720 121, - ,,,No ratings yet Rate it yourself - /Services/opticians/LeaveReview/DefaultView.aspx?id=OP_5LW_7211__000001_NN27SH,0,0,
Kingsthorpe Eyecare,EYECHECK__000004_NN27BD,OPT,4 Kingsthorpe Centre,Harborough Road,Northampton,,,NN2 7BD,Tel: 01604 716000, - ,,,3 ratings Rate it yourself - /Services/opticians/LeaveReview/DefaultView.aspx?id=EYECHECK__000004_NN27BD,,,
Eye to Eye Opticians,OP_5LW_7343__000001_NN15BD,OPT,Northampton General Hospital NHS Trust,,Northampton,Northamptonshire,,NN1 5BD,Tel: 01604 545722, - ,,,No ratings yet Rate it yourself - /Services/opticians/LeaveReview/DefaultView.aspx?id=OP_5LW_7343__000001_NN15BD,0,0,
Greens Opticians,OP_5LW_12868__000002_NN27AZ,OPT,18 Harborough Road,Kingsthorpe,Northampton,,,NN2 7AZ,Tel: 01604 715721, - ,,,No ratings yet Rate it yourself - /Services/opticians/LeaveReview/DefaultView.aspx?id=OP_5LW_12868__000002_NN27AZ,0,0,
SHEINMAN OPTICIANS,OP_5LW_2934__000001_NN12BP,OPT,Turville House,106-110 Abington Street,Northampton,,,NN1 2BP,Tel: 01604 626161, - ,,,No ratings yet Rate it yourself - /Services/opticians/LeaveReview/DefaultView.aspx?id=OP_5LW_2934__000001_NN12BP,0,0,
Optical Express,NN1 2BN_33345,OPT,Aquila House,St Giles Terrace,,Northampton,Northamptonshire,NN1 2BN,Tel: 0800 023 2020, - ,,,No ratings yet Rate it yourself - /Services/opticians/LeaveReview/DefaultView.aspx?id=NN1 2BN_33345,0,0,
Boots-Northampton - Abington St,OP_5LW_1076__000001_NN12BH,OPT,73a Abington Street,,Northampton,Northampton,,NN1 2BH,Tel: 01604 636864, - ,,,No ratings yet Rate it yourself - /Services/opticians/LeaveReview/DefaultView.aspx?id=OP_5LW_1076__000001_NN12BH,0,0,
Specsavers,OP_5LW_1800__000001_NN12AD,OPT,50-52 Abington Street,,Northampton,,,NN1 2AP,Tel: 01604 604996, - ,,,No ratings yet Rate it yourself - /Services/opticians/LeaveReview/DefaultView.aspx?id=OP_5LW_1800__000001_NN12AD,0,0,
Mode Designer Eyewear,OP_5LW_NN11JW__000001_NN11JW,OPT,38 St Giles Street,,Northampton,Northamptonshire,,NN1 1JW,Tel: 01604 632600, - ,,,No ratings yet Rate it yourself - /Services/opticians/LeaveReview/DefaultView.aspx?id=OP_5LW_NN11JW__000001_NN11JW,0,0,
Davis Optometrists,OP_5LV_1198__000001_NN142EW,OPT,4 Bridge Street,,,Rothwell,Northamptonshire,NN14 6EW,Tel: 01536 712384, - ,,,No ratings yet Rate it yourself - /Services/opticians/LeaveReview/DefaultView.aspx?id=OP_5LV_1198__000001_NN142EW,0,0,
Inter Eyecare Optometrists,OP_5LW_12867__000001_NN12ER,OPT,20 The Friary,Grosvenor Centre,Northampton,,,NN1 2ER,Tel: 01604 602330, - ,,,No ratings yet Rate it yourself - /Services/opticians/LeaveReview/DefaultView.aspx?id=OP_5LW_12867__000001_NN12ER,0,0,
Vision Express Ltd,OP_5LW_265__000001_NN12EL,OPT,29-31 Princes Walk,Grosvenor Centre,Northampton,,,NN1 2EL,Tel: 01604 601366, - ,,,No ratings yet Rate it yourself - /Services/opticians/LeaveReview/DefaultView.aspx?id=OP_5LW_265__000001_NN12EL,0,0,
Boots-Northampton - The Parade,OP_5LW_563__000002_NN12BY,OPT,9 The Parade,,,Northampton,Northamptonshire,NN1 2BY,Tel: 01604 627781, - ,,,1 rating Rate it yourself - /Services/opticians/LeaveReview/DefaultView.aspx?id=OP_5LW_563__000002_NN12BY,,,
DAVIS Optometrists,OP_5CQ_14974__000001_MK464BE,OPT,58 High Street,,,Olney,Buckinghamshire,MK46 4BE,Tel: 01234 712500, - ,,,No ratings yet Rate it yourself - /Services/opticians/LeaveReview/DefaultView.aspx?id=OP_5CQ_14974__000001_MK464BE,0,0,
Eyeclinic of Northampton,EYECLINIC__000001_NN11RS,OPT,24 Gold Street,,Northampton,Northamptonshire,,NN1 1RS,Tel: 01604 624723, - ,,,No ratings yet Rate it yourself - /Services/opticians/LeaveReview/DefaultView.aspx?id=EYECLINIC__000001_NN11RS,0,0,
Chec Northampton,C5U5V,OPT,,Units 1A & 1B Sol,,Northampton,Northamptonshire,NN1 1SR,Tel: 0330 100 4730, - ,,,27 ratings Rate it yourself - /Services/opticians/LeaveReview/DefaultView.aspx?id=C5U5V,,,
Mark Darling Opticians,OP_5LW _NN49DL__000001_NN49DL,OPT,29 St Leonards Road,Far Cotton,Northampton,Northamptonshire,,NN4 8DL,Tel: 01604 765855, - ,,,No ratings yet Rate it yourself - /Services/opticians/LeaveReview/DefaultView.aspx?id=OP_5LW _NN49DL__000001_NN49DL,0,0,
Punch Opticians,OP_5CQ_9607__000001_MK464AJ,OPT,27 Market Place,,Olney,,,MK46 4AJ,Tel: 01234 712860, - ,,,No ratings yet Rate it yourself - /Services/opticians/LeaveReview/DefaultView.aspx?id=OP_5CQ_9607__000001_MK464AJ,0,0,
Wootton Opticians,OP_5LW_NN46FF__000002_NN46FF,OPT,"9 Tudor Court, Wootton Hope Drive",Wootton Fields,Northampton,Northamptonshire,,NN4 6FF,Tel: 01604 875111, - ,,,No ratings yet Rate it yourself - /Services/opticians/LeaveReview/DefaultView.aspx?id=OP_5LW_NN46FF__000002_NN46FF,0,0,
3N Vision Centre,OP_5LW_NN55EZ__000002_NN55EZ,OPT,22 Spencer Bridge Road,,Northampton,Northamptonshire,,NN5 5EZ,Tel: 01604 753399, - ,,,No ratings yet Rate it yourself - /Services/opticians/LeaveReview/DefaultView.aspx?id=OP_5LW_NN55EZ__000002_NN55EZ,0,0,
Desborough Opticians,OP_5LV_10878__000001_NN142RS,OPT,,60 Station Road,,Desborough,Northamptonshire,NN14 2RS,Tel: 01536 763000, - ,,,1 rating Rate it yourself - /Services/opticians/LeaveReview/DefaultView.aspx?id=OP_5LV_10878__000001_NN142RS,,,
Punch Opticians,OP_5LW_1354__000002_NN56JF,OPT,42 Main Road,Duston,Northampton,,,NN5 6JF,Tel: 01604 758587, - ,,,1 rating Rate it yourself - /Services/opticians/LeaveReview/DefaultView.aspx?id=OP_5LW_1354__000002_NN56JF,,,
Vision Express (UK) Ltd,COL/CO-1881/5PD__000001_NN171BH,OPT,Unit 8 Willow Place,Corby,Corby,Northamptonshire,,NN17 1BH,Tel: 01536 400421, - ,,,No ratings yet Rate it yourself - /Services/opticians/LeaveReview/DefaultView.aspx?id=COL/CO-1881/5PD__000001_NN171BH,0,0,
Tesco Opticians Corby ,CO-1998_240915,OPT,Tesco Extra,Oakley Road,,Corby,Northamptonshire,NN18 8AL,Tel: 07718 545 708, - ,,,No ratings yet Rate it yourself - /Services/opticians/LeaveReview/DefaultView.aspx?id=CO-1998_240915,0,0,yes
Eye to Eye,OP_5LV_NN171NV__000001_NN171NV,OPT,Unit 2b Spencer Court,Corby Shopping Centre,Corby,Northamptonshire,,NN17 1NU,Tel: 01536 269913, - ,,,No ratings yet Rate it yourself - /Services/opticians/LeaveReview/DefaultView.aspx?id=OP_5LV_NN171NV__000001_NN171NV,0,0,
Boots-Corby,OP_5LV_2173__000001_NN171NL,OPT,17 Corporation Street,,,Corby,Northamptonshire,NN17 1NG,Tel: 01536 202 391, - ,,,No ratings yet Rate it yourself - /Services/opticians/LeaveReview/DefaultView.aspx?id=OP_5LV_2173__000001_NN171NL,0,0,
Specsavers,OP_5LV_3219__000001_NN171PB,OPT,21 New Post Office Square,,Corby,,,NN17 1PB,Tel: 01536 401119, - ,,,No ratings yet Rate it yourself - /Services/opticians/LeaveReview/DefaultView.aspx?id=OP_5LV_3219__000001_NN171PB,0,0,
Josephs Opticians,COL/D12514/5PD__000001_NN173HF,OPT,62 High Street,Old Village,Corby,Northamptonshire,,NN17 1UU,Tel: 01536 266410, - ,,,No ratings yet Rate it yourself - /Services/opticians/LeaveReview/DefaultView.aspx?id=COL/D12514/5PD__000001_NN173HF,0,0,
Greens Opticians,OP_5LV_14726__000001_NN171TW,OPT,"61, Forest Gate Road",Corby,Northamptonshire,,,NN17 1TW,Tel: 01536 204180, - ,,,No ratings yet Rate it yourself - /Services/opticians/LeaveReview/DefaultView.aspx?id=OP_5LV_14726__000001_NN171TW,0,0,
ASDA  Opticians,OP_5LV^NN171DT__000002_NN171DT,OPT,Phoenix Parkway,,Corby,Northamptonshire,,NN17 5DT,Tel: 01423 704 512, - ,,,No ratings yet Rate it yourself - /Services/opticians/LeaveReview/DefaultView.aspx?id=OP_5LV^NN171DT__000002_NN171DT,0,0,
John Kaye Optometrist,OP_5GD10215__000001_MK418HF,OPT,8 Library Walk,,Bedford,,,MK41 8HF,Tel: 01234 325060, - ,,,28 ratings Rate it yourself - /Services/opticians/LeaveReview/DefaultView.aspx?id=OP_5GD10215__000001_MK418HF,,,
Homesight,OP_5P2_42__000001_MK402PJ,OPT,1 Pemberley Lane,1 Pemberley Lane,Bedford,Bedford,Bedfordshire,MK40 2PJ,Tel: 07772 981725, - ,,,No ratings yet Rate it yourself - /Services/opticians/LeaveReview/DefaultView.aspx?id=OP_5P2_42__000001_MK402PJ,0,0,
Alan Brunker,OP_5GD_1__000001_MK402NP,OPT,25 St Peter's Street,,Bedford,,,MK40 2PN,Tel: 01234 353410, - ,,,No ratings yet Rate it yourself - /Services/opticians/LeaveReview/DefaultView.aspx?id=OP_5GD_1__000001_MK402NP,0,0,
Donne & Browning Opticians,OP_5GD_2__000001_MK401NS,OPT,,3-4 The Arcade,,Bedford,Bedfordshire,MK40 1NS,Tel: 01234 349933, - ,,,No ratings yet Rate it yourself - /Services/opticians/LeaveReview/DefaultView.aspx?id=OP_5GD_2__000001_MK401NS,0,0,
Vision Express (UK) Ltd,OP_5GD_431__000001_MK401TG,OPT,26 The Harpur Centre,,Bedford,,,MK40 1TG,Tel: 01234 347344, - ,,,No ratings yet Rate it yourself - /Services/opticians/LeaveReview/DefaultView.aspx?id=OP_5GD_431__000001_MK401TG,0,0,
Specsavers Opticians,OP_5GD_4520__000001_MK401PS,OPT,Unit 1,47 -51 The Harpur Centre,,Bedford,,MK40 1TP,Tel: 01234 348944, - ,,,No ratings yet Rate it yourself - /Services/opticians/LeaveReview/DefaultView.aspx?id=OP_5GD_4520__000001_MK401PS,0,0,
Boots-Bedford - Harper Centre,OP_5GD_2980__000002_MK401TN,OPT,33-37 Harpur Centre,,,Bedford,Bedfordshire,MK40 1TN,Tel: 01234 219153, - ,,,No ratings yet Rate it yourself - /Services/opticians/LeaveReview/DefaultView.aspx?id=OP_5GD_2980__000002_MK401TN,0,0,
Humphriss & Burgess,OP_5GD_2276__000001_MK403HD,OPT,28a Mill Street,,,Bedford,,MK40 3HD,Tel: 01234 354343, - ,,,No ratings yet Rate it yourself - /Services/opticians/LeaveReview/DefaultView.aspx?id=OP_5GD_2276__000001_MK403HD,0,0,
Allders Opticians,OP_5GD_10844__000001_MK401RY,OPT,49 High Street,,Bedford,,,MK40 1RY,Tel: 01234 344866, - ,,,No ratings yet Rate it yourself - /Services/opticians/LeaveReview/DefaultView.aspx?id=OP_5GD_10844__000001_MK401RY,0,0,
Dollond & Aitchison,OP_5CQ_2589__000001_MK168AR,OPT,31 High Street,,Newport Pagnell,,,MK16 8AR,Tel: 01908 610303, - ,,,No ratings yet Rate it yourself - /Services/opticians/LeaveReview/DefaultView.aspx?id=OP_5CQ_2589__000001_MK168AR,0,0,
Heron Opticians,OP_5CQ_1791__000002_MK168HE,OPT,56 High Street,Newport,Pagnell,Buckinghamshire,,MK16 8AQ,Tel: 01908 216477, - ,,,3 ratings Rate it yourself - /Services/opticians/LeaveReview/DefaultView.aspx?id=OP_5CQ_1791__000002_MK168HE,,,
D W Roberts Optometrists,OP_5CQ_4166__000001_MK168HE,OPT,3 St. John Street,,Newport Pagnell,,,MK16 8HE,Tel: 01908 218121, - ,,,1 rating Rate it yourself - /Services/opticians/LeaveReview/DefaultView.aspx?id=OP_5CQ_4166__000001_MK168HE,,,
Valerie Curtis,OP_5GD_8192__000001_MK428HP,OPT,142 Bedford Road,Kempston,Bedford,,,MK42 8BH,Tel: 01234 851873, - ,,,No ratings yet Rate it yourself - /Services/opticians/LeaveReview/DefaultView.aspx?id=OP_5GD_8192__000001_MK428HP,0,0,
Chis Archbold Optometrist,OP_5GD_3122__000001_MK428BH,OPT,158 Bedford Road,Kempston,Bedford,,,MK42 8BH,Tel: 01234 855822, - ,,,No ratings yet Rate it yourself - /Services/opticians/LeaveReview/DefaultView.aspx?id=OP_5GD_3122__000001_MK428BH,0,0,
Judith Day Optometrist,PE8 4BA,OPT,,5 Market Place,,Oundle,,PE8 4BA,Tel: 01832 272974, - ,,,6 ratings Rate it yourself - /Services/opticians/LeaveReview/DefaultView.aspx?id=PE8 4BA,,,
Specsavers Market Harborough,OL/01-16253/5PA__000002_LE167DR,OPT,22 St Mary's Place,,,Market Harborough,Leicestershire,LE16 7DR,Tel: 01858 438980, - ,,,1 rating Rate it yourself - /Services/opticians/LeaveReview/DefaultView.aspx?id=OL/01-16253/5PA__000002_LE167DR,,,
Vision Express ,OP_LE167DR_29579,OPT,,Unit 5 St Mary's Place,,Market Harborough,Leicestershire,LE16 7DR,Tel: 01858 466350, - ,,,No ratings yet Rate it yourself - /Services/opticians/LeaveReview/DefaultView.aspx?id=OP_LE167DR_29579,0,0,
Boots-Market Harborough,OPL-01-16333-5PA__000001_LE167PA,OPT,20 The Square,,Market Harborough,Leicestershire,,LE16 7PA,Tel: 01858 434 881, - ,,,No ratings yet Rate it yourself - /Services/opticians/LeaveReview/DefaultView.aspx?id=OPL-01-16333-5PA__000001_LE167PA,0,0,
Respectacle Company,OP_5EH_2559__000001_LE169BP,OPT,15 Manor Walk,,Market Harborough,Leics,,LE16 9BP,Tel: 01858 433577, - ,,,No ratings yet Rate it yourself - /Services/opticians/LeaveReview/DefaultView.aspx?id=OP_5EH_2559__000001_LE169BP,0,0,
Clarke & Roskrow Optometrists,OL/01-10454/5PA__000001_LE167AA,OPT,,18 Church Street,,Market Harborough,Leicestershire,LE16 7AA,Tel: 01858 462996, - ,,,No ratings yet Rate it yourself - /Services/opticians/LeaveReview/DefaultView.aspx?id=OL/01-10454/5PA__000001_LE167AA,0,0,
Henry Smith & Hamylton (Opticians) Ltd,U0M9W,OPT,,45 High Street,,Market Harborough,,LE16 7AF,Tel: 01858 457307, - ,,,No ratings yet Rate it yourself - /Services/opticians/LeaveReview/DefaultView.aspx?id=U0M9W,0,0,
Vision Care Optometrist,OP_5EH_9200__000001_LE167AF,OPT,65 High Street,Market Harborough,Leicestershire,,,LE16 7AF,Tel: 01858 467676, - ,,,No ratings yet Rate it yourself - /Services/opticians/LeaveReview/DefaultView.aspx?id=OP_5EH_9200__000001_LE167AF,0,0,
Home Eyetest Ltd,OP_MK158PL_46766,OPT,,18 Lacy Drive,Bolbeck Park,Milton Keynes,Buckinghamshire,MK15 8PL,Tel: 01908 465611, - ,,,No ratings yet Rate it yourself - /Services/opticians/LeaveReview/DefaultView.aspx?id=OP_MK158PL_46766,0,0,
John Carrington,OP_5AC_11760__000002_NN127BT,OPT,215 - 217 Watling Street,,,Towcester,,NN12 6BX,Tel: 01327 351998, - ,,,No ratings yet Rate it yourself - /Services/opticians/LeaveReview/DefaultView.aspx?id=OP_5AC_11760__000002_NN127BT,0,0,
D W Roberts,OP_5AC_9161__000001_NN126BT,OPT,6 Sponne House Shopping Centre,,Towcester,,,NN12 6BY,Tel: 01327 350240, - ,,,No ratings yet Rate it yourself - /Services/opticians/LeaveReview/DefaultView.aspx?id=OP_5AC_9161__000001_NN126BT,0,0,
T J Lodge,OP_5CQ_2956__000001_MK125DQ,OPT,13 The Square,Wolverton,Milton Keynes,,,MK12 5DQ,Tel: 01908 312130, - ,,,No ratings yet Rate it yourself - /Services/opticians/LeaveReview/DefaultView.aspx?id=OP_5CQ_2956__000001_MK125DQ,0,0,
D W Roberts Optometrists,OP_5CQ_8647__000002_MK125DG,OPT,17 The Square,Wolverton,Milton Keynes,,,MK12 5DG,Tel: 01908 313338, - ,,,2 ratings Rate it yourself - /Services/opticians/LeaveReview/DefaultView.aspx?id=OP_5CQ_8647__000002_MK125DG,,,
C & A Hurst Opticians,OP_5GF_12754__000001_PE195HN,OPT,359 Great North Road Eaton Socon,St. Neots,Cambridgeshire,,,PE19 7HN,Tel: 01480 406002, - ,,,No ratings yet Rate it yourself - /Services/opticians/LeaveReview/DefaultView.aspx?id=OP_5GF_12754__000001_PE195HN,0,0,
Melson Wingate Ltd(Scrivens),OP_5CQ_11119__000001_MK93BA,OPT,172 Midsummer Arcade,,,Milton Keynes,Northamptonshire,MK9 3BA,Tel: 01908 606520, - ,,,No ratings yet Rate it yourself - /Services/opticians/LeaveReview/DefaultView.aspx?id=OP_5CQ_11119__000001_MK93BA,0,0,
Boots-Milton Keynes - Crown Walk,OP_5CQ_7002__000003_MK93AH,OPT,18 Crown Walk,,,Milton Keynes,Buckinghamshire,MK9 3AH,Tel: 01908 606618, - ,,,No ratings yet Rate it yourself - /Services/opticians/LeaveReview/DefaultView.aspx?id=OP_5CQ_7002__000003_MK93AH,0,0,
Specsavers Ltd,OP_5CQ_13331__000001_MK93AG,OPT,35-37 Silbury Arcade,,Central Milton Keynes,Buckinghamshire,,MK9 3AG,Tel: 01908 662 116, - ,,,No ratings yet Rate it yourself - /Services/opticians/LeaveReview/DefaultView.aspx?id=OP_5CQ_13331__000001_MK93AG,0,0,
Costco Wholesale UK Ltd,CO-1833-13,OPT,,Mandeville Drive,Kingston,Milton Keynes,,MK10 0DB,Tel: 01908 285 035, - ,,,No ratings yet Rate it yourself - /Services/opticians/LeaveReview/DefaultView.aspx?id=CO-1833-13,0,0,
Boots-Milton Keynes - Midsummer Arcade,OP_5CQ_1888__000002_MK93BB,OPT,30 Midsummer Arcade,,,Central Milton Keynes,Buckinghamshire,MK9 3BB,Tel: 01908 234757, - ,,,No ratings yet Rate it yourself - /Services/opticians/LeaveReview/DefaultView.aspx?id=OP_5CQ_1888__000002_MK93BB,0,0,
Vision Express (UK) Ltd,OP_5CQ_2901__000001_MK93ES,OPT,18 Midsummer Arcade,,Milton Keynes,Buckinghamshire,,MK9 3ES,Tel: 01908 672 267, - ,,,No ratings yet Rate it yourself - /Services/opticians/LeaveReview/DefaultView.aspx?id=OP_5CQ_2901__000001_MK93ES,0,0,
Tesco Opticians,OP_5CQ_14312__000002_MK100AH,OPT,1 Winchester Circle,,Kingston Centre,Milton Keynes,,MK10 0AH,Tel: 0345 601 3479, - ,,,No ratings yet Rate it yourself - /Services/opticians/LeaveReview/DefaultView.aspx?id=OP_5CQ_14312__000002_MK100AH,0,0,
D W Roberts Optometrists,OP_5CQ_435__000001_MK111AF,OPT,16 High Street,Stony Stratford,,Buckinghamshire,,MK11 1AF,Tel: 01908 562355, - ,,,No ratings yet Rate it yourself - /Services/opticians/LeaveReview/DefaultView.aspx?id=OP_5CQ_435__000001_MK111AF,0,0,
Lesley A Arkin Optometrist,OP_5CQ_9939__000001_MK111BY,OPT,7 Cofferidge Close,Stony Stratford,Milton Keynes,,,MK11 1BY,Tel: 01908 567672, - ,,,No ratings yet Rate it yourself - /Services/opticians/LeaveReview/DefaultView.aspx?id=OP_5CQ_9939__000001_MK111BY,0,0,