Organisation Name,NACS Code,Organisation Type,Address1,Address2,Address3,Address4,Address5,PostCode,Telephone Number,Opening time,Value  (Opening time),Banding Classification  (Opening time),NHS.UK users rating,Value  (NHS.UK users rating),Banding Classification  (NHS.UK users rating),Car parking (Is there car parking at this organisation?)
DI Blow Opticians,MOB/2677/1/5N8__000003_NG85RW,OPT,543 Aspley Lane,Aspley,Nottingham,Nottinghamshire,,NG8 5RW,, - ,,,1 rating Rate it yourself - /Services/opticians/LeaveReview/DefaultView.aspx?id=MOB/2677/1/5N8__000003_NG85RW,,,
D I Blow Opticians Ltd,OP_5EM_1730__000002_NG85RW,OPT,543 Aspley Lane,Aspley,Nottingham,,,NG8 5RW,Tel: 0115 929 2515, - ,,,No ratings yet Rate it yourself - /Services/opticians/LeaveReview/DefaultView.aspx?id=OP_5EM_1730__000002_NG85RW,0,0,
A C Stephens,OP_5EM_7656__000001_NG85NB,OPT,296 Broxtowe Lane,Aspley,Nottingham,,,NG8 5NB,Tel: 0115 929 3491, - ,,,No ratings yet Rate it yourself - /Services/opticians/LeaveReview/DefaultView.aspx?id=OP_5EM_7656__000001_NG85NB,0,0,
Duffy  Optometrists,MOB/2230/5N8__000001_NG81HT,OPT,190 Wollaton Road,,Wollaton,Nottinghamshire,,NG8 1HT,, - ,,,No ratings yet Rate it yourself - /Services/opticians/LeaveReview/DefaultView.aspx?id=MOB/2230/5N8__000001_NG81HT,0,0,
Duffy Optometrists,OP_5EM_1437__000001_NG81EW,OPT,190 Wollaton Road,Wollaton,Nottingham,,,NG8 1HJ,Tel: 0115 928 2572, - ,,,1 rating Rate it yourself - /Services/opticians/LeaveReview/DefaultView.aspx?id=OP_5EM_1437__000001_NG81EW,,,
SPX Opticians Ltd,01120__000001_NG85BU,OPT,373 Nuthall Road,Aspley,Nottingham,Nottinghamshire,,NG8 5BU,Tel: 0115 9244244, - ,,,2 ratings Rate it yourself - /Services/opticians/LeaveReview/DefaultView.aspx?id=01120__000001_NG85BU,,,
D I Blow Opticians Ltd,OP_5EM_7204__000002_NG82QP,OPT,158c Bramcote Lane,Wollaton,Nottingham,,,NG8 2QP,Tel: 0115 928 3133, - ,,,1 rating Rate it yourself - /Services/opticians/LeaveReview/DefaultView.aspx?id=OP_5EM_7204__000002_NG82QP,,,
"Alan D Box, Opticians",OP_5EM_12436__000001_NG75GT,OPT,201 Radford Road,Hyson Green,Nottingham,,,NG7 5GT,Tel: 0115 978 5557, - ,,,No ratings yet Rate it yourself - /Services/opticians/LeaveReview/DefaultView.aspx?id=OP_5EM_12436__000001_NG75GT,0,0,
P D Rees Ltd,OP_5EM_14891__000001_NG72DZ,OPT,357c Derby Road,Lenton,Nottingham,,,NG7 2DZ,Tel: 0115 9781823, - ,,,No ratings yet Rate it yourself - /Services/opticians/LeaveReview/DefaultView.aspx?id=OP_5EM_14891__000001_NG72DZ,0,0,
DI Blow Opticians,MOB/2677/2/5N8__000002_NG75EH,OPT,143 Radford Road,,Nottingham,Nottinghamshire,,NG7 5EH,, - ,,,No ratings yet Rate it yourself - /Services/opticians/LeaveReview/DefaultView.aspx?id=MOB/2677/2/5N8__000002_NG75EH,0,0,
Mr A Khan T/A D I Blow Opticians Ltd,OP_5EM_5933__000001_NG75EH,OPT,143-145 Radford Road,Hyson Green,Nottingham,,,NG7 5EH,Tel: 0115 9786551, - ,,,3 ratings Rate it yourself - /Services/opticians/LeaveReview/DefaultView.aspx?id=OP_5EM_5933__000001_NG75EH,,,
Medina Express Opticians,OP_5EM_22780__000001_NG75FU,OPT,92 Radford Road,Hyson Green,Nottingham,Nottinghamshire,,NG7 5FU,Tel: 0115 9788786, - ,,,No ratings yet Rate it yourself - /Services/opticians/LeaveReview/DefaultView.aspx?id=OP_5EM_22780__000001_NG75FU,0,0,
Asda Opticians,OPT_NG7 5FP,OPT,,RADFORD ROAD,HYSON GREEN,NOTTINGHAM,,NG7 5FP,Tel: 01159 002520, - ,,,No ratings yet Rate it yourself - /Services/opticians/LeaveReview/DefaultView.aspx?id=OPT_NG7 5FP,0,0,
C & D Barlow,OP_5EC_14901__000002_NG54GB,OPT,Foxhall Business Centre,Foxhall Road,Nottingham,,,NG7 6LH,Tel: 0800 6525505, - ,,,No ratings yet Rate it yourself - /Services/opticians/LeaveReview/DefaultView.aspx?id=OP_5EC_14901__000002_NG54GB,0,0,
Boots-Nottingham - Castle Boulevard,OP_5EM_3334__000001_NG71GY,OPT,171-177 Castle Boulevard,,,Nottingham,Nottinghamshire,NG7 1GY,Tel: 01159 506 665, - ,,,4 ratings Rate it yourself - /Services/opticians/LeaveReview/DefaultView.aspx?id=OP_5EM_3334__000001_NG71GY,,,
Brooks and Wardman Optometrists,OP_5EM_14879__000001_NG15DW,OPT,The Courtyard,28 The Ropewalk,Nottingham,Nottingham,Nottinghamshire,NG1 5DW,Tel: 0115 9476309, - ,,,No ratings yet Rate it yourself - /Services/opticians/LeaveReview/DefaultView.aspx?id=OP_5EM_14879__000001_NG15DW,0,0,
Park Vision,67890__000004_NG15BQ,OPT,Nottingham Park Clinic,36 Regent Street,,Nottingham,Nottinghamshire,NG1 5BT,Tel: 01159500051, - ,,,2 ratings Rate it yourself - /Services/opticians/LeaveReview/DefaultView.aspx?id=67890__000004_NG15BQ,,,
Lancaster & Thorpe Opticians,OP_5EV_4027__000002_NG92LA,OPT,6 Stoney Street,Beeston,Nottingham,,,NG9 2LA,Tel: 01159 256484, - ,,,No ratings yet Rate it yourself - /Services/opticians/LeaveReview/DefaultView.aspx?id=OP_5EV_4027__000002_NG92LA,0,0,
Wozencroft & Company,OP_5EM_14897__000001_NG15BH,OPT,4 Oxford Street,,Nottingham,,,NG1 5BH,Tel: 0115 9475317, - ,,,No ratings yet Rate it yourself - /Services/opticians/LeaveReview/DefaultView.aspx?id=OP_5EM_14897__000001_NG15BH,0,0,
I.Wear Opticians,CO-0063/5N8__000001_BULWELL,OPT,73 Main Street,Bulwell,,Nottingham,,NG6 8QD,, - ,,,No ratings yet Rate it yourself - /Services/opticians/LeaveReview/DefaultView.aspx?id=CO-0063/5N8__000001_BULWELL,0,0,
I Wear Opticians,OP_5EM_14884__000001_NG68QD,OPT,73 Main Street,Bulwell,Nottingham,,,NG6 8QD,Tel: 0115 9757533, - ,,,No ratings yet Rate it yourself - /Services/opticians/LeaveReview/DefaultView.aspx?id=OP_5EM_14884__000001_NG68QD,0,0,
Specsavers Opticians,CO-0022/4/5N8__000001_NG91EF,OPT,4 Chilwell Road,The Square,Beeston,Nottingham,,NG9 1EF,, - ,,,No ratings yet Rate it yourself - /Services/opticians/LeaveReview/DefaultView.aspx?id=CO-0022/4/5N8__000001_NG91EF,0,0,
Specsavers Eye Care at Home,OL/CO-2008/5FT__000004_LU48EF,OPT,Cirrus House,10 Experian Way,Luton,Nottingham,,NG2 1EP,Tel: 01582 390812, - ,,,80 ratings Rate it yourself - /Services/opticians/LeaveReview/DefaultView.aspx?id=OL/CO-2008/5FT__000004_LU48EF,,,
John Flynn Opticians,OP_5EV_14899__000001_NG91BS,OPT,1a Devonshire Avenue,Beeston,,Nottingham,,NG9 1BS,Tel: 0115 9255051, - ,,,No ratings yet Rate it yourself - /Services/opticians/LeaveReview/DefaultView.aspx?id=OP_5EV_14899__000001_NG91BS,0,0,
Bowler & Charsley,OP_5EM_1421__000001_NG68EW,OPT,82 Main Street,Bulwell,,Nottingham,,NG6 8EW,Tel: 0115 9271685, - ,,,No ratings yet Rate it yourself - /Services/opticians/LeaveReview/DefaultView.aspx?id=OP_5EM_1421__000001_NG68EW,0,0,
W E Phillips,OP_5EM_14894__000001_NG16EB,OPT,86 Friar Lane,,Nottingham,,,NG1 6EB,Tel: 0115 9475265, - ,,,1 rating Rate it yourself - /Services/opticians/LeaveReview/DefaultView.aspx?id=OP_5EM_14894__000001_NG16EB,,,
Loxley Opticians & Eyewear Experts,01-26796,OPT,,32 Friar Lane,,Nottingham,,NG1 6DQ,Tel: 0115 8375960, - ,,,2 ratings Rate it yourself - /Services/opticians/LeaveReview/DefaultView.aspx?id=01-26796,,,
Kimberley Opticians,OP_5EV_7462__000003_NG162PB,OPT,31 Greens Lane,Kimberley,,Nottingham,Nottinghamshire,NG16 2PB,Tel: 0115 938 9663, - ,,,5 ratings Rate it yourself - /Services/opticians/LeaveReview/DefaultView.aspx?id=OP_5EV_7462__000003_NG162PB,,,yes
D I Blow Opticians Ltd,OP_5EM_11404__000001_NG68ET,OPT,90 Main Street,Bulwell,Nottingham,,,NG6 8ET,Tel: 0115 9275790, - ,,,No ratings yet Rate it yourself - /Services/opticians/LeaveReview/DefaultView.aspx?id=OP_5EM_11404__000001_NG68ET,0,0,
Boots-Nottingham - Friar Lane,OP_5EM_14881__000001_NG16DD,OPT,City House,39 Friar Lane,,Nottingham,Nottinghamshire,NG1 6DD,Tel: 01159 472 838, - ,,,No ratings yet Rate it yourself - /Services/opticians/LeaveReview/DefaultView.aspx?id=OP_5EM_14881__000001_NG16DD,0,0,
Kings Walk Contact Lenses,OP_5EM_8029__000001_NG12AE,OPT,3 Kings Walk,,Nottingham,,,NG1 2AE,Tel: 0115 9474387, - ,,,No ratings yet Rate it yourself - /Services/opticians/LeaveReview/DefaultView.aspx?id=OP_5EM_8029__000001_NG12AE,0,0,
Tony & Guy Opticians,23456__000001_NG12DR,OPT,27 Long Row,,Nottingham,,,NG1 2DR,, - ,,,No ratings yet Rate it yourself - /Services/opticians/LeaveReview/DefaultView.aspx?id=23456__000001_NG12DR,0,0,
Lancaster & Thorpe Ltd,OP_5EM_3713__000001_NG14AF,OPT,7-9 Trinity Square,,Nottingham,,,NG1 4AF,Tel: 0115 947 5463, - ,,,No ratings yet Rate it yourself - /Services/opticians/LeaveReview/DefaultView.aspx?id=OP_5EM_3713__000001_NG14AF,0,0,
Lancaster & Thorpe Opticians,MOB/0009/5N8__000002_NG14AF,OPT,7 Trinity Square,,,Nottingham,Nottinghamshire,NG1 4AF,Tel: 0115 9475463, - ,,,No ratings yet Rate it yourself - /Services/opticians/LeaveReview/DefaultView.aspx?id=MOB/0009/5N8__000002_NG14AF,0,0,no
Specsavers,OP_5EM_14892__000001_NG12NP,OPT,20-24 Wheeler Gate,,Nottingham,,,NG1 2ND,Tel: 0115 9588361, - ,,,No ratings yet Rate it yourself - /Services/opticians/LeaveReview/DefaultView.aspx?id=OP_5EM_14892__000001_NG12NP,0,0,
Boots-Nottingham - Victoria Centre,OP_5EM_2831__000001_NG13QG,OPT,165 Victoria Centre,Nottingham,,Nottinghamshire,,NG1 3QG,Tel: 0115 947 4807, - ,,,1 rating Rate it yourself - /Services/opticians/LeaveReview/DefaultView.aspx?id=OP_5EM_2831__000001_NG13QG,,,
Boots-Nottingham - D90 Opticians Support Office,NG90 1BS_12772,OPT,,"D90 East F06, Thane Road",,Beeston,Nottinghamshire,NG90 1BS,Tel: 0115 949 5763, - ,,,2 ratings Rate it yourself - /Services/opticians/LeaveReview/DefaultView.aspx?id=NG90 1BS_12772,,,
Specs Makers of Nottingham,OPT_NG21LW_1,OPT,1st Floor G W Butler Building,Crossgate Drive,,Nottingham,Nottinghamshire,NG2 1LW,Tel: 0115 906 3010, - ,,,No ratings yet Rate it yourself - /Services/opticians/LeaveReview/DefaultView.aspx?id=OPT_NG21LW_1,0,0,
Optical Express,CO-2069__000001_NG17DD,OPT,36 Lister Gate,,,Nottingham,Nottinghamshire,NG1 7DD,Tel: 0800 023 2020, - ,,,No ratings yet Rate it yourself - /Services/opticians/LeaveReview/DefaultView.aspx?id=CO-2069__000001_NG17DD,0,0,
Optique Vision,MOB/0085/5N8__000002_NG12ET,OPT,6 High Street,The Exchange,Nottingham,Nottinghamshire,Nottinghamshire,NG1 2ET,Tel: 01159 501499, - ,,,No ratings yet Rate it yourself - /Services/opticians/LeaveReview/DefaultView.aspx?id=MOB/0085/5N8__000002_NG12ET,0,0,yes
Optique,OO/S1349__000001_NG12ET,OPT,6 High Street,Exchange Arcade,Nottingham,Notts,,NG1 2ET,Tel: 0115 950 1499, - ,,,No ratings yet Rate it yourself - /Services/opticians/LeaveReview/DefaultView.aspx?id=OO/S1349__000001_NG12ET,0,0,
Boots-Nottingham -  Victoria Centre (in Boots UK),OP_5EM_427__000002_NG13QS,OPT,11-19 Lower Parliament Street,,,Nottingham,Nottinghamshire,NG1 3QS,Tel: 0845 123 1000, - ,,,2 ratings Rate it yourself - /Services/opticians/LeaveReview/DefaultView.aspx?id=OP_5EM_427__000002_NG13QS,,,
Gray & Bull,OP_5EM_7898__000001_NG12EH,OPT,,5 Pelham Street,,Nottingham,Nottinghamshire,NG1 2EH,Tel: 01159418121, - ,,,2 ratings Rate it yourself - /Services/opticians/LeaveReview/DefaultView.aspx?id=OP_5EM_7898__000001_NG12EH,,,
Eyecatchers Opticians,OP_5EM 21809__000004_NG17FF,OPT,20 Carrington Street,,,Nottingham,,NG1 7FF,, - ,,,No ratings yet Rate it yourself - /Services/opticians/LeaveReview/DefaultView.aspx?id=OP_5EM 21809__000004_NG17FF,0,0,
Eyecatchers Opticians,OP_5EA_14790__000003_NG17FF,OPT,20 Carrington Street,,Nottingham,,,NG1 7FF,Tel: 0115 9584313, - ,,,No ratings yet Rate it yourself - /Services/opticians/LeaveReview/DefaultView.aspx?id=OP_5EA_14790__000003_NG17FF,0,0,
Eyecatchers Opticians,MOB/01-21809/5N8__000005_NG17FF,OPT,20 Carrington Street,,Nottingham,Nottinghamshire,,NG1 7FF,, - ,,,No ratings yet Rate it yourself - /Services/opticians/LeaveReview/DefaultView.aspx?id=MOB/01-21809/5N8__000005_NG17FF,0,0,
Specdeals,OP_5EM_9019__000001_NG17LE,OPT,Unit 18 Broad Walk,Broad Marsh Centre,Nottingham,,,NG1 7LE,Tel: 0115 9473734, - ,,,No ratings yet Rate it yourself - /Services/opticians/LeaveReview/DefaultView.aspx?id=OP_5EM_9019__000001_NG17LE,0,0,
Mistry's Opticians,OP_5EM_4594__000002_NG59DD,OPT,Unit 3-4 Top Valley Way,Top Valley,Nottingham,,,NG5 9DD,Tel: 0115 977 0195, - ,,,1 rating Rate it yourself - /Services/opticians/LeaveReview/DefaultView.aspx?id=OP_5EM_4594__000002_NG59DD,,,
Mistry - K,MOB/01-11546/5N8__000003_NG59DD,OPT,Unit 3/4 Top Valley Way,Top Valley,Nottingham,Nottinghamshire,,NG5 9DD,, - ,,,No ratings yet Rate it yourself - /Services/opticians/LeaveReview/DefaultView.aspx?id=MOB/01-11546/5N8__000003_NG59DD,0,0,
Johns Opticians,MOB/0011/5N8__000002_NG11NL,OPT,7 Carlton Street,Hockley,Nottingham,Nottinghamshire,,NG1 1NL,, - ,,,1 rating Rate it yourself - /Services/opticians/LeaveReview/DefaultView.aspx?id=MOB/0011/5N8__000002_NG11NL,,,
Johns Opticians,OP_5EM_4560__000001_NG11NL,OPT,7 Carlton Street,Hockley,Nottingham,,,NG1 1NL,Tel: 0115 9475858, - ,,,No ratings yet Rate it yourself - /Services/opticians/LeaveReview/DefaultView.aspx?id=OP_5EM_4560__000001_NG11NL,0,0,
Allen A C,MOB/0013/5N8__000002_NG52GA,OPT,660 Mansfield Road,Sherwood,Nottingham,Nottinghamshire,,NG5 2GA,Tel: 01159 603594, - ,,,No ratings yet Rate it yourself - /Services/opticians/LeaveReview/DefaultView.aspx?id=MOB/0013/5N8__000002_NG52GA,0,0,
A C Allen,OP_5EM_5859__000001_NG52GA,OPT,660 Mansfield Road,Sherwood,Nottingham,,,NG5 2GA,Tel: 0115 960 3594, - ,,,No ratings yet Rate it yourself - /Services/opticians/LeaveReview/DefaultView.aspx?id=OP_5EM_5859__000001_NG52GA,0,0,
Woolcott Opticians,34567__000004_NG52GE,OPT,672 Mansfield Road,,Nottingham,,,NG5 2GE,, - ,,,No ratings yet Rate it yourself - /Services/opticians/LeaveReview/DefaultView.aspx?id=34567__000004_NG52GE,0,0,
Trent Eye-Care Ltd,TP9DK,OPT,,680 Mansfield Road,,Nottingham,,NG5 2GE,Tel: 0115 8224822, - ,,,No ratings yet Rate it yourself - /Services/opticians/LeaveReview/DefaultView.aspx?id=TP9DK,0,0,
J Yeomans & Partners,OP_5EM_8797__000001_NG24PB,OPT,19 Manvers Street,,Nottingham,,,NG2 4PB,Tel: 0115 9505477, - ,,,No ratings yet Rate it yourself - /Services/opticians/LeaveReview/DefaultView.aspx?id=OP_5EM_8797__000001_NG24PB,0,0,
Scrivens Ltd,OP_5EV_10757__000002_NG97AA,OPT,12 Derby Road,,,Stapleford,Nottinghamshire,NG9 7AA,Tel: 01159 397233, - ,,,No ratings yet Rate it yourself - /Services/opticians/LeaveReview/DefaultView.aspx?id=OP_5EV_10757__000002_NG97AA,0,0,
K D Mistry,OP_5EM_3645__000001_NG23JD,OPT,17 Bridgeway Centre,The Meadows,Nottingham,,,NG2 3JD,Tel: 0115 986 4010, - ,,,No ratings yet Rate it yourself - /Services/opticians/LeaveReview/DefaultView.aspx?id=OP_5EM_3645__000001_NG23JD,0,0,
Twynings Opticians,CO-0076/1/5N8__000003_NG97ED,OPT,Alexandra Street,Derby Road,Stapleford,Nottinghamshire,,NG9 7ED,, - ,,,No ratings yet Rate it yourself - /Services/opticians/LeaveReview/DefaultView.aspx?id=CO-0076/1/5N8__000003_NG97ED,0,0,
Peter A Schafle Optometrist,OP_5ER_9327__000001_DE75RE,OPT,14 Nottingham Road,Ilkeston,Derbyshire,,,DE7 5RE,Tel: 0115 930 7071, - ,,,No ratings yet Rate it yourself - /Services/opticians/LeaveReview/DefaultView.aspx?id=OP_5ER_9327__000001_DE75RE,0,0,
Kopacz and Barlow,OP_5EA_14809__000001_NG54GB,OPT,30a Marlborough Road,Woodthorpe,Nottingham,,,NG5 4GB,Tel: 0115 926 1694, - ,,,No ratings yet Rate it yourself - /Services/opticians/LeaveReview/DefaultView.aspx?id=OP_5EA_14809__000001_NG54GB,0,0,
Dale Opticians,OP_5EM_14882__000001_NG24LW,OPT,133 Sneinton Dale,Sneinton,Nottingham,,,NG2 4LW,Tel: 0115 9580023, - ,,,No ratings yet Rate it yourself - /Services/opticians/LeaveReview/DefaultView.aspx?id=OP_5EM_14882__000001_NG24LW,0,0,
Dale Opticians,MOB/0091/5N8__000003_NG24LW,OPT,133 Sneiton Dale,,Nottingham,Nottinghamshire,,NG2 4LW,, - ,,,No ratings yet Rate it yourself - /Services/opticians/LeaveReview/DefaultView.aspx?id=MOB/0091/5N8__000003_NG24LW,0,0,
Sumpton Opticians,OP_5ER_4385__000001_DE78FE,OPT,,8 Station Road,,Ilkeston,Derbyshire,DE7 5LD,Tel: 0115 932 2653, - ,,,2 ratings Rate it yourself - /Services/opticians/LeaveReview/DefaultView.aspx?id=OP_5ER_4385__000001_DE78FE,,,
Scrivens Opticians,OP_5ER_9618__000001_DE75QQ,OPT,,24 Bath Street,Ilkeston,Derbyshire,,DE7 8FB,Tel: 0115 932 5431, - ,,,No ratings yet Rate it yourself - /Services/opticians/LeaveReview/DefaultView.aspx?id=OP_5ER_9618__000001_DE75QQ,0,0,
"Blow, D I, Opticians Ltd",OP_5ER_12835__000001_DE75QA,OPT,16 Market Place,Ilkeston,Derbyshire,,,DE7 5QA,Tel: 0115 930 4564, - ,,,No ratings yet Rate it yourself - /Services/opticians/LeaveReview/DefaultView.aspx?id=OP_5ER_12835__000001_DE75QA,0,0,
Compton Acres Optician,OP_5FC_14910__000003_NG27RS,OPT,"Unit 6, Compton Acres",West Bridgford,Nottingham,,,NG2 7RS,Tel: 0115 9455726, - ,,,1 rating Rate it yourself - /Services/opticians/LeaveReview/DefaultView.aspx?id=OP_5FC_14910__000003_NG27RS,,,
C E Lea,OP_5EC_14900__000002_NG35JU,OPT,33 Plains Road,Mapperley,Nottingham,,,NG3 5JU,Tel: 01159 606526, - ,,,No ratings yet Rate it yourself - /Services/opticians/LeaveReview/DefaultView.aspx?id=OP_5EC_14900__000002_NG35JU,0,0,
Asda Opticians,CO-0001/1/5N8__000002_NG27JA,OPT,184 Loughborough Road,West Bridgeford,Nottingham,Nottinghamshire,,NG2 7JA,Tel: 0115 969 4200, - ,,,No ratings yet Rate it yourself - /Services/opticians/LeaveReview/DefaultView.aspx?id=CO-0001/1/5N8__000002_NG27JA,0,0,
Vision Express,OP_5EV_3794__000001_NG96EH,OPT,32 Central Avenue,West Bridgeford,Nottingham,,,NG2 5GR,Tel: 0115 945 5877, - ,,,No ratings yet Rate it yourself - /Services/opticians/LeaveReview/DefaultView.aspx?id=OP_5EV_3794__000001_NG96EH,0,0,
Specsavers Opticians,NCTPCT79__000001_NG25GQ,OPT,25-27 Central Avenue,West Bridgeford,Nottingham,Nottinghamshire,,NG2 5GQ,, - ,,,No ratings yet Rate it yourself - /Services/opticians/LeaveReview/DefaultView.aspx?id=NCTPCT79__000001_NG25GQ,0,0,
Winson Opticians,OP_5EM_14896__000001_NG118AD,OPT,118 Southchurch Drive,Clifton,Nottingham,,,NG11 8AD,Tel: 0115 9211623, - ,,,No ratings yet Rate it yourself - /Services/opticians/LeaveReview/DefaultView.aspx?id=OP_5EM_14896__000001_NG118AD,0,0,
Vision Express,OP_5FC_14926__000002_NG25GR,OPT,64 High Road,Beeston,Nottingham,,,NG9 6EH,Tel: 01159 259334, - ,,,No ratings yet Rate it yourself - /Services/opticians/LeaveReview/DefaultView.aspx?id=OP_5FC_14926__000002_NG25GR,0,0,
Adams Opticians,OP_5EC_8895__000001_NG57DE,OPT,19 High Street,Arnold,Nottingham,Nottingham,,NG5 7DE,Tel: 0115 9555520, - ,,,No ratings yet Rate it yourself - /Services/opticians/LeaveReview/DefaultView.aspx?id=OP_5EC_8895__000001_NG57DE,0,0,
Eye 2 Eye Opticians,C-0084/5N8__000001_NG41JD,OPT,346 Carlton Hill,Carlton,Nottingham,Nottinghamshire,,NG4 1JD,Tel: 01159 877378, - ,,,No ratings yet Rate it yourself - /Services/opticians/LeaveReview/DefaultView.aspx?id=C-0084/5N8__000001_NG41JD,0,0,
Johns Opticians,OP_5FC_4561__000001_NG22NL,OPT,34 Gordon Road,West Bridgford,Nottingham,,,NG2 5LN,Tel: 01159 814788, - ,,,No ratings yet Rate it yourself - /Services/opticians/LeaveReview/DefaultView.aspx?id=OP_5FC_4561__000001_NG22NL,0,0,
Winson Opticians,OP_5FC_803__000001_NG25HU,OPT,2 Priory Road,West Bridgford,,Nottingham,Nottinghamshire,NG2 5HU,Tel: 0115 981 6932, - ,,,No ratings yet Rate it yourself - /Services/opticians/LeaveReview/DefaultView.aspx?id=OP_5FC_803__000001_NG25HU,0,0,yes
Tesco Opticians,CO-0006/2/5N8__000001_NG96EZ,OPT,Swiney Way,Toton,Nottingham,Nottingham,,NG9 6EZ,Tel: 0115 684 8918, - ,,,No ratings yet Rate it yourself - /Services/opticians/LeaveReview/DefaultView.aspx?id=CO-0006/2/5N8__000001_NG96EZ,0,0,
J A Higson Opticians,56789__000004_NG41GD,OPT,318 Carlton Hill,Carlton,Nottingham,,,NG4 1GD,, - ,,,No ratings yet Rate it yourself - /Services/opticians/LeaveReview/DefaultView.aspx?id=56789__000004_NG41GD,0,0,
Carlton Opticians,OP_5AP_14063__000001_NG241JR,OPT,318 Carlton Hill,Carlton,Nottingham,,,NG4 1GD,Tel: 0115 9873125, - ,,,No ratings yet Rate it yourself - /Services/opticians/LeaveReview/DefaultView.aspx?id=OP_5AP_14063__000001_NG241JR,0,0,
Thomas Bond & Partners,OP_5EC_3208__000002_NG57DJ,OPT,77b High Street,,,Arnold,Nottinghamshire,NG5 7DJ,Tel: 0115 926 7455, - ,,,No ratings yet Rate it yourself - /Services/opticians/LeaveReview/DefaultView.aspx?id=OP_5EC_3208__000002_NG57DJ,0,0,
Specsavers Opticians,OP_5ER_1916__000001_DE78AS,OPT,104 Bath Street,Ilkeston,Derbyshire,,,DE7 8SE,Tel: 0115 944 1401, - ,,,No ratings yet Rate it yourself - /Services/opticians/LeaveReview/DefaultView.aspx?id=OP_5ER_1916__000001_DE78AS,0,0,
Thomas Bond & Partners,OP_5FC_3207__000001_NG26ER,OPT,130 Melton Road,,,West Bridgford,Nottinghamshire,NG2 6ER,Tel: 0115 981 2844, - ,,,No ratings yet Rate it yourself - /Services/opticians/LeaveReview/DefaultView.aspx?id=OP_5FC_3207__000001_NG26ER,0,0,
Eyestyle Co,OP_5EC_14905__000001_NG57ED,OPT,155 Front Street,Arnold,Nottingham,,,NG5 7ED,Tel: 0115 9536526, - ,,,No ratings yet Rate it yourself - /Services/opticians/LeaveReview/DefaultView.aspx?id=OP_5EC_14905__000001_NG57ED,0,0,
Specsavers Opticians,OP_5EC_11181__000001_NG57EG,OPT,118 Front Street,Arnold,Nottingham,,,NG5 7EG,Tel: 0115 9670856, - ,,,No ratings yet Rate it yourself - /Services/opticians/LeaveReview/DefaultView.aspx?id=OP_5EC_11181__000001_NG57EG,0,0,
Tesco Opticians,CO-0072/1/5N8__000001_NG157UQ,OPT,Ashgate Road,Hucknall,Nottingham,Nottingham,,NG15 7UQ,Tel: 0115 684 8917, - ,,,No ratings yet Rate it yourself - /Services/opticians/LeaveReview/DefaultView.aspx?id=CO-0072/1/5N8__000001_NG157UQ,0,0,
Asda Opticians,OPT_NG10 1NY,OPT,,MIDLAND STREET,,LONG EATON,,NG10 1NY,Tel: 0115 983 6112, - ,,,No ratings yet Rate it yourself - /Services/opticians/LeaveReview/DefaultView.aspx?id=OPT_NG10 1NY,0,0,
DI Blow Opticians,OP_5EV_12834__000001_NG157HF,OPT,2 Central Walk,Hucknall,Nottingham,,,NG15 7HF,Tel: 0115 963 6732, - ,,,No ratings yet Rate it yourself - /Services/opticians/LeaveReview/DefaultView.aspx?id=OP_5EV_12834__000001_NG157HF,0,0,
Thomas Bond & Partners,OP_5EV_11036__000002_NG157AX,OPT,66 High Street,,,Hucknall,,NG15 7AX,Tel: 0115 963 2427, - ,,,No ratings yet Rate it yourself - /Services/opticians/LeaveReview/DefaultView.aspx?id=OP_5EV_11036__000002_NG157AX,0,0,
Specsavers Opticians,CO-0022/2/5N8__000003_NG157AX,OPT,56 High Street,Hucknall,,Nottingham,,NG15 7AX,, - ,,,No ratings yet Rate it yourself - /Services/opticians/LeaveReview/DefaultView.aspx?id=CO-0022/2/5N8__000003_NG157AX,0,0,
DI Blow Opticians,OP_5EV_2846__000001_NG163AJ,OPT,79 Nottingham Road,,Eastwood,,,NG16 3AJ,Tel: 01773 762326, - ,,,No ratings yet Rate it yourself - /Services/opticians/LeaveReview/DefaultView.aspx?id=OP_5EV_2846__000001_NG163AJ,0,0,
Specsavers Opticians,OP_5ER_2592__000002_NG101LN,OPT,4-6 High Street,Long Eaton,Nottingham,,,NG10 1GH,Tel: 0115 946 0450, - ,,,No ratings yet Rate it yourself - /Services/opticians/LeaveReview/DefaultView.aspx?id=OP_5ER_2592__000002_NG101LN,0,0,
Ryley & Evans,OP_5ER_6579__000001_NG101HY,OPT,25 High Street,Long Eaton,Nottingham,,,NG10 1HY,Tel: 0115 973 4056, - ,,,4 ratings Rate it yourself - /Services/opticians/LeaveReview/DefaultView.aspx?id=OP_5ER_6579__000001_NG101HY,,,
Jaysons Opticians,W2L8N,OPT,21 High Street,Long Eaton,,Nottingham,Derbyshire,NG10 1HY,Tel: 0115 973 3764, - ,,,No ratings yet Rate it yourself - /Services/opticians/LeaveReview/DefaultView.aspx?id=W2L8N,0,0,
Boots-Long Eaton - High St,OP_5ER_1842__000001_NG101LP,OPT,68-70 High Street,,Long Eaton,Nottingham,Nottinghamshire,NG10 1LP,Tel: 0115 9733094, - ,,,1 rating Rate it yourself - /Services/opticians/LeaveReview/DefaultView.aspx?id=OP_5ER_1842__000001_NG101LP,,,
Salinger Opticians,OP_5EV_11035__000001_NG163NQ,OPT,68 Nottingham Road,Eastwood,Nottingham,,,NG16 3NQ,Tel: 01773 712812, - ,,,No ratings yet Rate it yourself - /Services/opticians/LeaveReview/DefaultView.aspx?id=OP_5EV_11035__000001_NG163NQ,0,0,
Thomas Bond & Partners,OP_5EC_2342__000002_NG42LA,OPT,37 Victoria Road,,,Netherfield,Nottinghamshire,NG4 2LA,Tel: 0115 961 6193, - ,,,No ratings yet Rate it yourself - /Services/opticians/LeaveReview/DefaultView.aspx?id=OP_5EC_2342__000002_NG42LA,0,0,
Winson Opticians,OP_5FC_804__000001_NG116EF,OPT,"The Coach House, Charles Street",Ruddington,Nottingham,,,NG11 6EF,Tel: 0115 921 2992, - ,,,No ratings yet Rate it yourself - /Services/opticians/LeaveReview/DefaultView.aspx?id=OP_5FC_804__000001_NG116EF,0,0,