Organisation Name,NACS Code,Organisation Type,Address1,Address2,Address3,Address4,Address5,PostCode,Telephone Number,Opening time,Value  (Opening time),Banding Classification  (Opening time),NHS.UK users rating,Value  (NHS.UK users rating),Banding Classification  (NHS.UK users rating),Car parking (Is there car parking at this organisation?)
Thompson Opticians Ltd,OP_TAC_4477__000001_NE657TL,OPT,Whitton Bank Road,,Rothbury,Northumberland,,NE65 7RW,Tel: 01665 602 079, - ,,,No ratings yet Rate it yourself - /Services/opticians/LeaveReview/DefaultView.aspx?id=OP_TAC_4477__000001_NE657TL,0,0,
Thompson Opticians Ltd,OP_TAC_6984__000001_NE661JU,OPT,,6 Clayport Street,,Alnwick,Northumberland,NE66 1JU,Tel: 01665 602 079, - ,,,No ratings yet Rate it yourself - /Services/opticians/LeaveReview/DefaultView.aspx?id=OP_TAC_6984__000001_NE661JU,0,0,
Boots-Alnwick,OP_TAC_3075__000002_NE661JD,OPT,36/38 Bondgate Within,,Alnwick,Northumberland,,NE66 1JD,Tel: 01665 606 220, - ,,,1 rating Rate it yourself - /Services/opticians/LeaveReview/DefaultView.aspx?id=OP_TAC_3075__000002_NE661JD,,,
C4 Sightcare,OP_TAC^05__000001_NE615LX,OPT,Widdrington Health Centre,Grange Road,Widdrington,Northumberland,,NE61 5LX,Tel: 01670 518 612, - ,,,1 rating Rate it yourself - /Services/opticians/LeaveReview/DefaultView.aspx?id=OP_TAC^05__000001_NE615LX,,,
C4 Sightcare,OP_TAC_13085__000001_NE611AY,OPT,65 Newgate Street,,,Morpeth,Northumberland,NE61 1AY,Tel: 01670 518 612, - ,,,No ratings yet Rate it yourself - /Services/opticians/LeaveReview/DefaultView.aspx?id=OP_TAC_13085__000001_NE611AY,0,0,
Vision Express Ltd,CO-3742__000001_NE611NS,OPT,Sanderson Arcade,Unit 11,Morpeth,Northumberland,,NE61 1NS,Tel: 01670 505422, - ,,,No ratings yet Rate it yourself - /Services/opticians/LeaveReview/DefaultView.aspx?id=CO-3742__000001_NE611NS,0,0,
Morpeth Visionplus Limited,OP_TAC^ 001__000001_NE611NT,OPT,17 Bridge Street,Morpeth,Northumberland,,,NE61 1NT,Tel: 01670 500 180, - ,,,No ratings yet Rate it yourself - /Services/opticians/LeaveReview/DefaultView.aspx?id=OP_TAC^ 001__000001_NE611NT,0,0,
Robert Green & Partners,OP_TAC_8559__000002_NE611BA,OPT,62 Bridge Street,,Morpeth,Northumberland,,NE61 1PQ,Tel: 01670 513 175, - ,,,No ratings yet Rate it yourself - /Services/opticians/LeaveReview/DefaultView.aspx?id=OP_TAC_8559__000002_NE611BA,0,0,
Thompson Opticians Ltd,OP_TAC_1387__000001_NE650DD,OPT,,62 Queen Street,,Amble,Northumberland,NE65 0DD,Tel: 01665 710 577, - ,,,No ratings yet Rate it yourself - /Services/opticians/LeaveReview/DefaultView.aspx?id=OP_TAC_1387__000001_NE650DD,0,0,
Specsavers Opticians,OP_TAC^02__000001_NE639UX,OPT,8 Woodhorn Road,Ashington,Northumberland,,,NE63 9UX,Tel: 01670 524 220, - ,,,No ratings yet Rate it yourself - /Services/opticians/LeaveReview/DefaultView.aspx?id=OP_TAC^02__000001_NE639UX,0,0,
Aaron Optometrists Limited,OP_TAC_319__000001_NE630AE,OPT,Bellway House,Woodhorn Road,Ashington,Northumberland,Northumberland,NE63 0AE,Tel: 01670 813 185, - ,,,2 ratings Rate it yourself - /Services/opticians/LeaveReview/DefaultView.aspx?id=OP_TAC_319__000001_NE630AE,,,
McGregor Opticians,OP_TAC_5940__000002_NE630XX,OPT,12 Laburnum Terrace,,Ashington,Northumberland,,NE63 0XX,Tel: 01670 813 033, - ,,,1 rating Rate it yourself - /Services/opticians/LeaveReview/DefaultView.aspx?id=OP_TAC_5940__000002_NE630XX,,,
Diane J Raymond,OP^TAC^02__000001_NE225AU,OPT,78 Front Street West,Bedlington,Northumberland,,,NE22 5AU,Tel: 01670 823 347, - ,,,No ratings yet Rate it yourself - /Services/opticians/LeaveReview/DefaultView.aspx?id=OP^TAC^02__000001_NE225AU,0,0,
Thompson Opticians Ltd,OP_TAC_4475__000002_NE716BY,OPT,18 High Street,,,Wooler,Northumberland,NE71 6BU,Tel: 01668 281 066, - ,,,No ratings yet Rate it yourself - /Services/opticians/LeaveReview/DefaultView.aspx?id=OP_TAC_4475__000002_NE716BY,0,0,
Geoff Steven & Sons,OPT_NE209NH_1,OPT,,25 Main Street,,Ponteland,,NE20 9NH,Tel: 01661 823374, - ,,,No ratings yet Rate it yourself - /Services/opticians/LeaveReview/DefaultView.aspx?id=OPT_NE209NH_1,0,0,
Asda Opticians,OPT_NE24 4LZ,OPT,,COWPEN  ROAD,,BLYTH,,NE24 4LZ,Tel: 01670 719356, - ,,,No ratings yet Rate it yourself - /Services/opticians/LeaveReview/DefaultView.aspx?id=OPT_NE24 4LZ,0,0,
H B Opticians Limited,OP_TAC^01__000005_NE209PW,OPT,29 Broadway,Darras Hall,Ponteland,Northumberland,,NE20 9PW,Tel: 01661 820 008, - ,,,No ratings yet Rate it yourself - /Services/opticians/LeaveReview/DefaultView.aspx?id=OP_TAC^01__000005_NE209PW,0,0,
Specsavers Opticians,OP_TAC_6451__000001_NE236SD,OPT,"Unit H, Manor Walk Shopping Centre",,Cramlington,Northumberland,,NE23 6SD,Tel: 01670 733 327, - ,,,No ratings yet Rate it yourself - /Services/opticians/LeaveReview/DefaultView.aspx?id=OP_TAC_6451__000001_NE236SD,0,0,
A & G Marshall Optometrists Ltd,OP_TAC_4111__000001_NE236UT,OPT,,2-3 The Old Church,"Village Square, Cramlington",Cramlington,,NE23 1DN,Tel: 01670 730 577, - ,,,No ratings yet Rate it yourself - /Services/opticians/LeaveReview/DefaultView.aspx?id=OP_TAC_4111__000001_NE236UT,0,0,
Yarrow & Harvey Optometrists,OP_TAC_6960__000001_NE236QW,OPT,Dudley Lane,Cramlington,Northumberland,,,NE23 6US,Tel: 01670 715 747, - ,,,No ratings yet Rate it yourself - /Services/opticians/LeaveReview/DefaultView.aspx?id=OP_TAC_6960__000001_NE236QW,0,0,
Specs Galore Limited,OP_TAC^03__000001_NE241DP,OPT,7 Wanley Street,,Blyth,Northumberland,,NE24 1DP,Tel: 01670 365 073, - ,,,No ratings yet Rate it yourself - /Services/opticians/LeaveReview/DefaultView.aspx?id=OP_TAC^03__000001_NE241DP,0,0,
Specsavers Opticians,OP_TAC_7611__000001_NE241LQ,OPT,5 Regent Street,,Blyth,Northumberland,,NE24 1LQ,Tel: 01670 354 000, - ,,,No ratings yet Rate it yourself - /Services/opticians/LeaveReview/DefaultView.aspx?id=OP_TAC_7611__000001_NE241LQ,0,0,
D J Preston,OP_TAC_4294__000002_NE241BL,OPT,,6 Bridge Street,,Blyth,,NE24 1BL,Tel: 01670 353 819, - ,,,No ratings yet Rate it yourself - /Services/opticians/LeaveReview/DefaultView.aspx?id=OP_TAC_4294__000002_NE241BL,0,0,
Thompson Optician,OP_TAC_4811__000001_NE242BU,OPT,14 Stanley Street,,Blyth,Northumberland,,NE24 2BU,Tel: 01670 353 646, - ,,,No ratings yet Rate it yourself - /Services/opticians/LeaveReview/DefaultView.aspx?id=OP_TAC_4811__000001_NE242BU,0,0,
Mark English Optometrist,OP_TAC_7874__000001_NE242DR,OPT,46 Beaconsfield Street,,Blyth,Northumberland,,NE24 2DR,Tel: 01670 352 839, - ,,,No ratings yet Rate it yourself - /Services/opticians/LeaveReview/DefaultView.aspx?id=OP_TAC_7874__000001_NE242DR,0,0,
Thompson Opticians Ltd,OP_5D7_4469__000001_NE159BT,OPT,Senate House,Hexham Road,Throckley,Newcastle Upon Tyne,Tyne and Wear,NE15 9BT,Tel: 0191 267 4337, - ,,,No ratings yet Rate it yourself - /Services/opticians/LeaveReview/DefaultView.aspx?id=OP_5D7_4469__000001_NE159BT,0,0,
Tesco Opticians,OP_5D7_5881__000003_NE32FP,OPT,Tesco Extra,2917 Kingston Park Centre,,Kingston Park,,NE3 2FP,Tel: 0845 601 3479, - ,,,16 ratings Rate it yourself - /Services/opticians/LeaveReview/DefaultView.aspx?id=OP_5D7_5881__000003_NE32FP,,,
Michael Offord Optometrist,OP_5D7_9544__000002_NE32FP,OPT,,7 Kingston Court,Kingston Park Avenue,Kingston Park,,NE3 2FP,Tel: 0191 271 2140, - ,,,5 ratings Rate it yourself - /Services/opticians/LeaveReview/DefaultView.aspx?id=OP_5D7_9544__000002_NE32FP,,,
Healthcall Optical Services,OP_5D7^0002__000001_NE51NB,OPT,Redburn Road,Westerhope,Newcastle Upon Tyne,,,NE5 1NB,Tel: 0845 601 7241, - ,,,No ratings yet Rate it yourself - /Services/opticians/LeaveReview/DefaultView.aspx?id=OP_5D7^0002__000001_NE51NB,0,0,
Croft & Graves Optometrists,OP_TAC_7186__000001_NE455AA,OPT,Woodburn House,Hill Street,Corbridge,Northumberland,,NE45 5AA,Tel: 01434 632 289, - ,,,No ratings yet Rate it yourself - /Services/opticians/LeaveReview/DefaultView.aspx?id=OP_TAC_7186__000001_NE455AA,0,0,yes
Specs 4 You,OP_5D7_14196__000002_NE17YB,OPT,Unit 9,Denton Park Shopping Centre,West Denton Way,Newcastle Upon Tyne,,NE5 2QZ,Tel: 0191 264 6770, - ,,,No ratings yet Rate it yourself - /Services/opticians/LeaveReview/DefaultView.aspx?id=OP_5D7_14196__000002_NE17YB,0,0,
Stevens Optical Group,OP_5D8_13483__000002_NE126YT,OPT,Unit 22,The Killingworth Centre,Killingworth,Newcastle Upon Tyne,,NE12 6YT,Tel: 0191 268 1317, - ,,,No ratings yet Rate it yourself - /Services/opticians/LeaveReview/DefaultView.aspx?id=OP_5D8_13483__000002_NE126YT,0,0,
Specsavers Opticians (Killingworth),TP85D ,OPT,,"Unit 37, The Killingworth Centre",,"Killingworth, Newcastle Upon Tyne ",,NE12 6YT,, - ,,,2 ratings Rate it yourself - /Services/opticians/LeaveReview/DefaultView.aspx?id=TP85D ,,,
Keyes Eyecare,OP_5D7_14439__000002_NE34XN,OPT,1-3 Ashburton Road,.,Gosforth,Newcastle Upon Tyne,,NE3 4XN,Tel: 0191 284 7361, - ,,,3 ratings Rate it yourself - /Services/opticians/LeaveReview/DefaultView.aspx?id=OP_5D7_14439__000002_NE34XN,,,
King & Wood,OP_5D7_9414__000001_NE31HA,OPT,Records at Keyes Eyecare,1-3 Ashburton Road,Gosforth,Newcastle Upon Tyne,,NE3 4XN,Tel: 0191 2847361, - ,,,No ratings yet Rate it yourself - /Services/opticians/LeaveReview/DefaultView.aspx?id=OP_5D7_9414__000001_NE31HA,0,0,
Mark English Opticians,OP_5D7_10908__000001_NE32HH,OPT,228 High Street,,Gosforth,Newcastle Upon Tyne,,NE3 1HH,Tel: 0191 285 5930, - ,,,No ratings yet Rate it yourself - /Services/opticians/LeaveReview/DefaultView.aspx?id=OP_5D7_10908__000001_NE32HH,0,0,
Tynedale Eye Clinic,OP_TAC_9461__000001_NE425HJ,OPT,3 Front Street,,Prudhoe,Northumberland,Tyne and Wear,NE42 5HJ,Tel: 01661 835 353, - ,,,No ratings yet Rate it yourself - /Services/opticians/LeaveReview/DefaultView.aspx?id=OP_TAC_9461__000001_NE425HJ,0,0,
Evans & Fairbairn,TAC055__000002_NE425HN,OPT,23 Front Street,,Prudhoe,Northumberland,,NE42 5HN,Tel: 01661 832 564, - ,,,No ratings yet Rate it yourself - /Services/opticians/LeaveReview/DefaultView.aspx?id=TAC055__000002_NE425HN,0,0,
Concept Eye Clinic,OP_5D7_1182__000001_NE31HP,OPT,57 – 159 High Street,,,Newcastle Upon Tyne,,NE3 1HE,Tel: 0191 285 1603, - ,,,No ratings yet Rate it yourself - /Services/opticians/LeaveReview/DefaultView.aspx?id=OP_5D7_1182__000001_NE31HP,0,0,
B N Optical,NE40 4NB,OPT,,32 Main Street,,Crawcrook,,NE40 4NB,, - ,,,No ratings yet Rate it yourself - /Services/opticians/LeaveReview/DefaultView.aspx?id=NE40 4NB,0,0,
Thompson Opticians Ltd,OP_5D7_11345__000002_NE31JZ,OPT,,25 Gosforth Centre,Gosforth,Newcastle Upon Tyne,Tyne and Wear,NE3 1JZ,Tel: 0191 284 2538, - ,,,No ratings yet Rate it yourself - /Services/opticians/LeaveReview/DefaultView.aspx?id=OP_5D7_11345__000002_NE31JZ,0,0,
Vision Clinic,OP_5D7_ 001__000003_NE52UR,OPT,682 West Road,Denton,Newcastle Upon Tyne,Newcastle Upon Tyne,,NE5 2UR,Tel: 0191 274 5385, - ,,,No ratings yet Rate it yourself - /Services/opticians/LeaveReview/DefaultView.aspx?id=OP_5D7_ 001__000003_NE52UR,0,0,
Pennington Opticians,OP_TAC_6468__000001_NE461NA,OPT,22 Market Place,,Hexham,Northumberland,,NE46 3NX,Tel: 01434 600 376, - ,,,No ratings yet Rate it yourself - /Services/opticians/LeaveReview/DefaultView.aspx?id=OP_TAC_6468__000001_NE461NA,0,0,
Geoff Steven & Son,OP_TAC_9486__000001_NE461XG,OPT,,10 Market Place,,Hexham,Northumberland,NE46 1XG,Tel: 01434 603 862, - ,,,No ratings yet Rate it yourself - /Services/opticians/LeaveReview/DefaultView.aspx?id=OP_TAC_9486__000001_NE461XG,0,0,
Specsavers Opticians,OP_TAC_4667__000001_NE461LZ,OPT,30 Fore Street,,Hexham,Northumberland,,NE46 1LZ,Tel: 01434 600 222, - ,,,1 rating Rate it yourself - /Services/opticians/LeaveReview/DefaultView.aspx?id=OP_TAC_4667__000001_NE461LZ,,,
Thompson Opticians Ltd,CO-1751,OPT,,1 Station Road,,Newcastle Upon Tyne,Tyne and Wear,NE12 7AR,Tel: 0191 2666449, - ,,,No ratings yet Rate it yourself - /Services/opticians/LeaveReview/DefaultView.aspx?id=CO-1751,0,0,
Optica Eye Clinic Ltd,OP_5D8_14191__000001_NE128GA,OPT,9b The Boulevard,West Farm Avenue,,Longbenton,,NE12 8GA,Tel: 0191 266 3339, - ,,,1 rating Rate it yourself - /Services/opticians/LeaveReview/DefaultView.aspx?id=OP_5D8_14191__000001_NE128GA,,,
Thompson Opticians,OP_5D8_5346__000001_NE129AD,OPT,20 Station Road North,,Forest Hall,Newcastle Upon Tyne,,NE12 9AD,Tel: 0191 266 2840, - ,,,No ratings yet Rate it yourself - /Services/opticians/LeaveReview/DefaultView.aspx?id=OP_5D8_5346__000001_NE129AD,0,0,
Dickinson Optician,OP_TAC_3961__000001_NE461BA,OPT,15 Battle Hill,,Hexham,Northumberland,,NE46 1BA,Tel: 01434 602 709, - ,,,No ratings yet Rate it yourself - /Services/opticians/LeaveReview/DefaultView.aspx?id=OP_TAC_3961__000001_NE461BA,0,0,
Thompson Opticians Ltd,OP_5D7_11344__000002_NE49RX,OPT,265 Two Ball Lonnen,,Fenham,Newcastle Upon Tyne,Tyne and Wear,NE4 9RX,Tel: 0191 274 3863, - ,,,No ratings yet Rate it yourself - /Services/opticians/LeaveReview/DefaultView.aspx?id=OP_5D7_11344__000002_NE49RX,0,0,
Four Lane Ends Opticians,OP_5D7_9143__000002_NE77EE,OPT,341 Benton Road,,Benton,Newcastle Upon Tyne,,NE7 7EE,Tel: 0191 266 3218, - ,,,No ratings yet Rate it yourself - /Services/opticians/LeaveReview/DefaultView.aspx?id=OP_5D7_9143__000002_NE77EE,0,0,
Outlook Optical Benton Limited,OP_5D8__000001_NE129SZ,OPT,20 North Tyne Industrial Estate,Whitley Road,Benton,Newcastle Upon Tyne,,NE12 9SZ,Tel: 0191 266 6924, - ,,,No ratings yet Rate it yourself - /Services/opticians/LeaveReview/DefaultView.aspx?id=OP_5D8__000001_NE129SZ,0,0,
Long & Pickard,OP_5D7_8704__000001_NE22DN,OPT,113 St Georges Terrace,,Jesmond,Newcastle Upon Tyne,,NE2 2DN,Tel: 0191 281 8810, - ,,,No ratings yet Rate it yourself - /Services/opticians/LeaveReview/DefaultView.aspx?id=OP_5D7_8704__000001_NE22DN,0,0,
B Braysher Optometrists,OP_5KF_13439__000002_NE215BT,OPT,23 Lower Precinct,,Blaydon,Gateshead,Tyne and Wear,NE21 5BT,Tel: 0191 414 3271, - ,,,No ratings yet Rate it yourself - /Services/opticians/LeaveReview/DefaultView.aspx?id=OP_5KF_13439__000002_NE215BT,0,0,yes
Asda Opticians,OPT_NE12 9SJ,OPT,,WHITLEY ROAD,,BENTON,,NE12 9SJ,Tel: 0191 2705720, - ,,,No ratings yet Rate it yourself - /Services/opticians/LeaveReview/DefaultView.aspx?id=OPT_NE12 9SJ,0,0,
Evans Opticians,OP_5D7_505__000001_NE22DJ,OPT,28 Acorn Road,,Jesmond,Newcastle Upon Tyne,,NE2 2DJ,Tel: 0191 281 4145, - ,,,2 ratings Rate it yourself - /Services/opticians/LeaveReview/DefaultView.aspx?id=OP_5D7_505__000001_NE22DJ,,,
The Glasses Factory,NE21 5BT,OPT,TGF Optics,Unit 37,The Precinct,Blaydon on Tyne,Tyne and Wear,NE21 5BT,Tel: 01914 147207, - ,,,2 ratings Rate it yourself - /Services/opticians/LeaveReview/DefaultView.aspx?id=NE21 5BT,,,
Spicker & Steen Ltd,OP_5D7_13482__000001_NE49PT,OPT,5 West Road,,Newcastle Upon Tyne,,,NE4 9PT,Tel: 0191 273 6014, - ,,,1 rating Rate it yourself - /Services/opticians/LeaveReview/DefaultView.aspx?id=OP_5D7_13482__000001_NE49PT,,,
Eyeworks Optical Limited,TP58Q,OPT,,"Unit 3, 38 Hepscott Drive, Beaumont Park",,Whitley Bay,,NE25 9XJ,, - ,,,No ratings yet Rate it yourself - /Services/opticians/LeaveReview/DefaultView.aspx?id=TP58Q,0,0,
Thompson Opticians Ltd,OP_5KF_6404__000001_NE216DD,OPT,18 The Garth,Front Street,Winlaton On Tyne,Winlaton,Tyne and Wear,NE21 6DD,Tel: 01665 600195, - ,,,No ratings yet Rate it yourself - /Services/opticians/LeaveReview/DefaultView.aspx?id=OP_5KF_6404__000001_NE216DD,0,0,
Thompson Opticians Ltd,OP_5D7_5876__000001_NE48BF,OPT,Unit 4 Adelaide Shopping Centre,Adelaide Terrace,Benwell,Newcastle Upon Tyne,Tyne and Wear,NE4 8BE,Tel: 0191 273 2663, - ,,,No ratings yet Rate it yourself - /Services/opticians/LeaveReview/DefaultView.aspx?id=OP_5D7_5876__000001_NE48BF,0,0,
C4 Sightcare-RVI,OP_5D7_2534__000001_NE14LP,OPT,"Eye Department,Royal Victoria Infirmary","Claremont Wing,Queen Victoria Road",Newcastle Upon Tyne,,,NE1 4LP,Tel: 0191 221 0934, - ,,,1 rating Rate it yourself - /Services/opticians/LeaveReview/DefaultView.aspx?id=OP_5D7_2534__000001_NE14LP,,,
Roger Pickard Optometrist,OP_5D8_4705__000001_NE263ND,OPT,,11 Ilfracombe Gardens,,Whitley Bay,Tyne and Wear,NE26 3ND,Tel: 0191 252 8975, - ,,,1 rating Rate it yourself - /Services/opticians/LeaveReview/DefaultView.aspx?id=OP_5D8_4705__000001_NE263ND,,,yes
Opticial Express,OP_12345_NE1 7XJ,OPT,18 Blackettbridge,intu Eldon Square,,Newcastle,Tyne and Wear,NE1 7XJ,Tel: 0800 023 2020, - ,,,No ratings yet Rate it yourself - /Services/opticians/LeaveReview/DefaultView.aspx?id=OP_12345_NE1 7XJ,0,0,
Specsavers Opticians,OP_5D7_1164__000001_NE17XG,OPT,10 Eldon Way,Eldon Square,,Newcastle Upon Tyne,Tyne and Wear,NE1 7XS,Tel: 0191 233 0077, - ,,,No ratings yet Rate it yourself - /Services/opticians/LeaveReview/DefaultView.aspx?id=OP_5D7_1164__000001_NE17XG,0,0,
N & J Robinson Optometrists,OP_5D8_3792__000001_NE258DP,OPT,64 Front Street,Monkseaton,Whitley Bay,Tyne and Wear,,NE25 8DP,Tel: 0191 251 6102, - ,,,No ratings yet Rate it yourself - /Services/opticians/LeaveReview/DefaultView.aspx?id=OP_5D8_3792__000001_NE258DP,0,0,
Boots-Newcastle Upon Tyne - Hotspur Way,OP_5D7_3240__000002_NE17XE,OPT,Hotspur Way,Eldon Square,,Newcastle Upon Tyne,Tyne and Wear,NE1 7XE,Tel: 0191 2612 475, - ,,,1 rating Rate it yourself - /Services/opticians/LeaveReview/DefaultView.aspx?id=OP_5D7_3240__000002_NE17XE,,,
G T Harvey & Partners Ltd,OP_5D7_56__000001_NE18JE,OPT,9 Saville Row,,Newcastle Upon Tyne,,,NE1 8JE,Tel: 0191 232 7615, - ,,,28 ratings Rate it yourself - /Services/opticians/LeaveReview/DefaultView.aspx?id=OP_5D7_56__000001_NE18JE,,,
Boots-Newcastle Upon Tyne - High Friars,OP_5D7_5387__000001_NE17XQ,OPT,23 High Friars,Eldon Square,,Newcastle-Upon-Tyne,Staffordshire,NE1 7XQ,Tel: 0191 232 6837, - ,,,No ratings yet Rate it yourself - /Services/opticians/LeaveReview/DefaultView.aspx?id=OP_5D7_5387__000001_NE17XQ,0,0,
Vision Express UK Ltd,OP_5D7_3169__000001_NE17DE,OPT,2 Northumberland Street,,Newcastle Upon Tyne,,,NE1 7DE,Tel: 0191 261 7622, - ,,,No ratings yet Rate it yourself - /Services/opticians/LeaveReview/DefaultView.aspx?id=OP_5D7_3169__000001_NE17DE,0,0,
C4 Sightcare,OP_5D7_3395__000001_NE16JE,OPT,Northumberland House,Princess Square,,Newcastle Upon Tyne,,NE1 8ER,Tel: 0191 232 1002, - ,,,No ratings yet Rate it yourself - /Services/opticians/LeaveReview/DefaultView.aspx?id=OP_5D7_3395__000001_NE16JE,0,0,
Querido and Davidson,OP_5D7_9832__000001_NE65LN,OPT,,196 Chillingham Road,Heaton,Newcastle Upon Tyne,Tyne and Wear,NE6 5LN,Tel: 0191 265 9898, - ,,,1 rating Rate it yourself - /Services/opticians/LeaveReview/DefaultView.aspx?id=OP_5D7_9832__000001_NE65LN,,,
Costco Wholesale UK Ltd,CO-1833-14,OPT,,Mandela Way,Off Handy Drive,Gateshead,Tyne and Wear,NE11 9DH,Tel: 0191 461 9812, - ,,,No ratings yet Rate it yourself - /Services/opticians/LeaveReview/DefaultView.aspx?id=CO-1833-14,0,0,
F Robson & Co,OP_5D7_5123__000001_NE16QG,OPT,16 Pilgrim Street,,Newcastle Upon Tyne,,,NE1 6QG,Tel: 0191 232 1631, - ,,,No ratings yet Rate it yourself - /Services/opticians/LeaveReview/DefaultView.aspx?id=OP_5D7_5123__000001_NE16QG,0,0,
Grey St. Opticians,OP_5D7^1975__000001_NE16EG,OPT,103 Grey Street,Central Exchange Buildings,Newcastle Upon Tyne,Newcastle Upon Tyne,,NE1 6EG,Tel: 0191 260 5450, - ,,,1 rating Rate it yourself - /Services/opticians/LeaveReview/DefaultView.aspx?id=OP_5D7^1975__000001_NE16EG,,,
Northern Optical Company Limited,OP_5D7_9676__000001_NE15QG,OPT,1-4 Grainger Market,,Newcastle Upon Tyne,,,NE1 5QG,Tel: 0191 232 7284, - ,,,No ratings yet Rate it yourself - /Services/opticians/LeaveReview/DefaultView.aspx?id=OP_5D7_9676__000001_NE15QG,0,0,
Boots-Gateshead - Metro Centre (in Boots UK),OP_5KF_6012__000002_NE119YQ,OPT,46-52 Metro Centre,,,Gateshead,,NE11 9YQ,Tel: 0191 4932459, - ,,,1 rating Rate it yourself - /Services/opticians/LeaveReview/DefaultView.aspx?id=OP_5KF_6012__000002_NE119YQ,,,
Vision Express,OP_5KF_12652__000001_NE119XX,OPT,81-83 Russell Way,Metrocentre,Gateshead,Tyne and Wear,,NE11 9XX,Tel: 0191 460 0644, - ,,,No ratings yet Rate it yourself - /Services/opticians/LeaveReview/DefaultView.aspx?id=OP_5KF_12652__000001_NE119XX,0,0,
Optical Express,NE11 9YP,OPT,,Unit 1.08 red mall,,Gateshead,,NE11 9YP,Tel: 01236 861 448, - ,,,No ratings yet Rate it yourself - /Services/opticians/LeaveReview/DefaultView.aspx?id=NE11 9YP,0,0,
OP & TOM,01-19825 NE1 1EN ,OPT,,8A High Bridge,,Newcastle,,NE1 1EN,Tel: 0191 2611426, - ,,,No ratings yet Rate it yourself - /Services/opticians/LeaveReview/DefaultView.aspx?id=01-19825 NE1 1EN,0,0,
CHEC NEWCASTLE,X5B1U,OPT,,"Unit 1.70-1, Metrocentre",,Gateshead,,NE11 9YG,, - ,,,No ratings yet Rate it yourself - /Services/opticians/LeaveReview/DefaultView.aspx?id=X5B1U,0,0,
Thompson Opticians Ltd,OP_5D8^01__000001_NE289PA,OPT,,Coastway Shopping Centre,Battle Hill Drive,Wallsend,Tyne and Wear,NE28 9PA,Tel: 0191 2638411, - ,,,No ratings yet Rate it yourself - /Services/opticians/LeaveReview/DefaultView.aspx?id=OP_5D8^01__000001_NE289PA,0,0,
Advanced Vision,OP_5D8_14190__000001_NE262TP,OPT,15 Park View,,Whitley Bay,Tyne and Wear,,NE26 2TP,Tel: 0191 252 1442, - ,,,No ratings yet Rate it yourself - /Services/opticians/LeaveReview/DefaultView.aspx?id=OP_5D8_14190__000001_NE262TP,0,0,
Opticial Express,OP_12345_NE1 1RF,OPT,5 St. Nicholas Street,,,Newcastle,Tyne and Wear,NE1 1RF,Tel: 0800 023 2020, - ,,,1 rating Rate it yourself - /Services/opticians/LeaveReview/DefaultView.aspx?id=OP_12345_NE1 1RF,,,
The Big Optician,OP_5D7_14441__000001_NE61JX,OPT,Stephen Street,,Byker,Newcastle Upon Tyne,,NE6 1JX,Tel: 0191 224 4555, - ,,,No ratings yet Rate it yourself - /Services/opticians/LeaveReview/DefaultView.aspx?id=OP_5D7_14441__000001_NE61JX,0,0,
Boots-Whitley Bay,OP_5D8_1456__000001_NE262TA,OPT,190 Whitley Road,,,Whitley Bay,Tyne and Wear,NE26 2TA,Tel: 0191 252 2525, - ,,,No ratings yet Rate it yourself - /Services/opticians/LeaveReview/DefaultView.aspx?id=OP_5D8_1456__000001_NE262TA,0,0,
Tynedale Eye Clinic,OP_5D7_9071__000001_NE61DL,OPT,110 - 112 Shields Road,,Byker,Newcastle Upon Tyne,,NE6 1DS,Tel: 0191 276 0242, - ,,,2 ratings Rate it yourself - /Services/opticians/LeaveReview/DefaultView.aspx?id=OP_5D7_9071__000001_NE61DL,,,
Steel & Varley (WR),OP_5D8_289__000003_NE262SY,OPT,209-211 Whitley Road,,Whitley Bay,Tyne and Wear,,NE26 2SY,Tel: 0191 252 3549, - ,,,No ratings yet Rate it yourself - /Services/opticians/LeaveReview/DefaultView.aspx?id=OP_5D8_289__000003_NE262SY,0,0,
Richardsons Opticians,OPL/01-25420/5D9,OPT,,"233 Shields Road, Byker",,Newcastle Upon Tyne,,NE6 1DQ,, - ,,,No ratings yet Rate it yourself - /Services/opticians/LeaveReview/DefaultView.aspx?id=OPL/01-25420/5D9,0,0,
Stewart Eyecare,OP_5KF_13442__000001_NE165JL,OPT,99 Front Street,,Whickham,Newcastle Upon Tyne,,NE16 4JL,Tel: 0191 488 2474, - ,,,No ratings yet Rate it yourself - /Services/opticians/LeaveReview/DefaultView.aspx?id=OP_5KF_13442__000001_NE165JL,0,0,
Specsavers,OP_5D8_1836__000001_NE288JA,OPT,9 High Street West,,Wallsend,Tyne and Wear,,NE28 8JA,Tel: 0191 262 5550, - ,,,No ratings yet Rate it yourself - /Services/opticians/LeaveReview/DefaultView.aspx?id=OP_5D8_1836__000001_NE288JA,0,0,
Thompson Opticians Ltd,OP_5D8_6424__000001_NE288PF,OPT,,33-35 High Street East,,Wallsend,Tyne and Wear,NE28 8PF,Tel: 01665 600195, - ,,,No ratings yet Rate it yourself - /Services/opticians/LeaveReview/DefaultView.aspx?id=OP_5D8_6424__000001_NE288PF,0,0,
Tesco Opticians,OP _5D8__000002_NE297UJ,OPT,North Shields Extra,Chirton,,North Shields,,NE29 7UJ,Tel: 0345 677 9513, - ,,,No ratings yet Rate it yourself - /Services/opticians/LeaveReview/DefaultView.aspx?id=OP _5D8__000002_NE297UJ,0,0,
The Optometric Centre Ltd,OP_5KF_3294__000001_NE81AS,OPT,225 High Street,,Gateshead,Tyne and Wear,,NE8 1AS,Tel: 0191 477 2389, - ,,,No ratings yet Rate it yourself - /Services/opticians/LeaveReview/DefaultView.aspx?id=OP_5KF_3294__000001_NE81AS,0,0,
Specsavers Opticians,OP _ 5KF__000002_NE81EE,OPT,37 Jackson Street,,Gateshead,Tyne and Wear,,NE8 1EE,Tel: 0191 478 8060, - ,,,No ratings yet Rate it yourself - /Services/opticians/LeaveReview/DefaultView.aspx?id=OP _ 5KF__000002_NE81EE,0,0,