Organisation Name,NACS Code,Organisation Type,Address1,Address2,Address3,Address4,Address5,PostCode,Telephone Number,Opening time,Value  (Opening time),Banding Classification  (Opening time),NHS.UK users rating,Value  (NHS.UK users rating),Banding Classification  (NHS.UK users rating),Car parking (Is there car parking at this organisation?)
M. A. Heylen,OP_5C9_13529__000001_N154HH,OPT,206 Philip Lane,Tottenham,London,,,N15 4HH,Tel: 020 8808 2522, - ,,,No ratings yet Rate it yourself - /Services/opticians/LeaveReview/DefaultView.aspx?id=OP_5C9_13529__000001_N154HH,0,0,
Green Lanes Eyecare Centre,OP_5C9_8166__000001_N41LA,OPT,20 Grand Parade,Green Lanes,London,London,,N4 1LA,Tel: 020 8802 9903, - ,,,2 ratings Rate it yourself - /Services/opticians/LeaveReview/DefaultView.aspx?id=OP_5C9_8166__000001_N41LA,,,
The Optical Shop,OP_5C1_13670__000001_N41HA,OPT,433 Green Lanes,Haringey,,London,,N4 1HA,Tel: 0208 340 1516, - ,,,No ratings yet Rate it yourself - /Services/opticians/LeaveReview/DefaultView.aspx?id=OP_5C1_13670__000001_N41HA,0,0,
CHARLES LEADSHAM OPTICIANS (MR J PLASKOW),OP_5C3_14554__000001_N166RA,OPT,202stamford Hill,London,,,,N16 6RA,Tel: 020 8800 3189, - ,,,No ratings yet Rate it yourself - /Services/opticians/LeaveReview/DefaultView.aspx?id=OP_5C3_14554__000001_N166RA,0,0,
SILVERMANS OPTICIANS,OP_5C3_13776__000001_E59AG,OPT,,176 Clapton Common,,London,Greater London,E5 9AG,Tel: 0208 211 7575, - ,,,No ratings yet Rate it yourself - /Services/opticians/LeaveReview/DefaultView.aspx?id=OP_5C3_13776__000001_E59AG,0,0,
"KAHAN, HENRY",10034__000002_NW119AS,OPT,,25 St Andrews Mews,,London,,N16 5HR,Tel: 020 8455 8883, - ,,,No ratings yet Rate it yourself - /Services/opticians/LeaveReview/DefaultView.aspx?id=10034__000002_NW119AS,0,0,
Eyecloud Opticians,TP9EX,OPT,,6 Turnpike Parade,,"Green Lanes, London",,N15 3EA,Tel: 020 8888 2022, - ,,,No ratings yet Rate it yourself - /Services/opticians/LeaveReview/DefaultView.aspx?id=TP9EX,0,0,
GAZZA VISUALEYES LTD,OP_5C3_14454__000001_N42HE,OPT,284 Green Lanes,London,London,,,N4 2HE,Tel: 020 8802 7513, - ,,,No ratings yet Rate it yourself - /Services/opticians/LeaveReview/DefaultView.aspx?id=OP_5C3_14454__000001_N42HE,0,0,
 Specsavers Opticians Tottenham,5C9_2332_N17 9SX,OPT,,"514 High Road, London, N17 9SX",,Tottenham,,N17 9SX,, - ,,,No ratings yet Rate it yourself - /Services/opticians/LeaveReview/DefaultView.aspx?id=5C9_2332_N17 9SX,0,0,
Hammonds Eye Practice,OP_5C9_1617__000001_N179SY,OPT,,546 HIGH ROAD,BRUCE GROVE,LONDON,Greater London,N17 9SY,Tel: 020 8808 3327, - ,,,3 ratings Rate it yourself - /Services/opticians/LeaveReview/DefaultView.aspx?id=OP_5C9_1617__000001_N179SY,,,
The Eye Pod,TP0YX,OPT,,560-568 High Road,,Tottenham,,N17 9TA,, - ,,,No ratings yet Rate it yourself - /Services/opticians/LeaveReview/DefaultView.aspx?id=TP0YX,0,0,
A Ray Eyecare,OP_5C9_5813__000001_N225DD,OPT,514 Lordship Lane,,,London,,N22 5DD,Tel: 020 8888 8715, - ,,,No ratings yet Rate it yourself - /Services/opticians/LeaveReview/DefaultView.aspx?id=OP_5C9_5813__000001_N225DD,0,0,
"AUSTIN, ANTONY OPTICIANS",OP_5C3_14460__000001_N165TR,OPT,74 Oldhill Street,,London,,,N16 6NA,Tel: 020 8211 7228, - ,,,No ratings yet Rate it yourself - /Services/opticians/LeaveReview/DefaultView.aspx?id=OP_5C3_14460__000001_N165TR,0,0,
Optique 20:20,OP_5C9_6495__000001_N226YD,OPT,Unit 22,88-96 High Road,Wood Green,London,,N22 6HE,Tel: 020 8889 2020, - ,,,No ratings yet Rate it yourself - /Services/opticians/LeaveReview/DefaultView.aspx?id=OP_5C9_6495__000001_N226YD,0,0,
Specsavers Opticians,OP_5C9_7140__000001_N226HE,OPT,88-96 High Road,Wood Green,London,,,N22 6YD,Tel: 020 8881 5000, - ,,,No ratings yet Rate it yourself - /Services/opticians/LeaveReview/DefaultView.aspx?id=OP_5C9_7140__000001_N226HE,0,0,
Stephen H Davis Optometrists,OP_5C3_14479__000002_N160AP,OPT,94 Stoke Newington Church St,,,London,,N16 0AP,Tel: 020 7254 8181, - ,,,4 ratings Rate it yourself - /Services/opticians/LeaveReview/DefaultView.aspx?id=OP_5C3_14479__000002_N160AP,,,
Boots-Wood Green - High Rd,OP_5C9_5302__000001_N226EB,OPT,148 High Road,Wood Green,London,London,,N22 6EB,Tel: 0208 888 3361, - ,,,1 rating Rate it yourself - /Services/opticians/LeaveReview/DefaultView.aspx?id=OP_5C9_5302__000001_N226EB,,,
Boots Opticians Ltd,OP_5C9_5693__000002_N226BA,OPT,137-139 High Road,,Wood Green,London,,N22 6BA,Tel: 0208 8818602, - ,,,1 rating Rate it yourself - /Services/opticians/LeaveReview/DefaultView.aspx?id=OP_5C9_5693__000002_N226BA,,,
ASKEW EYEWEAR (TONYA CAVANAGH),10013__000002_N160UL,OPT,195-197 Church Street,Stoke Newington,,London,,N16 0UL,Tel: 020 7249 6333, - ,,,3 ratings Rate it yourself - /Services/opticians/LeaveReview/DefaultView.aspx?id=10013__000002_N160UL,,,
Style Opticians,OP_5K8_769__000003_N43PX,OPT,135b Stroud Green Road,,London,,,N4 3PX,Tel: 0207 561 1300, - ,,,1 rating Rate it yourself - /Services/opticians/LeaveReview/DefaultView.aspx?id=OP_5K8_769__000003_N43PX,,,
Special Eyes Opticians Limited,OP_5K8_840__000002_N42DW,OPT,68 Blackstock Road,,,London,,N4 2DW,Tel: 0207 226 8316, - ,,,No ratings yet Rate it yourself - /Services/opticians/LeaveReview/DefaultView.aspx?id=OP_5K8_840__000002_N42DW,0,0,
EYEWEAR (MR ISLAM),10033__000001_N160PH,OPT,115 Stoke Newington High St,,London,,,N16 0PH,Tel: 020 7249 8647, - ,,,No ratings yet Rate it yourself - /Services/opticians/LeaveReview/DefaultView.aspx?id=10033__000001_N160PH,0,0,
Finsbury Eye Centre Opticians Limited,OP_5K8_9233__000001_N42HX,OPT,240e Seven Sisters Road,,London,,,N4 2HX,Tel: 020 7272 3358, - ,,,No ratings yet Rate it yourself - /Services/opticians/LeaveReview/DefaultView.aspx?id=OP_5K8_9233__000001_N42HX,0,0,
David Clulow Opticians,F85A113__000001_N89SU,OPT,40 The Broadway,Crouch End,London,,,N8 9SU,Tel: 020 8340 2325, - ,,,No ratings yet Rate it yourself - /Services/opticians/LeaveReview/DefaultView.aspx?id=F85A113__000001_N89SU,0,0,
C H Lim Ophthalmic Opticians,OP_5C9_398__000001_N88PR,OPT,16 Topsfield Parade,Tottenham Lane,London,,,N8 8PR,Tel: 020 8348 8615, - ,,,8 ratings Rate it yourself - /Services/opticians/LeaveReview/DefaultView.aspx?id=OP_5C9_398__000001_N88PR,,,
Specsavers Optcians,COL24435C9__000003_N88DU,OPT,33 The Broadway,Crouch End,London,,,N8 8DU,, - ,,,No ratings yet Rate it yourself - /Services/opticians/LeaveReview/DefaultView.aspx?id=COL24435C9__000003_N88DU,0,0,
K. J. Davies Opticians,P6D1Q,OPT,12 Priory Road,12 Priory Road,London,"Hornsey, London",,N8 7RD,Tel: 020 8341 4545, - ,,,No ratings yet Rate it yourself - /Services/opticians/LeaveReview/DefaultView.aspx?id=P6D1Q,0,0,
A View Opticians,OP_5C9_9782__000001_N88AA,OPT,6 Crouch End Hill,Hornsey,London,,,N8 8AA,Tel: 020 8340 3447, - ,,,1 rating Rate it yourself - /Services/opticians/LeaveReview/DefaultView.aspx?id=OP_5C9_9782__000001_N88AA,,,
D H Burns,OP_5C9_1611__000001_N170EY,OPT,830 High Road,Tottenham,London,,,N17 0EY,Tel: 020 8808 7910, - ,,,No ratings yet Rate it yourself - /Services/opticians/LeaveReview/DefaultView.aspx?id=OP_5C9_1611__000001_N170EY,0,0,
Egbentu Site Services trading as Clapton Opticians,10016__000001_E58BQ,OPT,,1 Station Parade,Upper Clapton Road,Hackney,,E5 8BD,Tel: 020 8806 7432, - ,,,No ratings yet Rate it yourself - /Services/opticians/LeaveReview/DefaultView.aspx?id=10016__000001_E58BQ,0,0,
Zac & Adam Eyecare,S6R4H,OPT,,163 Stoke Newington Road,,London,,N16 8PB,, - ,,,No ratings yet Rate it yourself - /Services/opticians/LeaveReview/DefaultView.aspx?id=S6R4H,0,0,
S. N. Trivedi,OP_5C9_8880__000001_N224JD,OPT,Cleveden House,455 High Road,London,,,N22 8JD,Tel: 020 8889 0818, - ,,,No ratings yet Rate it yourself - /Services/opticians/LeaveReview/DefaultView.aspx?id=OP_5C9_8880__000001_N224JD,0,0,
R H Wynne Ltd,OP_5K8_8621__000002_N76AE,OPT,106 Seven Sisters Road,,London,,,N7 6AE,Tel: 020 7607 3040, - ,,,1 rating Rate it yourself - /Services/opticians/LeaveReview/DefaultView.aspx?id=OP_5K8_8621__000002_N76AE,,,
Infocus Eye Care,OP_5C1_2928__000001_N182TW,OPT,89 Fore Street,Edmonton,London,Middx,,N18 2TW,Tel: 020 8807 2981, - ,,,No ratings yet Rate it yourself - /Services/opticians/LeaveReview/DefaultView.aspx?id=OP_5C1_2928__000001_N182TW,0,0,
Visionwise Opticians,OP_5NC34602__000001_E177BX,OPT,,27 High Street,London,Walthamstow,,E17 7AD,Tel: 020 8520 4105, - ,,,2 ratings Rate it yourself - /Services/opticians/LeaveReview/DefaultView.aspx?id=OP_5NC34602__000001_E177BX,,,
Ethics Eye Care Ltd,OP_5C1_3409__000002_N134TD,OPT,93 Green Lanes,Palmers Green,London,,,N13 4TD,Tel: 020 8889 1410, - ,,,1 rating Rate it yourself - /Services/opticians/LeaveReview/DefaultView.aspx?id=OP_5C1_3409__000002_N134TD,,,
Holloway Specsavers Opticians,OP_5K8_4977__000002_N76AJ,OPT,11 Seven Sisters Road,Holloway,London,,,N7 6AJ,Tel: 020 7263 6006, - ,,,9 ratings Rate it yourself - /Services/opticians/LeaveReview/DefaultView.aspx?id=OP_5K8_4977__000002_N76AJ,,,
Eyevalue Ltd,OP_5K8_2086__000001_N76PZ,OPT,460 Holloway Road,460 Holloway Road,,London,,N7 6HT,Tel: 020 7609 3323, - ,,,No ratings yet Rate it yourself - /Services/opticians/LeaveReview/DefaultView.aspx?id=OP_5K8_2086__000001_N76PZ,0,0,
EYES ONLY OPTICIANS (MR LATORE),10022__000002_E82PB,OPT,87 Kingsland High Street,,London,,,E8 2PB,Tel: 020 7241 6567, - ,,,No ratings yet Rate it yourself - /Services/opticians/LeaveReview/DefaultView.aspx?id=10022__000002_E82PB,0,0,
The Angel Opticians,OP_5C1_13557__000001_N182ND,OPT,188 Upper Fore Street,Edmonton,London	,,,N18 2JB,Tel: 0208 8078445, - ,,,No ratings yet Rate it yourself - /Services/opticians/LeaveReview/DefaultView.aspx?id=OP_5C1_13557__000001_N182ND,0,0,
NEW ERA OPTICAL,OP_5NC34586__000002_E177JY,OPT,114 High Street,Walthamstow,London,,,E17 7JY,Tel: 020 8509 1935, - ,,,No ratings yet Rate it yourself - /Services/opticians/LeaveReview/DefaultView.aspx?id=OP_5NC34586__000002_E177JY,0,0,
McANDREW OPTICIANS,OP_5NC34567__000001_E177JY,OPT,114b High Street,Walthamstow,London,,,E17 7JY,Tel: 020 8509 1935, - ,,,No ratings yet Rate it yourself - /Services/opticians/LeaveReview/DefaultView.aspx?id=OP_5NC34567__000001_E177JY,0,0,
Real Eyes Opticians,OP_5K8_10057__000002_N78DA,OPT,226 Holloway Road,,London,,,N7 8DA,Tel: 020 7607 8050, - ,,,No ratings yet Rate it yourself - /Services/opticians/LeaveReview/DefaultView.aspx?id=OP_5K8_10057__000002_N78DA,0,0,
SPECSAVERS,OP_5C3_14488__000001_E8,OPT,Unit 18a,Kingsland Shopping Centre,,Dalston,,E8 2LX,Tel: 020 7254 7664, - ,,,2 ratings Rate it yourself - /Services/opticians/LeaveReview/DefaultView.aspx?id=OP_5C3_14488__000001_E8,,,
Eyecloud Opticians,TP8F5,OPT,,15 Kingsland High Street,Dalston,London,,E8 2JS,Tel: 020 7923 1852, - ,,,1 rating Rate it yourself - /Services/opticians/LeaveReview/DefaultView.aspx?id=TP8F5,,,
Tesco Opticians,C/OL2453__000002_N183HF,OPT,Tesco Pharmacy,1 Glover Drive,Upper Edmonton,London,,N18 3HF,Tel: 0345 677 9691, - ,,,No ratings yet Rate it yourself - /Services/opticians/LeaveReview/DefaultView.aspx?id=C/OL2453__000002_N183HF,0,0,
Douglas & Tobin,OP_5K8_2993__000001_N193QS,OPT,3 St. Johns Way,,London,,,N19 3QS,Tel: 020 7272 1506, - ,,,No ratings yet Rate it yourself - /Services/opticians/LeaveReview/DefaultView.aspx?id=OP_5K8_2993__000001_N193QS,0,0,
Eyes on Call,OP_N182UP_29653,OPT,,35 Park Avenue,,Edmonton,,N18 2UP,Tel: 0800 047 0425, - ,,,No ratings yet Rate it yourself - /Services/opticians/LeaveReview/DefaultView.aspx?id=OP_N182UP_29653,0,0,
Rose Opticians,10038__000003_E50NS,OPT,27 Lower Clapton Road,27 Lower Clapton Road,London,London,,E5 0NS,Tel: 0208 985 1971, - ,,,4 ratings Rate it yourself - /Services/opticians/LeaveReview/DefaultView.aspx?id=10038__000003_E50NS,,,
Eye Fashions,L2H8W,OPT,,7 Palace Parade High Street,,Walthamstow,Greater London,E17 7BU,Tel: 02085205535, - ,,,No ratings yet Rate it yourself - /Services/opticians/LeaveReview/DefaultView.aspx?id=L2H8W,0,0,
Boots-Walthamstow,OP_5NC34577__000003_E177JR,OPT,2 Selbourne Walk,Town Centre Shopping Precinct.,,Walthamstow,,E17 7JR,Tel: 0208 509 3204, - ,,,No ratings yet Rate it yourself - /Services/opticians/LeaveReview/DefaultView.aspx?id=OP_5NC34577__000003_E177JR,0,0,
Fisheye Optometrists Ltd,OP_5K8_793__000001_N78JZ,OPT,75 Holloway Road,,London,,,N7 8JZ,, - ,,,No ratings yet Rate it yourself - /Services/opticians/LeaveReview/DefaultView.aspx?id=OP_5K8_793__000001_N78JZ,0,0,
SPECSAVERS{WALTHAMSTOW}LTD,OP_5NC34601__000001_E177BH,OPT,203 High Street,Walthamstow,London,,,E17 7BH,Tel: 020 8520 7200, - ,,,9 ratings Rate it yourself - /Services/opticians/LeaveReview/DefaultView.aspx?id=OP_5NC34601__000001_E177BH,,,
Specsavers Opticians,C/OL2438-5C9__000003_N101DJ,OPT,404 Muswell Hill Broadway,Muswell Hill,London,,,N10 1DJ,, - ,,,No ratings yet Rate it yourself - /Services/opticians/LeaveReview/DefaultView.aspx?id=C/OL2438-5C9__000003_N101DJ,0,0,
Otto Opticians,OP_5K8_10901__000001_N51RA,OPT,41 Holloway Road,Islington,London,Islington,,N7 8JP,Tel: 020 7700 7557, - ,,,No ratings yet Rate it yourself - /Services/opticians/LeaveReview/DefaultView.aspx?id=OP_5K8_10901__000001_N51RA,0,0,
Boots-London - Muswell Hill,OP_5C9_2574__000001_N101BS,OPT,450 Muswell Hill Broadway,,,London,,N10 1BS,Tel: 0208 883 1216, - ,,,2 ratings Rate it yourself - /Services/opticians/LeaveReview/DefaultView.aspx?id=OP_5C9_2574__000001_N101BS,,,
A. A. Baker Optometrists,OP_5C1_13559__000001_N112JA,OPT,157 Bowes Road,New Southgate,,London,,N11 2JA,Tel: 020 8889 1081, - ,,,1 rating Rate it yourself - /Services/opticians/LeaveReview/DefaultView.aspx?id=OP_5C1_13559__000001_N112JA,,,
Observatory - The Opticians,OP_5C9_1741__000001_N103RT,OPT,64 Muswell Hill Broadway,Muswell Hill,,London,,N10 3RT,Tel: 020 8444 0143, - ,,,No ratings yet Rate it yourself - /Services/opticians/LeaveReview/DefaultView.aspx?id=OP_5C9_1741__000001_N103RT,0,0,
H. R. Breakspear,OP_5C9_1310__000001_N101BX,OPT,343 Muswell Hill Broadway,Muswell Hill,London,,,N10 1BX,Tel: 020 8883 2183, - ,,,2 ratings Rate it yourself - /Services/opticians/LeaveReview/DefaultView.aspx?id=OP_5C9_1310__000001_N101BX,,,
Harley Bain Opticians Ltd,OP_5C1_13667__000001_N134TY,OPT,331 Green Lanes,Palmers Green,London,,,N13 4TY,Tel: 020 8882 6266, - ,,,No ratings yet Rate it yourself - /Services/opticians/LeaveReview/DefaultView.aspx?id=OP_5C1_13667__000001_N134TY,0,0,
SCRIVENS,OP_5NC34585__000001_E173AY,OPT,212 Hoe Street,,London,Walthamstow,,E17 3AY,Tel: 0208 520 3079, - ,,,No ratings yet Rate it yourself - /Services/opticians/LeaveReview/DefaultView.aspx?id=OP_5NC34585__000001_E173AY,0,0,
Specsavers,F85A0604__000001_N134JG,OPT,359 Green Lanes,Palmers Green,,London,,N13 4JG,Tel: 020 8920 3150, - ,,,No ratings yet Rate it yourself - /Services/opticians/LeaveReview/DefaultView.aspx?id=F85A0604__000001_N134JG,0,0,
InFocus Optometrists,TP5Y8,OPT,,62A Brooksby's Walk,,London,,E9 6DA,, - ,,,No ratings yet Rate it yourself - /Services/opticians/LeaveReview/DefaultView.aspx?id=TP5Y8,0,0,
Scrivens Opticians,OP_5C1_4544__000001_N135TW,OPT,,328 - 330 Green Lanes,Palmers Green,London,,N13 5TW,Tel: 020 8886 9092, - ,,,No ratings yet Rate it yourself - /Services/opticians/LeaveReview/DefaultView.aspx?id=OP_5C1_4544__000001_N135TW,0,0,
Boots-Hackney,10012__000001_E81HA,OPT,318 Mare Street,,Hackney,London,,E8 1HA,Tel: 0208 985 2850, - ,,,2 ratings Rate it yourself - /Services/opticians/LeaveReview/DefaultView.aspx?id=10012__000001_E81HA,,,
Eye London Opticians,TP1RK,OPT,,312 Mare Street,,Hackney,,E8 1HA,Tel: 0208 5331188, - ,,,No ratings yet Rate it yourself - /Services/opticians/LeaveReview/DefaultView.aspx?id=TP1RK,0,0,
Robert Linsky Optometrists Ltd,OP_5C9_4689__000001_N103HP,OPT,11 Fortis Green Road,Muswell Hill,London,London,,N10 3HP,Tel: 020 8883 6879, - ,,,5 ratings Rate it yourself - /Services/opticians/LeaveReview/DefaultView.aspx?id=OP_5C9_4689__000001_N103HP,,,
Robert Linsky,F4Y3L,OPT,,11 Fortis Green Road,,"Muswell Hill, London",Greater London,N10 3HP,Tel: 0208 8836879, - ,,,No ratings yet Rate it yourself - /Services/opticians/LeaveReview/DefaultView.aspx?id=F4Y3L,0,0,
P Leaning Optometrist,OP_5K7_5010__000003_N65JT,OPT,40 Highgate High Street,,,London,,N6 5JG,Tel: 020 8340 6228, - ,,,No ratings yet Rate it yourself - /Services/opticians/LeaveReview/DefaultView.aspx?id=OP_5K7_5010__000003_N65JT,0,0,
A View Opticians,OP_5K8__000001_N11RQ,OPT,203 Upper Street,,Islington,London,,N1 1RQ,Tel: 020 7359 6868, - ,,,7 ratings Rate it yourself - /Services/opticians/LeaveReview/DefaultView.aspx?id=OP_5K8__000001_N11RQ,,,
Costco Wholesale UK Ltd,CO-1833-7,OPT,,1 Shadbolt Avenue,Off Harbet Road,Chingford,,E4 8GP,Tel: 020 8501 9315, - ,,,No ratings yet Rate it yourself - /Services/opticians/LeaveReview/DefaultView.aspx?id=CO-1833-7,0,0,
LITEBLUE OPTICIANS (MR PATEL),10023__000002_E96AS,OPT,163 Homerton High Street,,London,,,E9 6AS,Tel: 020 8985 8244, - ,,,No ratings yet Rate it yourself - /Services/opticians/LeaveReview/DefaultView.aspx?id=10023__000002_E96AS,0,0,
PHILIPS OPTICIAL WORLD,OP_5NC34568__000004_E179AP,OPT,405 Hoe Street,Walthamstow,London,,,E17 9AP,Tel: 020 8520 5278, - ,,,No ratings yet Rate it yourself - /Services/opticians/LeaveReview/DefaultView.aspx?id=OP_5NC34568__000004_E179AP,0,0,
Budget Eyewear Ltd,OL/2455-5C1__000001_N90QU,OPT,11 South Mall,Edmonton Green Shopping Centre,Edmonton,,,N9 0QU,, - ,,,No ratings yet Rate it yourself - /Services/opticians/LeaveReview/DefaultView.aspx?id=OL/2455-5C1__000001_N90QU,0,0,
Infocus Optometrists,OP_5C3_12365__000005_E96QT,OPT,204 Well Street Hackney,,London,London,,E9 6QT,Tel: 0208 9850575, - ,,,No ratings yet Rate it yourself - /Services/opticians/LeaveReview/DefaultView.aspx?id=OP_5C3_12365__000005_E96QT,0,0,
Alfred Jay Opticians,OP_5C1_3426__000001_N90TY,OPT,5 The Concourse,Edmonton Green Shopping Centre,London,Edmonton Green,,N9 0TY,Tel: 020 8884 3870, - ,,,No ratings yet Rate it yourself - /Services/opticians/LeaveReview/DefaultView.aspx?id=OP_5C1_3426__000001_N90TY,0,0,
Scrivens Opticians,OP_5NC34594__000001_E106AJ,OPT,583 Lea Bridge Road,Leyton,London,London,,E10 6AJ,Tel: 020 8509 2467, - ,,,1 rating Rate it yourself - /Services/opticians/LeaveReview/DefaultView.aspx?id=OP_5NC34594__000001_E106AJ,,,
M.D. Cooper,OP_5C1_6138__000002_N99DP,OPT,1 Keats Parade,Church Street,London,Middx,,N9 9DP,Tel: 020 8807 5664, - ,,,No ratings yet Rate it yourself - /Services/opticians/LeaveReview/DefaultView.aspx?id=OP_5C1_6138__000002_N99DP,0,0,
OPTICAL WORLD,OP_5NC34589__000003_E107AA,OPT,853 High Road,Leyton,London,,,E10 7AA,Tel: 0208 539 9722, - ,,,No ratings yet Rate it yourself - /Services/opticians/LeaveReview/DefaultView.aspx?id=OP_5NC34589__000003_E107AA,0,0,
Scher & Marks,OP_5C1_2857__000001_N90EH,OPT,29 North Mall,Edmonton,,london,,N9 0EQ,Tel: 020 8807 2113, - ,,,7 ratings Rate it yourself - /Services/opticians/LeaveReview/DefaultView.aspx?id=OP_5C1_2857__000001_N90EH,,,
Specsavers Opticians,F85A120__000001_N90EJ,OPT,20 North Mall,Edmonton,London,London,,N9 0EJ,Tel: 020 8887 1300, - ,,,No ratings yet Rate it yourself - /Services/opticians/LeaveReview/DefaultView.aspx?id=F85A120__000001_N90EJ,0,0,
Essex Opticians,OP_5K8_4888__000002_N12SF,OPT,41 Essex Road,,London,,,N1 2SF,Tel: 020 7359 3816, - ,,,No ratings yet Rate it yourself - /Services/opticians/LeaveReview/DefaultView.aspx?id=OP_5K8_4888__000002_N12SF,0,0,
Olivier Opticians,OP_5C1_2658__000001_N111AA,OPT,355 Bowes Road,New Southgate,London,,,N11 1AA,Tel: 020 8368 5648, - ,,,No ratings yet Rate it yourself - /Services/opticians/LeaveReview/DefaultView.aspx?id=OP_5C1_2658__000001_N111AA,0,0,
Nicholas K Taylor,OP_5K7_6007__000001_NW52TH,OPT,308 Kentish Town,,London,,,NW5 2TH,Tel: 020 7485 2153, - ,,,No ratings yet Rate it yourself - /Services/opticians/LeaveReview/DefaultView.aspx?id=OP_5K7_6007__000001_NW52TH,0,0,
Cannon Hill Clinic,OP_5A9_13673__000003_N147HD,OPT,16 Cannon Hill,Southgate,London,,,N14 7HD,Tel: 020 8882 2131, - ,,,1 rating Rate it yourself - /Services/opticians/LeaveReview/DefaultView.aspx?id=OP_5A9_13673__000003_N147HD,,,
HOXTON OPTICIANS,OP_5C3_14492__000001_N15LH,OPT,186 Hoxton Street,London,London,,,N1 5LH,Tel: 020 7613 1981, - ,,,1 rating Rate it yourself - /Services/opticians/LeaveReview/DefaultView.aspx?id=OP_5C3_14492__000001_N15LH,,,
Eyelevel,OP_5K8_5085__000001_N10PN,OPT,37 Upper Street,,London,,,N1 0PN,Tel: 020 7354 9277, - ,,,No ratings yet Rate it yourself - /Services/opticians/LeaveReview/DefaultView.aspx?id=OP_5K8_5085__000001_N10PN,0,0,
Scrivens Opticians,OP_5K7_7423__000001_NW52JS,OPT,271 Kentish Town Road,271 Kentish Town Road,London,London,,NW5 2JS,Tel: 020 7485 2886, - ,,,46 ratings Rate it yourself - /Services/opticians/LeaveReview/DefaultView.aspx?id=OP_5K7_7423__000001_NW52JS,,,
Betterspecs Opticians,OP_5K7_8885__000002_NW52AE,OPT,210 Kentish Town Road,Camden,London,,,NW5 2AD,Tel: 020 7482 3859, - ,,,4 ratings Rate it yourself - /Services/opticians/LeaveReview/DefaultView.aspx?id=OP_5K7_8885__000002_NW52AE,,,
Clive H. Rosen,OP_5C1_13552__000001_N147AL,OPT,152 Morton Way,Southgate,London,,,N14 7AL,Tel: 020 8886 9331, - ,,,No ratings yet Rate it yourself - /Services/opticians/LeaveReview/DefaultView.aspx?id=OP_5C1_13552__000001_N147AL,0,0,
F & YM HYBEL,OP_5NC34582__000001_E173LX,OPT,153 Wood Street,Walthamstow,London,,,E17 3LX,Tel: 020 8520 3769, - ,,,No ratings yet Rate it yourself - /Services/opticians/LeaveReview/DefaultView.aspx?id=OP_5NC34582__000001_E173LX,0,0,
David Clulow,OP_5K8_790__000001_N10PQ,OPT,25 Upper Street,,London,,,N1 0PQ,Tel: 020 7704 0010, - ,,,No ratings yet Rate it yourself - /Services/opticians/LeaveReview/DefaultView.aspx?id=OP_5K8_790__000001_N10PQ,0,0,
VISION EXPRESS (UK)LTD,OP 5K8__000002_N10PQ,OPT,23-24 Upper Street,Islington,London,,,N1 0PQ,Tel: 0207 354 0057, - ,,,No ratings yet Rate it yourself - /Services/opticians/LeaveReview/DefaultView.aspx?id=OP 5K8__000002_N10PQ,0,0,
Panoptica,OP_5A9_10056__000001_N29PN,OPT,56 High Road,East Finchley,London,,,N2 9PN,Tel: 020 8883 6693, - ,,,No ratings yet Rate it yourself - /Services/opticians/LeaveReview/DefaultView.aspx?id=OP_5A9_10056__000001_N29PN,0,0,
PATEL OPTICIANS,10100__000002_E111EA,OPT,49 Hainault Road,Leytonstone,London,,,E11 1EA,Tel: 020 8539 2535, - ,,,No ratings yet Rate it yourself - /Services/opticians/LeaveReview/DefaultView.aspx?id=10100__000002_E111EA,0,0,
Krishna Vision,OP_5A9_13599__000001_N113EG,OPT,53 Friern Barnet Road,New Southgate,London,,,N11 3EG,Tel: 020 8368 0924, - ,,,No ratings yet Rate it yourself - /Services/opticians/LeaveReview/DefaultView.aspx?id=OP_5A9_13599__000001_N113EG,0,0,
Stewart Duncan,OP_5A9_4396__000002_N29ED,OPT,126 High Road,East Finchley,London,London,,N2 9ED,Tel: 020 8883 2020, - ,,,2 ratings Rate it yourself - /Services/opticians/LeaveReview/DefaultView.aspx?id=OP_5A9_4396__000002_N29ED,,,
Tesco Opticians,OP-5A9-13605__000001_N120SH,OPT,North Circular Road,North Finchley,,London,,N12 0SH,Tel: 0345 677 9171, - ,,,No ratings yet Rate it yourself - /Services/opticians/LeaveReview/DefaultView.aspx?id=OP-5A9-13605__000001_N120SH,0,0,
Scrivens Opticians,E10 5PW_56347,OPT,,262 High Road,,London,,E10 5PW,Tel: 0208 5396784, - ,,,No ratings yet Rate it yourself - /Services/opticians/LeaveReview/DefaultView.aspx?id=E10 5PW_56347,0,0,
Globe Opticians,OP_N17QP_30664,OPT,,100 Murray Grove,,London,,N1 7QP,Tel: 020 7253 6769, - ,,,No ratings yet Rate it yourself - /Services/opticians/LeaveReview/DefaultView.aspx?id=OP_N17QP_30664,0,0,
Specsavers Islington,OP 5K8 6015__000003_N19ER,OPT,68 Chapel Market,Islington,London,,,N1 9ER,Tel: 020 7841 3030, - ,,,2 ratings Rate it yourself - /Services/opticians/LeaveReview/DefaultView.aspx?id=OP 5K8 6015__000003_N19ER,,,
Insight Opticians,OP_5K8_198__000001_N19EZ,OPT,24 Chapel Market,,London,,,N1 9EZ,Tel: 020 7278 1212, - ,,,No ratings yet Rate it yourself - /Services/opticians/LeaveReview/DefaultView.aspx?id=OP_5K8_198__000001_N19EZ,0,0,