Organisation Name,NACS Code,Organisation Type,Address1,Address2,Address3,Address4,Address5,PostCode,Telephone Number,Opening time,Value  (Opening time),Banding Classification  (Opening time),NHS.UK users rating,Value  (NHS.UK users rating),Banding Classification  (NHS.UK users rating),Car parking (Is there car parking at this organisation?)
Boots-Princes Risborough,OP_5DP_236__000001_HP270AT,OPT,23 Duke Street,,,Princes Risborough,Buckinghamshire,HP27 0AT,Tel: 01844 344374, - ,,,No ratings yet Rate it yourself - /Services/opticians/LeaveReview/DefaultView.aspx?id=OP_5DP_236__000001_HP270AT,0,0,
Chilton Watson Ltd,OP_5DP_267__000001_HP170AE,OPT,51 High Street,,,Princes Risborough,Buckinghamshire,HP27 0AE,Tel: 01844 345674, - ,,,No ratings yet Rate it yourself - /Services/opticians/LeaveReview/DefaultView.aspx?id=OP_5DP_267__000001_HP170AE,0,0,
Aylesbury V.E. Limited,,OPT,,Friars Square Shopping Centre,,Aylesbury,,HP20 2SP,Tel: 01296 338 560, - ,,,N/A - Data not available,,,
Fairford Eyes Ltd,OP_5DP_219__000004_HP197HL,OPT,52 Wedgewood Street,Fairford Leys,Aylesbury,Buckinghamshire,,HP19 7HL,Tel: 01296 399775, - ,,,No ratings yet Rate it yourself - /Services/opticians/LeaveReview/DefaultView.aspx?id=OP_5DP_219__000004_HP197HL,0,0,
J Coad Ltd,OP_5DP_12091__000001_HP202HU,OPT,Portman House,9 George Street,,Aylesbury,Buckinghamshire,HP20 2HU,Tel: 01296 486228, - ,,,No ratings yet Rate it yourself - /Services/opticians/LeaveReview/DefaultView.aspx?id=OP_5DP_12091__000001_HP202HU,0,0,no
Boots-Aylesbury - Hale Leys,OP_5DP_21__000001_HP201SG,OPT,,4 Hale Leys Shopping Centre,High Street,Aylesbury,Buckinghamshire,HP20 1ST,Tel: 01296 426938, - ,,,No ratings yet Rate it yourself - /Services/opticians/LeaveReview/DefaultView.aspx?id=OP_5DP_21__000001_HP201SG,0,0,
Specsavers Opticians,OP_5DP_14310__000001_HP201SH,OPT,13-15 High Street,Aylesbury,Buckinghamshire,,,HP20 1SH,Tel: 01296 469 700, - ,,,No ratings yet Rate it yourself - /Services/opticians/LeaveReview/DefaultView.aspx?id=OP_5DP_14310__000001_HP201SH,0,0,
Susan Collier Ltd,OP_5G4_14307__000001_HP160NZ,OPT,The Geans,3 Wycombe Road,Prestwood,Buckinghamshire,,HP16 0NZ,Tel: 01494 866270, - ,,,No ratings yet Rate it yourself - /Services/opticians/LeaveReview/DefaultView.aspx?id=OP_5G4_14307__000001_HP160NZ,0,0,
F & S Opticians,OP_5DP_9903__000002_HP201RS,OPT,40a Cambridge Street,,Aylesbury,,,HP20 1RS,Tel: 01296 435677, - ,,,No ratings yet Rate it yourself - /Services/opticians/LeaveReview/DefaultView.aspx?id=OP_5DP_9903__000002_HP201RS,0,0,
Nu-Sight Opticians,OP_5DP_4409__000001_HP201RS,OPT,30 Cambridge Street,,,Aylesbury,Buckinghamshire,HP20 1RS,Tel: 01296 398941, - ,,,1 rating Rate it yourself - /Services/opticians/LeaveReview/DefaultView.aspx?id=OP_5DP_4409__000001_HP201RS,,,
Leigh Lewis Optometrists,OL01167875QD__000001_HP144TH,OPT,247 Main Road,,Walters Ash,Buckinghamshire,,HP14 4TH,Tel: 01494 564600, - ,,,No ratings yet Rate it yourself - /Services/opticians/LeaveReview/DefaultView.aspx?id=OL01167875QD__000001_HP144TH,0,0,
Vision Express,OP_HP198BU_46733,OPT,,"Tesco Express, Broadfields Retail Park",,Aylesbury,Buckinghamshire,HP19 8BU,Tel: 0129 685 0228, - ,,,No ratings yet Rate it yourself - /Services/opticians/LeaveReview/DefaultView.aspx?id=OP_HP198BU_46733,0,0,
Robert Stanley Opticians,OP_5DP_14311__000004_OX92BL,OPT,22 Cornmarket,,Thame,Oxon,,OX9 2BL,Tel: 01844 261096, - ,,,No ratings yet Rate it yourself - /Services/opticians/LeaveReview/DefaultView.aspx?id=OP_5DP_14311__000004_OX92BL,0,0,
Thame Specsavers Limited,O9Q0Q,OPT,,109 High Street,,Thame,,OX9 3DZ,Tel: 01844 394765, - ,,,2 ratings Rate it yourself - /Services/opticians/LeaveReview/DefaultView.aspx?id=O9Q0Q,,,
Chiltern Opticians,OP_5G4_14306__000001_HP160AN,OPT,75 High Street,,Great Missenden,,,HP16 0AL,Tel: 01494 868496, - ,,,No ratings yet Rate it yourself - /Services/opticians/LeaveReview/DefaultView.aspx?id=OP_5G4_14306__000001_HP160AN,0,0,
Brian Clark Opticians,OP_5GW_8971__000001_HP234AF,OPT,110 High Street,,Tring,,,HP23 4AF,Tel: 01442 823034, - ,,,No ratings yet Rate it yourself - /Services/opticians/LeaveReview/DefaultView.aspx?id=OP_5GW_8971__000001_HP234AF,0,0,
The Practice Opticians,OP_5G5_14974__000001_HP157BS,OPT,26 Eastern Dene,Hazlemere,,High Wycombe,Buckinghamshire,HP15 7BS,Tel: 01494 716708, - ,,,No ratings yet Rate it yourself - /Services/opticians/LeaveReview/DefaultView.aspx?id=OP_5G5_14974__000001_HP157BS,0,0,
A R Salter,OP_5G5_5759__000001_HP112EL,OPT,65 Bridge Street,,High Wycombe,,,HP11 2EL,Tel: 01494 527130, - ,,,No ratings yet Rate it yourself - /Services/opticians/LeaveReview/DefaultView.aspx?id=OP_5G5_5759__000001_HP112EL,0,0,
M&S Opticians (High Wycombe),N9V1C,OPT,,"M&S, 1 Eden Place",The Eden Centre,High Wycombe,,HP11 2DH,Tel: 01494 321 717, - ,,,No ratings yet Rate it yourself - /Services/opticians/LeaveReview/DefaultView.aspx?id=N9V1C,0,0,
Redgate Opticians & Audiologists,TP8JG,OPT,,3-4 Queens Square,,High Wycombe,Buckinghamshire,HP11 2BP,Tel: 01494 258 690, - ,,,2 ratings Rate it yourself - /Services/opticians/LeaveReview/DefaultView.aspx?id=TP8JG,,,
High Wycombe VE Ltd,,OPT,,"Eden Shopping Centre, Newland Street",High Wycombe,Buckinghamshire,,HP11 2BY,Tel: 01494 473399, - ,,,N/A - Data not available,,,
Scrivens Opticians,OP_5G5_96__000002_HP112DF,OPT,,18 Queen Square,,High Wycombe,Buckinghamshire,HP11 2DF,Tel: 01494 526058, - ,,,No ratings yet Rate it yourself - /Services/opticians/LeaveReview/DefaultView.aspx?id=OP_5G5_96__000002_HP112DF,0,0,
Specsavers Opticians,OP_5G5_12596__000001_HP112DG,OPT,27/31 White Hart Street,,,High Wycombe,Buckinghamshire,HP11 2HL,Tel: 01494 520304, - ,,,No ratings yet Rate it yourself - /Services/opticians/LeaveReview/DefaultView.aspx?id=OP_5G5_12596__000001_HP112DG,0,0,
Boots-High Wycombe - Eden Walk (in Boots UK),OP_5G5_6341__000002_HP112HR,OPT,27 Eden Walk,,Eden Centre,High Wycombe,Buckinghamshire,HP11 2AU,Tel: 01494 459610, - ,,,2 ratings Rate it yourself - /Services/opticians/LeaveReview/DefaultView.aspx?id=OP_5G5_6341__000002_HP112HR,,,
David Williams ,HP11 1BA_22222,OPT,,7 Queen Victoria Road,,High Wycombe,,HP11 1BA,Tel: 01494 443448, - ,,,1 rating Rate it yourself - /Services/opticians/LeaveReview/DefaultView.aspx?id=HP11 1BA_22222,,,
Asda Opticians,OPT_HP124NU,OPT,,Holmers Farm Way,,High Wycombe,,HP12 4NU,Tel: 01494 899098, - ,,,No ratings yet Rate it yourself - /Services/opticians/LeaveReview/DefaultView.aspx?id=OPT_HP124NU,0,0,
Turner and Browning Opticians,OP_5G4_188__000002_HP51EP,OPT,4 High Street,,Chesham,,,HP5 1EP,Tel: 01494 782957, - ,,,No ratings yet Rate it yourself - /Services/opticians/LeaveReview/DefaultView.aspx?id=OP_5G4_188__000002_HP51EP,0,0,
Boots-Chesham,OLCO32345QD__000003_HP51EP,OPT,18 High Street,,,Chesham,Buckinghamshire,HP5 1EP,Tel: 01494 793498, - ,,,No ratings yet Rate it yourself - /Services/opticians/LeaveReview/DefaultView.aspx?id=OLCO32345QD__000003_HP51EP,0,0,
Ultimate Eyewear Company,OP_5G4_14972__000001_HP51BG,OPT,25a The High Street,,Chesham,,,HP5 1BG,Tel: 01494 794466, - ,,,1 rating Rate it yourself - /Services/opticians/LeaveReview/DefaultView.aspx?id=OP_5G4_14972__000001_HP51BG,,,
Specsavers Opticians,OP_5QD_0115899__000002_HP51BG,OPT,9 High Street,,Chesham,Buckinghamshire,,HP5 1BG,Tel: 01494 777190, - ,,,No ratings yet Rate it yourself - /Services/opticians/LeaveReview/DefaultView.aspx?id=OP_5QD_0115899__000002_HP51BG,0,0,
Brian D Suttie (Chesham) Ltd,OP_5G4_3082__000001_HP53DX,OPT,44 Broad Street,,Chesham,,,HP5 3DX,Tel: 01494 784141, - ,,,1 rating Rate it yourself - /Services/opticians/LeaveReview/DefaultView.aspx?id=OP_5G4_3082__000001_HP53DX,,,
One Vision Professional Eyecare,0126643_12082015,OPT,,"37 High Street, Amersham",,Buckinghamshire,,HP7 0DP,Tel: 01494 721421, - ,,,No ratings yet Rate it yourself - /Services/opticians/LeaveReview/DefaultView.aspx?id=0126643_12082015,0,0,
Specsavers (Amersham),,OPT,,51 Sycamore Road,,Amersham,,HP6 5EQ,Tel: 01494 418752, - ,,,N/A - Data not available,,,
Specsavers (Amersham),,OPT,,51 Sycamore Road,,Amersham,,HP6 5EQ,Tel: 01494 418752, - ,,,N/A - Data not available,,,
Boots Opticians,OP_5G4_1431__000001_HP65EQ,OPT,,69 Sycamore Road,,Amersham,Buckinghamshire,HP6 5EQ,Tel: 01494 728753, - ,,,2 ratings Rate it yourself - /Services/opticians/LeaveReview/DefaultView.aspx?id=OP_5G4_1431__000001_HP65EQ,,,
Chilton Watson Ltd,OP_5G4_14308__000003_HP65DR,OPT,85/87 Sycamore Road,Amersham,,Amersham,,HP6 5EJ,Tel: 01494 721795, - ,,,1 rating Rate it yourself - /Services/opticians/LeaveReview/DefaultView.aspx?id=OP_5G4_14308__000003_HP65DR,,,
Hill Vision,OPT_HP65BX_1,OPT,CrossEyes,53 Hill Avenue,,Amersham,Buckinghamshire,HP6 5BX,Tel: 01494 258586, - ,,,No ratings yet Rate it yourself - /Services/opticians/LeaveReview/DefaultView.aspx?id=OPT_HP65BX_1,0,0,
Ashton Opticians,OL124685G5__000001_HP109LS,OPT,1 Acorn House,12-16 Straight Bit,Flackwell Heath,High Wycombe,Buckinghamshire,HP10 9LS,Tel: 01628 530420, - ,,,1 rating Rate it yourself - /Services/opticians/LeaveReview/DefaultView.aspx?id=OL124685G5__000001_HP109LS,,,
Adams Opticians,OP_5GW_10912__000001_HP41AD,OPT,193 High Street,,Berkhamsted,,,HP4 1AD,Tel: 01442 865852, - ,,,No ratings yet Rate it yourself - /Services/opticians/LeaveReview/DefaultView.aspx?id=OP_5GW_10912__000001_HP41AD,0,0,
Boots-Berkhamstead,OP_5GW_9591__000002_HP41AG,OPT,,242 High Street,,Berkhamsted,,HP4 1AG,Tel: 01442 865911, - ,,,No ratings yet Rate it yourself - /Services/opticians/LeaveReview/DefaultView.aspx?id=OP_5GW_9591__000002_HP41AG,0,0,
David Paul,OP_5GW_7933__000003_HP41AG,OPT,236 High Street,,,Berkhamsted,,HP4 1AG,Tel: 01442 879303, - ,,,3 ratings Rate it yourself - /Services/opticians/LeaveReview/DefaultView.aspx?id=OP_5GW_7933__000003_HP41AG,,,
Posh Eyes,D-12688 ,OPT,Westbury House,52 French Laurence Way,,Oxford,Oxfordshire,OX44 7YF,Tel: 01865400384, - ,,,No ratings yet Rate it yourself - /Services/opticians/LeaveReview/DefaultView.aspx?id=D-12688,0,0,yes
S H Harrold (1937) Ltd,OP_5G4_3077__000001_HP91HQ,OPT,26 Gregories Road,,Beaconsfield,,,HP9 1HQ,Tel: 01494 672193, - ,,,No ratings yet Rate it yourself - /Services/opticians/LeaveReview/DefaultView.aspx?id=OP_5G4_3077__000001_HP91HQ,0,0,
Specsavers Opticians,TP9GH,OPT,,15-17 West Street,,Marlow,Buckinghamshire,SL7 2LS,Tel: 01628 957610, - ,,,No ratings yet Rate it yourself - /Services/opticians/LeaveReview/DefaultView.aspx?id=TP9GH,0,0,
Stewart-Robinson Opticians,OP_5G5_11132__000001_SL72LS,OPT,49 West Street,49 West Street,,Marlow,Buckinghamshire,SL7 2LS,Tel: 01628 482906, - ,,,No ratings yet Rate it yourself - /Services/opticians/LeaveReview/DefaultView.aspx?id=OP_5G5_11132__000001_SL72LS,0,0,
David Clulow Marlow,OP_SL71AW_46730,OPT,42 High Street,,,Marlow,Buckinghamshire,SL7 1AW,Tel: 01628 484544, - ,,,1 rating Rate it yourself - /Services/opticians/LeaveReview/DefaultView.aspx?id=OP_SL71AW_46730,,,
Boots-Beaconsfield,OP_5G4_13334__000001_HP91HH,OPT,25 Gregories Road,,,Beaconsfield,Buckinghamshire,HP9 1HH,Tel: 01494 673627, - ,,,No ratings yet Rate it yourself - /Services/opticians/LeaveReview/DefaultView.aspx?id=OP_5G4_13334__000001_HP91HH,0,0,
Leightons Insight,OP_5G5_14309__000002_SL71AB,OPT,,73 High Street,,Marlow,Buckinghamshire,SL7 1AE,Tel: 01628 477998, - ,,,No ratings yet Rate it yourself - /Services/opticians/LeaveReview/DefaultView.aspx?id=OP_5G5_14309__000002_SL71AB,0,0,
Boots-Marlow,OP_5G5_10586__000003_SL71AB,OPT,93 High Street,,,Marlow,Buckinghamshire,SL7 1AB,Tel: 01628 483 052, - ,,,No ratings yet Rate it yourself - /Services/opticians/LeaveReview/DefaultView.aspx?id=OP_5G5_10586__000003_SL71AB,0,0,
Michael Blackstone Optometrists,OP_5G4_13333__000001_HP91QQ,OPT,18 The Highway,Station Road,,Beaconsfield,Buckinghamshire,HP9 1QQ,Tel: 01494 673782, - ,,,No ratings yet Rate it yourself - /Services/opticians/LeaveReview/DefaultView.aspx?id=OP_5G4_13333__000001_HP91QQ,0,0,
Scrivens Opticians,OP_5G5_11089__000001_SL85SY,OPT,,20-24 The Parade,,Bourne End,Buckinghamshire,SL8 5SY,Tel: 01628 525999, - ,,,No ratings yet Rate it yourself - /Services/opticians/LeaveReview/DefaultView.aspx?id=OP_5G5_11089__000001_SL85SY,0,0,
Brian D Suttie Chalfont,L8Z0V,OPT,,14 Nightingales Corner,Little Chalfont,Amersham,Buckinghamshire,HP7 9PZ,Tel: 01494 762338, - ,,,No ratings yet Rate it yourself - /Services/opticians/LeaveReview/DefaultView.aspx?id=L8Z0V,0,0,
Brian Clark,OP_5DP_3224__000001_MK183HB,OPT,42 High Street,Winslow,Buckingham,,,MK18 3HB,Tel: 01296 712043, - ,,,No ratings yet Rate it yourself - /Services/opticians/LeaveReview/DefaultView.aspx?id=OP_5DP_3224__000001_MK183HB,0,0,
Brian Clark Opticians,OP_5GE_2973__000001_LU77EA,OPT,38 High Street,,Leighton Buzzard,Beds,,LU7 7EA,Tel: 01525 372238, - ,,,No ratings yet Rate it yourself - /Services/opticians/LeaveReview/DefaultView.aspx?id=OP_5GE_2973__000001_LU77EA,0,0,
Juma Opticians,OP_5P2_18__000002_LU71DN,OPT,3 High Street,,Leighton Buzzard,Bedfordshire,,LU7 1DN,, - ,,,No ratings yet Rate it yourself - /Services/opticians/LeaveReview/DefaultView.aspx?id=OP_5P2_18__000002_LU71DN,0,0,
Specsavers Opticians,OP_5GE___000001_LU71DH,OPT,18 Waterborne Walk,,Leighton Buzzard,Beds,,LU7 1DH,Tel: 01525 219030, - ,,,No ratings yet Rate it yourself - /Services/opticians/LeaveReview/DefaultView.aspx?id=OP_5GE___000001_LU71DH,0,0,
Allders Opticians,OP_5GE_11683__000002_LU77EU,OPT,1 Market Square,,Leighton Buzzard,Beds,,LU7 1EU,Tel: 01525 374191, - ,,,No ratings yet Rate it yourself - /Services/opticians/LeaveReview/DefaultView.aspx?id=OP_5GE_11683__000002_LU77EU,0,0,
D King Opticians ,OP_5GE_9067__000001_LU77EN,OPT,,2 North Street,,Leighton Buzzard,,LU7 1EN,Tel: 01525 850312, - ,,,No ratings yet Rate it yourself - /Services/opticians/LeaveReview/DefaultView.aspx?id=OP_5GE_9067__000001_LU77EN,0,0,
Thies Optometrists,OP_5GW_8916__000002_HP12QF,OPT,25 Stoneycroft,,Hemel Hempstead,,,HP1 2QF,Tel: 01442 264897, - ,,,No ratings yet Rate it yourself - /Services/opticians/LeaveReview/DefaultView.aspx?id=OP_5GW_8916__000002_HP12QF,0,0,
Boots-Henley On Thames,BOOTSHENLEY1,OPT,23 Duke Street,,,Henley On Thames,Oxfordshire,RG9 1UR,Tel: 01491 637763, - ,,,1 rating Rate it yourself - /Services/opticians/LeaveReview/DefaultView.aspx?id=BOOTSHENLEY1,,,
Bunker Opticians,OP_5DX_8715__000001_RG91AN,OPT,45 - 47 Duke Street,,Henley-on-Thames,,,RG9 1UR,Tel: 01491 412020, - ,,,No ratings yet Rate it yourself - /Services/opticians/LeaveReview/DefaultView.aspx?id=OP_5DX_8715__000001_RG91AN,0,0,
J E Landaw,OP_5GV_4631__000001_WD35NL,OPT,5 New Parade,Chorleywood,Rickmansworth,Hertfordshire,,WD3 5NJ,Tel: 01923 283494, - ,,,No ratings yet Rate it yourself - /Services/opticians/LeaveReview/DefaultView.aspx?id=OP_5GV_4631__000001_WD35NL,0,0,
Chorleywood Eye Centre,CO-5238,OPT,,47c Lower Road,,Chorleywood,,WD3 5LQ,Tel: 019238286434, - ,,,3 ratings Rate it yourself - /Services/opticians/LeaveReview/DefaultView.aspx?id=CO-5238,,,
Olivers Opticians Ltd,OP_5G4_2237__000001_SL99EA,OPT,2 Market Place,,,Chalfont St Peter,Buckinghamshire,SL9 9EA,Tel: 01753 890822, - ,,,No ratings yet Rate it yourself - /Services/opticians/LeaveReview/DefaultView.aspx?id=OP_5G4_2237__000001_SL99EA,0,0,
Heaton Caffin Optometrists,OP_SL99QQ_46731,OPT,33 St Peter's Court,,,Chalfont St Peter,Buckinghamshire,SL9 9QQ,Tel: 01753 886806, - ,,,No ratings yet Rate it yourself - /Services/opticians/LeaveReview/DefaultView.aspx?id=OP_SL99QQ_46731,0,0,
Thies Optometrists,OP_5GW_9617__000001_HP11EF,OPT,24 Bridge Street,,Hemel Hempstead,,,HP1 1EF,Tel: 01442 253858, - ,,,No ratings yet Rate it yourself - /Services/opticians/LeaveReview/DefaultView.aspx?id=OP_5GW_9617__000001_HP11EF,0,0,
Specsavers Opticians,OP_5GW_8295__000001_HP11DX,OPT,,252-254 Marlowes,,Hemel Hempstead,Hertfordshire,HP1 1BJ,Tel: 01442 212141, - ,,,2 ratings Rate it yourself - /Services/opticians/LeaveReview/DefaultView.aspx?id=OP_5GW_8295__000001_HP11DX,,,
Vision Express (UK) Ltd,OP_5GW_5968__000001_HP11DZ,OPT,Unit 34 The Marlowes Shopping Centre,Hemel Hempstead,Hertfordshire,,,HP1 1DZ,Tel: 01442 266535, - ,,,No ratings yet Rate it yourself - /Services/opticians/LeaveReview/DefaultView.aspx?id=OP_5GW_5968__000001_HP11DZ,0,0,
Boots-Hemel Hempstead - Marlowes (in BUK),OP_5GW_1780__000004_HP11BH,OPT,149 Marlowes,,,Hemel Hempstead,Hertfordshire,HP1 1BB,Tel: 01442 231774, - ,,,1 rating Rate it yourself - /Services/opticians/LeaveReview/DefaultView.aspx?id=OP_5GW_1780__000004_HP11BH,,,
Hemel Opticians,OP_5GW_3024__000002_HP11BB,OPT,143 Marlowes,Hemel Hempstead,Hertfordshire,,,HP1 1BB,Tel: 01442 240607, - ,,,No ratings yet Rate it yourself - /Services/opticians/LeaveReview/DefaultView.aspx?id=OP_5GW_3024__000002_HP11BB,0,0,
David Pressman Opticians,10072010__000002_HP11DX,OPT,Unit 52,Marlowes Centre,Hemel Hempstead,Hertfordshire,,HP1 1DX,Tel: 01442 255969, - ,,,No ratings yet Rate it yourself - /Services/opticians/LeaveReview/DefaultView.aspx?id=10072010__000002_HP11DX,0,0,
Boots-Wallingford,BOOTSWALLINGFORD1,OPT,1 Castle Street,,,Wallingford,Oxfordshire,OX10 8DL,Tel: 01491 833200, - ,,,2 ratings Rate it yourself - /Services/opticians/LeaveReview/DefaultView.aspx?id=BOOTSWALLINGFORD1,,,
Patricia Hayselden & Partners,OP_5DX_8466__000002_OX100EL,OPT,,60 St Mary's Street,,Wallingford,Oxfordshire,OX10 0EL,Tel: 01491 835466, - ,,,1 rating Rate it yourself - /Services/opticians/LeaveReview/DefaultView.aspx?id=OP_5DX_8466__000002_OX100EL,,,
Robert Stanley Opticians,OP_5DX_5409__000002_OX100AL,OPT,8 St. Martins Street,,,Wallingford,,OX10 0AL,Tel: 01491 837033, - ,,,No ratings yet Rate it yourself - /Services/opticians/LeaveReview/DefaultView.aspx?id=OP_5DX_5409__000002_OX100AL,0,0,
Boots-Maidenhead - High St (in Boots UK),OP_5G3_2047__000004_SL61PY,OPT,54-58 High Street,,,Maidenhead,Berkshire,SL6 1PY,Tel: 01628 782880, - ,,,2 ratings Rate it yourself - /Services/opticians/LeaveReview/DefaultView.aspx?id=OP_5G3_2047__000004_SL61PY,,,
Boots-Maidenhead - High St,OP_5G3_564__000003_SL61PY,OPT,,54/58 High Street,Maidenhead,Maidenhead,,SL6 1PY,Tel: 01628 674545, - ,,,1 rating Rate it yourself - /Services/opticians/LeaveReview/DefaultView.aspx?id=OP_5G3_564__000003_SL61PY,,,
Optico Opticians,OP_5G3_5994__000002_SL61PY,OPT,Optico Opticians,80 High Street,,Maidenhead,Berkshire,SL6 1PY,Tel: 01628 770607, - ,,,No ratings yet Rate it yourself - /Services/opticians/LeaveReview/DefaultView.aspx?id=OP_5G3_5994__000002_SL61PY,0,0,
Scrivens Opticians,OP_5G3_13127__000001_SL61JX,OPT,Scrivens Opticians,79 High Street,,Maidenhead,,SL6 1JX,Tel: 01628 624632, - ,,,No ratings yet Rate it yourself - /Services/opticians/LeaveReview/DefaultView.aspx?id=OP_5G3_13127__000001_SL61JX,0,0,
Insight Opticians,OP_SL61EF_34403,OPT,,91A High Street,,Maidenhead,,SL6 1JX,Tel: 01628 671908, - ,,,No ratings yet Rate it yourself - /Services/opticians/LeaveReview/DefaultView.aspx?id=OP_SL61EF_34403,0,0,
Specsavers Opticians,OP_5G3_7069__000002_SL61JX,OPT,85 High Street,Maidenhead,Berkshire,,,SL6 1JX,Tel: 01628 777 220, - ,,,No ratings yet Rate it yourself - /Services/opticians/LeaveReview/DefaultView.aspx?id=OP_5G3_7069__000002_SL61JX,0,0,
Vision Express,TP79L,OPT,,47 High Street,Nicholson Centre,Maidenhead,Berkshire,SL6 1QB,Tel: 01628 781180, - ,,,No ratings yet Rate it yourself - /Services/opticians/LeaveReview/DefaultView.aspx?id=TP79L,0,0,
Robert Stanley Opticians,OP_5DW_3703__000001_OX39HZ,OPT,137 London Road,Headington,,Oxford,,OX3 9HZ,Tel: 01865 766488, - ,,,3 ratings Rate it yourself - /Services/opticians/LeaveReview/DefaultView.aspx?id=OP_5DW_3703__000001_OX39HZ,,,
Boots-Gerrards Cross,OLCO27635G4__000002_SL98EF,OPT,52 Packhorse Road,,,Gerrards Cross,Buckinghamshire,SL9 8EF,Tel: 01753 279763, - ,,,No ratings yet Rate it yourself - /Services/opticians/LeaveReview/DefaultView.aspx?id=OLCO27635G4__000002_SL98EF,0,0,
Specsavers Opticians,TP9A1,OPT,,46/48 Packhorse Road,,Gerrards Cross,Buckinghamshire,SL9 8EF,Tel: 01753 278030, - ,,,No ratings yet Rate it yourself - /Services/opticians/LeaveReview/DefaultView.aspx?id=TP9A1,0,0,
Gardiners Opticians,OP_5DW_3921__000001_OX37RA,OPT,5 Manor Buildings,Osler Road,,Oxford,,OX3 7RA,Tel: 01865 761459, - ,,,No ratings yet Rate it yourself - /Services/opticians/LeaveReview/DefaultView.aspx?id=OP_5DW_3921__000001_OX37RA,0,0,
Chilton Watson Ltd,OP_5G4_1559__000001_SL98ES,OPT,3 Station Road,,,Gerrards Cross,Buckinghamshire,SL9 8ES,Tel: 01753 886306, - ,,,No ratings yet Rate it yourself - /Services/opticians/LeaveReview/DefaultView.aspx?id=OP_5G4_1559__000001_SL98ES,0,0,
Complete Community Care NW London Limited,COMPLETE COMMUNITYCARENWLONDONLIMITED1,OPT,,Unit 8 Shepherd's Court,111 High Street,Burnham,Buckinghamshire,SL1 7JZ,Tel: 01895 521 461, - ,,,No ratings yet Rate it yourself - /Services/opticians/LeaveReview/DefaultView.aspx?id=COMPLETE COMMUNITYCARENWLONDONLIMITED1,0,0,
A1 Optician Ltd,OP_HP39DD_85645,OPT,A1 Optician Ltd,24 Kingfisher Drive,,Hemel Hempstead,,HP3 9DD,Tel: 0800 023 4964, - ,,,13 ratings Rate it yourself - /Services/opticians/LeaveReview/DefaultView.aspx?id=OP_HP39DD_85645,,,
Adeyfield Eyecare,OP_5GW_13215__000001_HP24ET,OPT,88 Longlands,Adeyfields,Hemel Hempstead,,,HP2 4ET,Tel: 01442 240004, - ,,,No ratings yet Rate it yourself - /Services/opticians/LeaveReview/DefaultView.aspx?id=OP_5GW_13215__000001_HP24ET,0,0,
Walker & Campbell,OP_5G4_1382__000001_SL17JX,OPT,47 High Street,,Burnham,,,SL1 7JX,Tel: 01628 663055, - ,,,1 rating Rate it yourself - /Services/opticians/LeaveReview/DefaultView.aspx?id=OP_5G4_1382__000001_SL17JX,,,
Ideal Eyes ,OP_5DW_11455__000001_OX43XH,OPT,,130-131 Pound Way,Cowley,Oxford,Oxfordshire,OX4 3XH,Tel: 01865 749877, - ,,,No ratings yet Rate it yourself - /Services/opticians/LeaveReview/DefaultView.aspx?id=OP_5DW_11455__000001_OX43XH,0,0,
Adeyfield Eyecare,OP5M238__000003_HP24ET,OPT,2 The Queens Square,,Hemel Hempstead,Hertfordshire,,HP2 4ES,Tel: 01442 240004, - ,,,No ratings yet Rate it yourself - /Services/opticians/LeaveReview/DefaultView.aspx?id=OP5M238__000003_HP24ET,0,0,
Specsavers Opticians,OP_5DW_212__000001_OX43YA,OPT,119 Pound Way,Cowley,,Oxford,,OX4 3YA,Tel: 01865 773344, - ,,,9 ratings Rate it yourself - /Services/opticians/LeaveReview/DefaultView.aspx?id=OP_5DW_212__000001_OX43YA,,,
Realeyes Limited,OP_SL17JP_46732,OPT,,32 High Street,,Burnham,Buckinghamshire,SL1 7JP,Tel: 01628 559000, - ,,,No ratings yet Rate it yourself - /Services/opticians/LeaveReview/DefaultView.aspx?id=OP_SL17JP_46732,0,0,
Complete Community Care North London Limited,C8W5R,OPT,,36 Highbarns,,Hemel Hemstead,,HP3 8AF,Tel: 01442 910560, - ,,,No ratings yet Rate it yourself - /Services/opticians/LeaveReview/DefaultView.aspx?id=C8W5R,0,0,
Brown & Wenman Opticians,OP_5GE_980__000001_LU61SA,OPT,,18 Albion Street,,Dunstable,Bedfordshire,LU6 1SA,Tel: 01582 663770, - ,,,No ratings yet Rate it yourself - /Services/opticians/LeaveReview/DefaultView.aspx?id=OP_5GE_980__000001_LU61SA,0,0,yes
Optometry Department,OP_5DW_1905__000002_OX26HE,OPT,West Wing Lg1,John Radcliffe Hospital,Headington,Oxford,,OX3 9DU,Tel: 01865 234163, - ,,,No ratings yet Rate it yourself - /Services/opticians/LeaveReview/DefaultView.aspx?id=OP_5DW_1905__000002_OX26HE,0,0,
Allders Opticians,OP_5GE_10409__000001_LU61LA,OPT,42 High Street North,,Dunstable,Beds,,LU6 1LA,Tel: 01582 664815, - ,,,No ratings yet Rate it yourself - /Services/opticians/LeaveReview/DefaultView.aspx?id=OP_5GE_10409__000001_LU61LA,0,0,
Grant & Glass Opticians,OP_5GE_11812__000001_LU63SN,OPT,,5a Queensway,,Dunstable,,LU5 4DW,Tel: 01582 608449, - ,,,No ratings yet Rate it yourself - /Services/opticians/LeaveReview/DefaultView.aspx?id=OP_5GE_11812__000001_LU63SN,0,0,
Kings Langley Eyecare,01-22493,OPT,,12 High Street,,Kings Langley,,WD4 8BH,Tel: 01923 266132, - ,,,No ratings yet Rate it yourself - /Services/opticians/LeaveReview/DefaultView.aspx?id=01-22493,0,0,